{
  "data_set_description": {
    "collection_date": "November 2013",
    "creator": "Dr Jeremy Besnard, Dr Ivan Olier, Dr Noureddin Sadawi, Dr Larisa Soldatova, Dr Crina Grosan, Prof Ross King, Dr Richard Bickerton, Prof Andrew Hopkins and Dr Willem van Hoorn",
    "default_target_attribute": "pXC50",
    "description": "This dataset contains QSAR data (from ChEMBL version 17) showing activity values (unit is pseudo-pCI50) of several compounds on drug target ChEMBL_ID: CHEMBL1293249 (TID: 103682), and it has 122 rows and 43 features (not including molecule IDs and class feature: molecule_id and pXC50). The features represent Basic Molecular Descriptors which were generated from SMILES strings.  Missing value imputation was applied to this dataset (By choosing the Median).",
    "description_version": "1",
    "file_id": "3398518",
    "format": "ARFF",
    "id": "29652",
    "licence": "Public",
    "md5_checksum": "f8fb0cc4b04996307b62a02be2172f45",
    "minio_url": "https://data.openml.org/datasets/0002/29652/dataset_29652.pq",
    "name": "QSAR-DATASET-FOR-DRUG-TARGET-CHEMBL1293249",
    "original_data_url": "https://www.ebi.ac.uk/chembl/target/inspect/CHEMBL1293249",
    "parquet_url": "https://data.openml.org/datasets/0002/29652/dataset_29652.pq",
    "processing_date": "2018-10-04 01:32:43",
    "row_id_attribute": "molecule_id",
    "status": "deactivated",
    "tag": [
      "MetaQSAR",
      "study_13"
    ],
    "upload_date": "2016-07-15T03:02:13",
    "url": "https://api.openml.org/data/v1/download/3398518/QSAR-DATASET-FOR-DRUG-TARGET-CHEMBL1293249.arff",
    "version": "9",
    "visibility": "public"
  }
}