{
  "data_set_description": {
    "collection_date": "November 2013",
    "creator": "Dr Jeremy Besnard, Dr Ivan Olier, Dr Noureddin Sadawi, Dr Larisa Soldatova, Dr Crina Grosan, Prof Ross King, Dr Richard Bickerton, Prof Andrew Hopkins and Dr Willem van Hoorn",
    "default_target_attribute": "pXC50",
    "description": "This dataset contains QSAR data (from ChEMBL version 17) showing activity values (unit is pseudo-pCI50) of several compounds on drug target ChEMBL_ID: CHEMBL2060 (TID: 232), and it has 28 rows and 1139 features (not including molecule IDs and class feature: molecule_id and pXC50). The features represent Molecular Descriptors which were generated from SMILES strings. Missing value imputation was applied to this dataset (By choosing the Median).",
    "description_version": "1",
    "file_id": "3398090",
    "format": "ARFF",
    "id": "29640",
    "licence": "Public",
    "md5_checksum": "28b7cb1701069e9604118b9294123231",
    "minio_url": "https://data.openml.org/datasets/0002/29640/dataset_29640.pq",
    "name": "QSAR-DATASET-FOR-DRUG-TARGET-CHEMBL2060",
    "original_data_url": "https://www.ebi.ac.uk/chembl/target/inspect/CHEMBL2060",
    "parquet_url": "https://data.openml.org/datasets/0002/29640/dataset_29640.pq",
    "processing_date": "2018-10-04 01:31:15",
    "row_id_attribute": "molecule_id",
    "status": "deactivated",
    "tag": [
      "MetaQSAR",
      "study_13"
    ],
    "upload_date": "2016-07-15T03:00:23",
    "url": "https://api.openml.org/data/v1/download/3398090/QSAR-DATASET-FOR-DRUG-TARGET-CHEMBL2060.arff",
    "version": "11",
    "visibility": "public"
  }
}