"molecule_id","ATSC2i","ATSC4i","D.Dtr09","X3v","AAC","IC0","GATS1m","SpMax4_Bh.s.","Eta_L","X4v","X5v","GATS1e","PDI","X2v","SaaaC","GATS1s","ATSC1i","P_VSA_i_1","IAC","TIC0","SssCH2","Eig05_EA.dm.","CATS2D_02_DL","ATS2m","ZM2Mad","Eig04_EA.dm.","NdssC","C.034","SpMin5_Bh.s.","C.011","N.073","nPyrroles","Xindex","Eta_C","ATS1m","H.048","Eta_C_A","ATSC6s","Eig06_EA.dm.","nF","NsF","P_VSA_e_6","SpMax1_Bh.s.","DELS","SssssC","NaasN","C.028","C.043","F.084","N.075","NaaN","NaaS","nThiazoles","S.107","SaaN","SaaS","Eig04_EA.ed.","Eig10_AEA.dm.","NdO","O.058","SM13_AEA.dm.","N.072","pXC50"
{1 0.916,2 1.274,4 4.553,5 2.033,6 2.033,7 0.47,8 7.411,9 5.426,10 3.137,11 2.352,12 0.679,13 0.964,14 6.903,16 0.611,17 0.559,19 75.209,20 75.209,21 -0.978,22 0.452,24 4.172,25 219.762,26 0.577,27 3,29 0.205,33 0.395,34 22.061,35 3.7,37 0.849,38 203.329,40 1,41 1,42 14.96,43 8.201,44 53.955,49 1,57 8.113,58 1.532,59 3,60 3,61 8.113,62 2,63 7.921}
{0 CHEMBL130145,1 1.14,2 1.561,3 111.565,4 5.583,5 1.936,6 1.936,7 0.464,8 7.427,9 6.312,10 3.944,11 2.78,12 0.607,13 0.985,14 7.802,16 0.525,17 0.68,19 81.296,20 81.296,21 -0.948,22 1.113,23 1,24 4.27,25 256.295,26 1.277,27 5,28 1,29 0.581,30 1,31 1,32 1,33 0.352,34 26.474,35 3.769,36 1,37 0.913,38 259.778,39 0.503,40 1,41 1,42 14.96,43 8.201,44 68.746,45 -2.028,46 1,49 1,57 8.451,58 2.104,59 5,60 5,61 8.451,62 2,63 6.678}
{0 CHEMBL130174,1 0.927,2 1.194,3 90.409,4 5.328,5 1.824,6 1.824,7 0.459,8 7.403,9 5.454,10 3.75,11 2.451,12 0.632,13 1,14 6.82,16 0.508,17 0.544,19 67.488,20 67.488,21 -0.306,22 0.503,23 1,24 4.139,25 230.628,26 1.113,27 4,28 1,29 0.569,30 1,31 1,32 1,33 0.368,34 20.935,35 3.646,36 1,37 0.837,38 138.887,39 0.291,43 7.459,44 45.716,45 -1.731,46 1,57 8.106,58 1.386,59 4,60 4,61 8.106,62 2,63 7.284}
{0 CHEMBL130516,1 1.7,2 1.653,3 112.28,4 4.89,5 1.932,6 1.932,7 0.535,8 7.459,9 5.787,10 3.524,11 2.303,12 0.598,13 0.991,14 6.569,16 0.569,17 0.831,19 77.289,20 77.289,21 -0.784,22 1.113,23 1,24 4.154,25 227.188,26 1.72,27 4,28 1,29 0.576,30 1,31 1,32 1,33 0.332,34 22.149,35 3.622,36 1,37 0.791,38 229.967,39 0.503,40 3,41 3,42 44.88,43 8.513,44 72.413,45 -6.418,46 1,57 8.645,58 1.583,59 4,60 4,61 8.645,62 2,63 7.097}
{0 CHEMBL131150,1 0.724,2 0.832,3 58.33,4 3.387,5 1.816,6 1.816,7 0.585,8 7.403,9 3.724,10 2.487,11 1.505,12 0.666,13 0.96,14 4.347,16 0.521,17 0.44,19 49.044,20 49.044,21 -0.274,22 0.346,23 1,24 3.678,25 151.212,26 1.091,27 4,28 1,29 0.246,30 1,31 1,32 1,33 0.507,34 12.092,35 3.196,36 1,37 0.672,38 130.318,39 0.044,43 7.459,44 38.992,45 -1.64,46 1,57 6.237,58 0.783,59 4,60 4,61 6.237,62 2,63 6.553}
{0 CHEMBL131730,1 0.873,2 1.09,3 79.244,4 4.198,5 1.711,6 1.711,7 0.588,8 7.403,9 4.454,10 3.149,11 2.024,12 0.633,13 1.004,14 5.459,16 0.51,17 0.521,19 58.165,20 58.165,21 -0.317,22 0.346,23 1,24 3.88,25 185.878,26 1.091,27 4,28 1,29 0.253,30 1,31 1,32 1,33 0.395,34 15.376,35 3.421,36 1,37 0.669,38 123.048,39 0.044,43 7.459,44 43.731,45 -1.736,46 1,57 6.25,58 1,59 4,60 4,61 6.25,62 2,63 6.699}
{0 CHEMBL131906,1 1.012,2 1.274,3 92.712,4 4.589,5 1.727,6 1.727,7 0.654,8 7.403,9 5.032,10 3.348,11 2.225,12 0.696,13 1.002,14 6.116,16 0.571,17 0.62,19 67.341,20 67.341,21 -0.329,22 0.503,23 3,24 3.95,25 196.544,26 1.113,27 4,28 1,29 0.566,30 1,31 1,32 1,33 0.36,34 18.095,35 3.498,36 1,37 0.724,38 143.638,39 0.291,43 7.459,44 47.405,45 -1.738,46 1,57 6.996,58 1.034,59 4,60 4,61 6.996,62 2,63 6.854}
{0 CHEMBL132069,1 0.495,2 0.474,4 1.769,5 1.689,6 1.689,7 0.769,8 4.503,9 2.868,10 0.999,11 0.442,12 0.772,13 0.89,14 2.821,16 0.56,17 0.357,19 43.908,20 43.908,21 -0.047,23 2,24 3.173,25 82.002,26 0.2,27 2,28 1,29 0.501,31 1,32 1,33 0.656,34 8.202,35 2.901,36 1,37 0.586,38 16.401,43 7.435,44 19.25,57 2.772,58 -0.532,59 2,60 2,61 2.772,62 1,63 5}
{0 CHEMBL132245,1 1.014,2 1.271,3 93.577,4 4.735,5 1.662,6 1.662,7 0.644,8 7.403,9 5.336,10 3.488,11 2.259,12 0.617,13 0.99,14 6.175,16 0.499,17 0.601,19 66.46,20 66.46,21 0.336,22 0.346,23 1,24 3.931,25 192.545,26 1.091,27 4,28 1,29 0.597,30 1,31 1,32 1,33 0.35,34 18.713,35 3.495,36 1,37 0.749,38 113.442,39 0.044,43 7.459,44 43.985,45 -1.694,46 1,57 6.945,58 1.035,59 4,60 4,61 6.945,62 2,63 6.569}
{0 CHEMBL132299,1 0.674,2 0.767,3 62.593,4 2.886,5 1.718,6 1.718,7 0.703,8 6.351,9 3.857,10 1.984,11 1.258,12 0.731,13 0.898,14 3.951,16 0.617,17 0.425,19 49.808,20 49.808,21 0.087,23 1,24 3.504,25 118.803,26 0.225,27 3,28 1,29 0.301,31 1,32 1,33 0.539,34 11.871,35 3.107,36 1,37 0.698,38 103.432,43 7.474,44 31.659,46 1,57 5.141,58 0.331,59 3,60 3,61 5.141,62 1,63 5}
{0 CHEMBL132749,1 0.928,2 1.167,3 90.409,4 4.923,5 1.824,6 1.824,7 0.515,8 7.403,9 5.183,10 3.535,11 2.299,12 0.626,13 0.994,14 6.373,16 0.511,17 0.55,19 67.488,20 67.488,21 -0.412,22 0.503,23 1,24 4.014,25 208.422,26 1.113,27 4,28 1,29 0.569,30 1,31 1,32 1,33 0.368,34 19.27,35 3.545,36 1,37 0.771,38 159.024,39 0.291,43 7.459,44 48.297,45 -1.759,46 1,57 8.106,58 1.386,59 4,60 4,61 8.106,62 2,63 7.432}
{0 CHEMBL132846,1 1.041,2 1.393,3 96.742,4 5.105,5 1.958,6 1.958,7 0.456,8 7.413,9 5.645,10 3.696,11 2.496,12 0.617,13 1,14 7.026,16 0.517,17 0.618,19 72.454,20 72.454,21 -0.746,22 0.503,23 1,24 4.186,25 235.467,26 1.113,27 4,28 1,29 0.567,30 1,31 1,32 1,33 0.359,34 21.994,35 3.685,36 1,37 0.846,38 220.393,39 0.291,40 1,41 1,42 14.96,43 8.201,44 57.291,45 -1.852,46 1,49 1,57 8.216,58 1.532,59 4,60 4,61 8.216,62 2,63 7.347}
{0 CHEMBL133123,1 0.545,2 0.558,3 52.06,4 2.255,5 1.805,6 1.805,7 0.658,8 6.351,9 3.085,10 1.6,11 0.95,12 0.791,13 0.908,14 3.233,16 0.649,17 0.347,19 41.513,20 41.513,21 -0.333,23 1,24 3.393,25 104.306,26 0.145,27 3,28 1,31 1,32 1,33 0.567,34 8.815,35 2.99,36 1,37 0.588,38 85.986,43 7.475,44 29.71,46 1,57 4.957,58 0.005,59 3,60 3,61 4.957,62 1,63 5}
{0 CHEMBL133475,1 0.928,2 1.186,3 91.459,4 4.733,5 1.824,6 1.824,7 0.515,8 7.403,9 5.182,10 3.573,11 2.259,12 0.626,13 0.994,14 6.441,16 0.512,17 0.55,19 67.488,20 67.488,21 -0.363,22 0.503,23 1,24 4.014,25 205.47,26 1.113,27 4,28 1,29 0.567,30 1,31 1,32 1,33 0.364,34 19.088,35 3.545,36 1,37 0.764,38 154.574,39 0.291,43 7.459,44 47.859,45 -1.748,46 1,57 7.274,58 1.237,59 4,60 4,61 7.274,62 2,63 7.456}
{0 CHEMBL133662,1 0.814,2 1.025,3 96.199,4 4.562,5 1.864,6 1.864,7 0.504,8 6.351,9 5.138,10 3.026,11 2.045,12 0.695,13 0.949,14 6.207,16 0.616,17 0.49,19 67.098,20 67.098,21 -0.401,22 0.136,23 1,24 3.979,25 194.532,26 0.496,27 3,28 1,29 0.535,31 1,32 1,33 0.394,34 19.225,35 3.534,36 1,37 0.801,38 123.214,43 7.475,44 43.874,46 1,57 8.103,58 1.034,59 3,60 3,61 8.103,62 1,63 6.883}
{0 CHEMBL133721,1 1.078,2 1.417,3 107.63,4 5.091,5 1.704,6 1.704,7 0.642,8 7.403,9 5.757,10 3.695,11 2.412,12 0.73,13 0.961,14 6.552,16 0.533,17 0.665,19 76.671,20 76.671,21 -0.463,22 0.86,23 1,24 4.049,25 219.359,26 1.113,27 4,28 1,29 0.588,30 1,31 1,32 1,33 0.346,34 22.354,35 3.623,36 1,37 0.798,38 159.727,39 0.86,43 7.459,44 52.471,45 -1.788,46 1,57 8.395,58 1.577,59 4,60 4,61 8.395,62 2,63 6.456}
{0 CHEMBL133731,1 0.911,2 1.173,3 97.792,4 5.332,5 1.904,6 1.904,7 0.476,8 7.403,9 5.505,10 3.684,11 2.439,12 0.634,13 0.991,14 6.937,16 0.52,17 0.538,19 70.454,20 70.454,21 -0.444,22 0.503,23 1,24 4.112,25 230.941,26 1.113,27 4,28 1,29 0.561,30 1,31 1,32 1,33 0.355,34 21.31,35 3.624,36 1,37 0.82,38 168.702,39 0.291,43 7.459,44 51.762,45 -1.778,46 1,57 8.202,58 1.636,59 4,60 4,61 8.202,62 2,63 7.638}
{0 CHEMBL133737,1 0.458,2 0.41,4 1.547,5 1.742,6 1.742,7 0.776,8 4.823,9 2.557,10 0.944,11 0.348,12 0.838,13 0.871,14 2.639,16 0.694,17 0.324,19 40.068,20 40.068,21 -0.294,23 2,24 3.119,25 75.673,27 2,28 1,31 1,32 1,33 0.679,34 7.154,35 2.816,36 1,37 0.55,38 31.375,43 7.475,44 20.571,57 2.699,58 -1.081,59 2,60 2,61 2.699,62 1,63 5.301}
{0 CHEMBL133791,1 1.013,2 1.275,3 105.757,4 4.756,5 1.798,6 1.798,7 0.557,8 7.413,9 5.139,10 3.448,11 2.258,12 0.522,13 0.974,14 6.298,16 0.506,17 0.621,19 70.114,20 70.114,21 -0.569,22 1.113,23 1,24 4.029,25 213.53,26 1.72,27 4,28 1,29 0.571,30 1,31 1,32 1,33 0.339,34 18.994,35 3.582,36 1,37 0.703,38 187.413,39 0.503,43 7.815,44 59.298,45 -1.829,46 1,57 8.194,58 1.579,59 6,60 4,61 8.194,62 2,63 6.959}
{0 CHEMBL134018,1 1.039,2 1.352,3 96.742,4 4.847,5 1.958,6 1.958,7 0.497,8 7.413,9 5.374,10 3.522,11 2.335,12 0.615,13 0.994,14 6.546,16 0.522,17 0.622,19 72.454,20 72.454,21 -0.797,22 0.503,23 1,24 4.066,25 216.962,26 1.113,27 4,28 1,29 0.564,30 1,31 1,32 1,33 0.359,34 20.467,35 3.587,36 1,37 0.787,38 229.721,39 0.291,40 1,41 1,42 14.96,43 8.201,44 59.508,45 -1.868,46 1,49 1,57 8.216,58 1.533,59 4,60 4,61 8.216,62 2,63 7.387}
{0 CHEMBL134089,1 0.94,2 1.244,3 95.148,4 4.335,5 1.919,6 1.919,7 0.472,8 7.41,9 5.278,10 3.038,11 2.101,12 0.671,13 0.956,14 6.295,16 0.596,17 0.569,19 69.098,20 69.098,21 -0.703,22 0.136,23 1,24 4.062,25 199.059,26 0.496,27 3,28 1,29 0.54,31 1,32 1,33 0.399,34 19.886,35 3.6,36 1,37 0.829,38 177.244,40 1,41 1,42 14.96,43 8.201,44 49.21,46 1,49 1,57 8.094,58 1.033,59 3,60 3,61 8.094,62 1,63 6.783}
{0 CHEMBL134188,1 1.058,2 1.272,3 92.712,4 4.522,5 1.824,6 1.824,7 0.574,8 7.413,9 5.051,10 3.315,11 2.182,12 0.605,13 0.996,14 6.001,16 0.513,17 0.634,19 67.488,20 67.488,21 -0.48,22 0.503,23 1,24 3.963,25 198.621,26 1.113,27 4,28 1,29 0.56,30 1,31 1,32 1,33 0.36,34 18.204,35 3.505,36 1,37 0.728,38 180.208,39 0.291,40 1,41 1,42 14.96,43 8.201,44 53.921,45 -1.788,46 1,49 1,57 6.996,58 1.034,59 4,60 4,61 6.996,62 2,63 6.921}
{0 CHEMBL135624,1 0.881,2 1.118,3 102.056,4 4.825,5 1.829,6 1.829,7 0.518,8 6.351,9 5.638,10 3.198,11 2.19,12 0.683,13 0.946,14 6.541,16 0.605,17 0.53,19 71.341,20 71.341,21 -0.007,22 0.136,23 1,24 4.003,25 198.532,26 0.496,27 3,28 1,29 0.61,31 1,32 1,33 0.384,34 21.052,35 3.568,36 1,37 0.842,38 140.844,43 7.474,44 43.76,46 1,57 8.026,58 1.153,59 3,60 3,61 8.026,62 1,63 6.879}
{0 CHEMBL147900,1 0.712,2 0.677,4 2.215,5 1.694,6 1.694,7 0.771,8 6.351,9 3.979,10 1.306,11 0.828,12 0.679,13 0.883,14 3.62,16 0.624,17 0.474,19 52.503,20 52.503,21 0.838,23 3,24 3.338,25 88.728,27 2,29 0.218,33 0.53,34 11.385,35 3.051,37 0.67,38 63.892,40 1,41 1,42 14.96,43 8.201,44 28.884,49 1,57 4.964,58 0.15,59 2,60 2,61 4.964,62 1,63 4.027}
{0 CHEMBL152369,1 0.66,2 0.65,4 2.003,5 1.727,6 1.727,7 0.731,8 6.351,9 3.483,10 1.187,11 0.752,12 0.69,13 0.888,14 3.339,16 0.646,17 0.446,19 50.087,20 50.087,21 0.932,23 3,24 3.325,25 88.728,27 2,29 0.218,33 0.53,34 9.974,35 3.043,37 0.587,38 65.776,40 1,41 1,42 14.96,43 8.201,44 28.171,49 1,57 4.964,58 0.12,59 2,60 2,61 4.964,62 1,63 4.125}
{0 CHEMBL152373,1 0.551,2 0.596,4 2.532,5 1.727,6 1.727,7 0.502,8 4.746,9 3.885,10 1.451,11 1.091,12 0.755,13 0.899,14 4.255,16 0.687,17 0.366,19 50.087,20 50.087,21 1.185,23 3,24 3.636,25 114.082,27 2,29 0.218,33 0.53,34 11.817,35 3.259,37 0.695,38 37.081,43 7.477,44 20.58,57 4.964,58 0.115,59 2,60 2,61 4.964,62 1,63 4.004}
{0 CHEMBL152472,1 0.681,2 0.851,4 3.543,5 1.642,6 1.642,7 0.495,8 4.748,9 4.584,10 2.199,11 1.572,12 0.724,13 0.943,14 5.399,16 0.666,17 0.431,19 57.467,20 57.467,21 1.142,23 3,24 3.835,25 150.245,27 2,29 0.227,33 0.414,34 15.269,35 3.44,37 0.727,38 50.698,43 7.475,44 26.035,57 5.693,58 0.708,59 2,60 2,61 5.693,62 1,63 4.092}
{0 CHEMBL152549,1 0.701,2 0.853,4 2.944,5 1.49,6 1.49,7 0.786,8 4.755,9 3.992,10 1.928,11 1.201,12 0.731,13 0.935,14 4.342,16 0.663,17 0.449,19 52.167,20 52.167,21 1.179,23 3,24 3.501,25 114.981,27 2,29 0.228,33 0.424,34 12.211,35 3.204,37 0.611,38 48.606,43 7.475,44 24.611,57 3.926,58 0.455,59 2,60 2,61 3.926,62 1,63 4.056}
{0 CHEMBL152670,1 0.56,2 0.587,4 1.933,5 1.552,6 1.552,7 0.818,8 4.753,9 3.293,10 1.181,11 0.72,12 0.758,13 0.886,14 3.198,16 0.682,17 0.379,19 45.001,20 45.001,21 1.223,23 3,24 3.211,25 78.818,27 2,29 0.218,33 0.535,34 8.973,35 2.969,37 0.561,38 34.241,43 7.477,44 19.21,57 3.22,58 -0.278,59 2,60 2,61 3.22,62 1,63 4.137}
{0 CHEMBL152671,1 0.616,2 0.626,4 2.145,5 1.523,6 1.523,7 0.865,8 4.753,9 3.789,10 1.3,11 0.796,12 0.75,13 0.882,14 3.479,16 0.659,17 0.409,19 47.202,20 47.202,21 1.239,23 3,24 3.225,25 78.818,27 2,29 0.218,33 0.535,34 10.353,35 2.977,37 0.647,38 35.336,43 7.475,44 19.905,57 3.22,58 -0.041,59 2,60 2,61 3.22,62 1,63 4.108}
{0 CHEMBL152672,1 0.502,2 0.549,3 60.085,4 2.205,5 1.592,6 1.592,7 0.679,8 4.918,9 2.816,10 1.498,11 0.917,12 0.731,13 0.941,14 3.254,15 1.71,16 0.674,17 0.325,19 39.793,20 39.793,23 1,24 3.348,25 99.815,27 2,28 1,29 0.12,31 1,32 1,33 0.496,34 7.953,35 3.01,36 1,37 0.497,38 34.353,43 7.477,44 20.701,46 1,57 4.131,58 -0.307,59 2,60 2,61 4.131,63 4.432}
{0 CHEMBL152764,1 0.613,2 0.643,4 2.744,5 1.694,6 1.694,7 0.509,8 4.746,9 4.381,10 1.571,11 1.168,12 0.744,13 0.895,14 4.536,16 0.662,17 0.399,19 52.503,20 52.503,21 1.186,23 3,24 3.645,25 114.082,27 2,29 0.218,33 0.53,34 13.284,35 3.266,37 0.781,38 37.73,43 7.475,44 21.293,57 4.964,58 0.147,59 2,60 2,61 4.964,62 1,63 4.027}
{0 CHEMBL153098,1 0.861,2 1.085,4 3.562,5 1.516,6 1.516,7 0.818,8 4.624,9 4.974,10 2.297,11 1.526,12 0.894,13 0.903,14 5.086,16 0.774,17 0.581,19 68.226,20 68.226,21 1.136,23 4,24 3.712,25 147.843,26 0.86,27 1,29 0.577,33 0.41,34 17.558,35 3.427,37 0.732,38 52.362,43 7.429,44 28.317,57 6.118,58 0.99,59 1,60 1,61 6.118,62 1,63 4}
{0 CHEMBL153135,1 0.773,2 0.753,4 2.444,5 1.65,6 1.65,7 0.8,8 6.351,9 4.479,10 1.486,11 0.905,12 0.671,13 0.884,14 3.974,16 0.614,17 0.513,19 56.113,20 56.113,21 1.668,23 3,24 3.384,25 92.728,27 2,29 0.235,33 0.511,34 12.904,35 3.105,37 0.717,38 92.121,40 1,41 1,42 14.96,43 8.201,44 29.558,49 1,57 5.134,58 0.324,59 2,60 2,61 5.134,62 1,63 4.119}
{0 CHEMBL153285,1 0.706,2 0.872,3 71.55,4 3.52,5 1.503,6 1.503,7 0.709,8 4.76,9 3.961,10 2.551,11 1.627,12 0.695,13 0.974,14 4.686,16 0.632,17 0.423,19 49.604,20 49.604,21 1.392,23 1,24 3.615,25 135.978,27 2,29 0.228,33 0.414,34 12.513,35 3.243,37 0.626,38 48.298,43 7.475,44 25.991,57 5.14,58 0.671,59 2,60 2,61 5.14,62 1,63 4.022}
{0 CHEMBL155039,1 0.611,2 0.785,3 71.55,4 3.206,5 1.509,6 1.509,7 0.67,8 4.92,9 3.515,10 2.246,11 1.42,12 0.702,13 0.989,14 4.4,15 1.7,16 0.652,17 0.381,19 46.771,20 46.771,23 1,24 3.605,25 135.978,27 2,28 1,29 0.228,31 1,32 1,33 0.414,34 11.135,35 3.237,36 1,37 0.557,38 43.842,43 7.475,44 25.816,46 1,57 5.14,58 0.597,59 2,60 2,61 5.14,63 4.523}
{0 CHEMBL155275,1 0.811,2 0.93,4 3.015,5 1.642,6 1.642,7 0.715,8 6.351,9 4.182,10 1.934,11 1.233,12 0.66,13 0.936,14 4.483,16 0.623,17 0.52,19 57.467,20 57.467,21 0.889,23 3,24 3.587,25 124.891,27 2,29 0.227,33 0.414,34 13.288,35 3.263,37 0.633,38 77.111,40 1,41 1,42 14.96,43 8.201,44 33.921,49 1,57 5.693,58 0.714,59 2,60 2,61 5.693,62 1,63 4.056}
{0 CHEMBL157003,1 0.601,2 0.617,4 2.467,5 1.694,6 1.694,7 0.639,8 4.94,9 4.11,10 1.432,11 0.99,12 0.725,13 0.886,14 4.057,16 0.658,17 0.398,19 52.503,20 52.503,21 1.096,23 3,24 3.43,25 95.576,27 2,29 0.218,33 0.53,34 12.039,35 3.114,37 0.708,38 43.189,43 7.475,44 23.261,57 4.964,58 0.155,59 2,60 2,61 4.964,62 1,63 4.004}
{0 CHEMBL186124,1 0.72,2 0.971,3 78.885,4 3.69,5 1.564,6 1.564,7 0.589,8 4.883,9 4.286,10 2.802,11 1.857,12 0.716,13 0.984,14 5.436,15 2.024,16 0.689,17 0.433,19 54.735,20 54.735,21 0.698,23 1,24 3.722,25 143.747,27 1,28 1,29 0.301,31 1,32 1,33 0.389,34 14.417,35 3.344,36 1,37 0.687,38 32.869,43 7.474,44 18.047,46 1,57 5.752,58 0.651,59 1,60 1,61 5.752,63 4.854}
{0 CHEMBL188253,1 0.636,2 0.692,4 3.102,5 1.727,6 1.727,7 0.579,8 4.94,9 4.03,10 2.027,11 1.372,12 0.693,13 0.912,14 4.576,16 0.63,17 0.385,19 50.087,20 50.087,21 0.833,23 1,24 3.55,25 116.072,26 0.079,27 2,29 0.218,33 0.472,34 12.22,35 3.156,37 0.719,38 50.792,43 7.474,44 25.795,57 5.631,58 0.398,59 2,60 2,61 5.631,62 1,63 5.097}
{0 CHEMBL250450,1 1.062,2 1.396,4 5.238,5 1.545,6 1.545,7 0.789,8 6.49,9 7.459,10 3.511,11 2.354,12 1.089,13 0.807,14 7.446,16 1.087,17 0.668,19 81.883,20 81.883,21 -0.74,23 6,24 4.221,25 252.883,27 3,29 0.528,33 0.329,34 30.844,35 3.782,36 1,37 0.935,38 222.214,43 7.428,44 86.495,57 8.204,58 1.969,59 1,60 1,61 8.204,63 4.796}
{0 CHEMBL266497,1 0.754,2 0.847,4 3.078,5 1.88,6 1.88,7 0.604,8 4.807,9 3.777,10 2.268,11 1.51,12 0.694,13 0.978,14 4.053,16 0.535,17 0.462,19 48.873,20 48.873,21 0.591,23 2,24 3.605,25 133.131,26 0.725,27 2,29 0.109,30 1,33 0.485,34 11.384,35 3.151,37 0.67,38 115.557,40 1,41 1,42 14.96,43 8.201,44 32.539,45 -1.188,49 1,57 5.77,58 0.41,59 2,60 2,61 5.77,62 2,63 5.959}
{0 CHEMBL288748,1 1.058,2 1.42,3 95.947,4 4.569,5 2.036,6 2.036,7 0.567,8 7.474,9 5.171,10 3.655,11 2.364,12 0.618,13 0.986,14 6.675,15 -0.406,16 0.607,17 0.64,18 31.278,19 67.181,20 67.181,21 0.009,23 1,24 4.041,25 200.876,27 1,28 1,29 0.146,33 0.363,34 19.786,35 3.579,37 0.824,38 125.834,40 3,41 3,42 44.88,43 8.242,44 52.317,47 1,48 1,49 3,50 1,51 1,52 1,53 1,54 1,55 3.954,56 0.915,57 6.951,58 0.927,59 1,60 1,61 6.951,63 8.155}
{0 CHEMBL296769,1 1.112,2 1.339,3 95.137,4 4.034,5 2.085,6 2.085,7 0.637,8 7.475,9 5.02,10 2.796,11 1.827,12 0.659,13 0.927,14 5.667,15 -0.51,16 0.609,17 0.705,18 31.278,19 68.796,20 68.796,21 -0.412,24 3.9,25 175.719,27 2,28 1,29 0.367,33 0.435,34 18.176,35 3.462,37 0.826,38 156.991,40 3,41 3,42 44.88,43 8.242,44 55.415,47 1,48 1,49 3,50 1,51 1,52 1,53 1,54 1,55 3.803,56 0.835,57 6.751,58 0.927,59 2,60 2,61 6.751,62 1,63 7.886}
{0 CHEMBL296780,1 1.084,2 1.439,3 95.456,4 4.357,5 1.894,6 1.894,7 0.624,8 7.474,9 4.85,10 3.228,11 2.245,12 0.604,13 0.988,14 6.087,15 -0.314,16 0.596,17 0.656,18 31.278,19 62.491,20 62.491,21 0.254,23 1,24 3.935,25 184.117,27 1,28 1,29 0.218,33 0.349,34 17.283,35 3.495,37 0.751,38 102.834,40 3,41 3,42 44.88,43 8.242,44 47.641,47 1,48 1,49 3,50 1,51 1,52 1,53 1,54 1,55 3.969,56 0.97,57 7.025,58 0.927,59 1,60 1,61 7.025,63 7.42}
{0 CHEMBL297861,1 1.084,2 1.47,3 87.015,4 4.425,5 1.894,6 1.894,7 0.624,8 7.474,9 4.851,10 3.321,11 2.339,12 0.604,13 0.988,14 6.039,15 -0.382,16 0.595,17 0.656,18 31.278,19 62.491,20 62.491,21 0.071,23 1,24 3.935,25 185.117,27 1,28 1,29 0.169,33 0.376,34 17.745,35 3.495,37 0.772,38 135.852,40 3,41 3,42 44.88,43 8.242,44 48.869,47 1,48 1,49 3,50 1,51 1,52 1,53 1,54 1,55 3.966,56 0.929,57 6.755,58 0.927,59 1,60 1,61 6.755,63 7.721}
{0 CHEMBL334518,1 0.927,2 1.203,3 92.712,4 5.051,5 1.824,6 1.824,7 0.459,8 7.403,9 5.453,10 3.579,11 2.521,12 0.632,13 1,14 6.916,16 0.509,17 0.544,19 67.488,20 67.488,21 -0.282,22 0.503,23 1,24 4.139,25 223.975,26 1.113,27 4,28 1,29 0.567,30 1,31 1,32 1,33 0.36,34 20.391,35 3.646,36 1,37 0.816,38 143.324,39 0.291,43 7.459,44 45.369,45 -1.723,46 1,57 6.996,58 1.034,59 4,60 4,61 6.996,62 2,63 7.328}
{0 CHEMBL334830,1 1.041,2 1.393,3 96.742,4 5.105,5 1.958,6 1.958,7 0.456,8 7.413,9 5.645,10 3.696,11 2.496,12 0.617,13 1,14 7.026,16 0.517,17 0.618,19 72.454,20 72.454,21 -0.746,22 0.503,23 1,24 4.186,25 235.467,26 1.113,27 4,28 1,29 0.567,30 1,31 1,32 1,33 0.359,34 21.994,35 3.685,36 1,37 0.846,38 220.393,39 0.291,40 1,41 1,42 14.96,43 8.201,44 57.291,45 -1.852,46 1,49 1,57 8.216,58 1.532,59 4,60 4,61 8.216,62 2,63 7.824}
{0 CHEMBL334863,1 0.928,2 1.187,3 92.712,4 4.774,5 1.824,6 1.824,7 0.515,8 7.403,9 5.182,10 3.441,11 2.344,12 0.626,13 0.994,14 6.437,16 0.512,17 0.55,19 67.488,20 67.488,21 -0.333,22 0.503,23 1,24 4.014,25 205.47,26 1.113,27 4,28 1,29 0.564,30 1,31 1,32 1,33 0.36,34 18.957,35 3.545,36 1,37 0.758,38 152.364,39 0.291,43 7.459,44 47.586,45 -1.74,46 1,57 6.996,58 1.034,59 4,60 4,61 6.996,62 2,63 7.42}
{0 CHEMBL335004,1 0.927,2 1.203,3 91.459,4 4.991,5 1.824,6 1.824,7 0.459,8 7.403,9 5.453,10 3.807,11 2.377,12 0.632,13 1,14 6.92,16 0.509,17 0.544,19 67.488,20 67.488,21 -0.292,22 0.503,23 1,24 4.139,25 223.975,26 1.113,27 4,28 1,29 0.568,30 1,31 1,32 1,33 0.364,34 20.618,35 3.646,36 1,37 0.825,38 147.482,39 0.291,43 7.459,44 45.501,45 -1.726,46 1,57 7.274,58 1.235,59 4,60 4,61 7.274,62 2,63 7.432}
{0 CHEMBL335079,1 0.612,2 0.679,3 56.736,4 2.622,5 1.76,6 1.76,7 0.669,8 6.351,9 3.357,10 1.812,11 1.107,12 0.748,13 0.898,14 3.617,16 0.63,17 0.387,19 45.773,20 45.773,21 -0.321,23 1,24 3.463,25 114.803,26 0.225,27 3,28 1,29 0.026,31 1,32 1,33 0.572,34 10.324,35 3.054,36 1,37 0.645,38 82.229,43 7.475,44 31.605,46 1,57 4.987,58 0.022,59 3,60 3,61 4.987,62 1,63 5}
{0 CHEMBL335386,1 0.492,2 0.426,3 36.99,4 1.956,5 1.722,6 1.722,7 0.644,8 4.088,9 2.393,10 1.319,11 0.735,12 0.639,13 0.966,14 2.818,16 0.495,17 0.314,19 34.439,20 34.439,21 0.167,24 3.177,25 87.313,27 2,28 1,31 1,32 1,33 0.637,34 6.291,35 2.793,36 1,37 0.524,38 7.559,43 7.436,44 17.295,46 1,57 2.676,58 -1.034,59 2,60 2,61 2.676,62 1,63 5.125}
{0 CHEMBL335447,1 1.007,2 1.335,3 101.005,4 4.599,5 1.881,6 1.881,7 0.479,8 7.41,9 5.778,10 3.21,11 2.247,12 0.66,13 0.953,14 6.63,16 0.586,17 0.609,19 73.341,20 73.341,21 -0.351,22 0.136,23 1,24 4.085,25 203.059,26 0.496,27 3,28 1,29 0.626,31 1,32 1,33 0.388,34 21.733,35 3.631,36 1,37 0.869,38 194.932,40 1,41 1,42 14.96,43 8.201,44 49.163,46 1,49 1,57 8.023,58 1.153,59 3,60 3,61 8.023,62 1,63 6.095}
{0 CHEMBL335776,1 1.041,2 1.393,3 96.742,4 5.105,5 1.958,6 1.958,7 0.456,8 7.413,9 5.645,10 3.696,11 2.496,12 0.617,13 1,14 7.026,16 0.517,17 0.618,19 72.454,20 72.454,21 -0.746,22 0.503,23 1,24 4.186,25 235.467,26 1.113,27 4,28 1,29 0.567,30 1,31 1,32 1,33 0.359,34 21.994,35 3.685,36 1,37 0.846,38 220.393,39 0.291,40 1,41 1,42 14.96,43 8.201,44 57.291,45 -1.852,46 1,49 1,57 8.216,58 1.532,59 4,60 4,61 8.216,62 2,63 6.721}
{0 CHEMBL335972,1 1.02,2 1.395,3 101.006,4 5.779,5 2.035,6 2.035,7 0.456,8 7.413,9 6.219,10 4.379,11 3.029,12 0.632,13 1.003,14 7.951,16 0.523,17 0.6,19 75.289,20 75.289,21 -0.791,22 0.503,23 1,24 4.382,25 277.551,26 1.113,27 4,28 1,29 0.56,30 1,31 1,32 1,33 0.36,34 26.498,35 3.837,37 0.981,38 220.264,39 0.291,40 1,41 1,42 14.96,43 8.201,44 59.348,45 -1.908,46 1,49 1,57 8.457,58 1.804,59 4,60 4,61 8.457,62 2,63 7.398}
{0 CHEMBL335990,1 0.946,2 1.2,3 86.379,4 4.452,5 1.687,6 1.687,7 0.617,8 7.403,9 4.861,10 3.309,11 2.145,12 0.624,13 0.996,14 5.86,16 0.504,17 0.561,19 62.402,20 62.402,21 -0.252,22 0.503,23 1,24 3.904,25 188.711,26 1.113,27 4,28 1,29 0.569,30 1,31 1,32 1,33 0.371,34 17.013,35 3.458,36 1,37 0.709,38 138.32,39 0.291,43 7.459,44 43.832,45 -1.71,46 1,57 6.776,58 1.033,59 4,60 4,61 6.776,62 2,63 7.004}
{0 CHEMBL335991,1 1.012,2 1.314,3 92.712,4 4.73,5 1.662,6 1.662,7 0.644,8 7.403,9 5.214,10 3.419,11 2.315,12 0.617,13 0.99,14 6.36,16 0.506,17 0.601,19 66.46,20 66.46,21 -0.254,22 0.503,23 1,24 3.946,25 195.711,26 1.113,27 4,28 1,29 0.596,30 1,31 1,32 1,33 0.36,34 19.052,35 3.495,36 1,37 0.762,38 128.05,39 0.291,43 7.459,44 44.264,45 -1.714,46 1,57 6.996,58 1.034,59 4,60 4,61 6.996,62 2,63 7.284}
{0 CHEMBL336653,1 1.021,2 1.401,3 101.365,4 5.577,5 2.035,6 2.035,7 0.456,8 7.413,9 6.238,10 4.14,11 3.049,12 0.632,13 1.003,14 8.091,16 0.523,17 0.6,19 75.289,20 75.289,21 -0.784,22 0.503,23 1,24 4.368,25 271.839,26 1.113,27 4,28 1,29 0.566,30 1,31 1,32 1,33 0.358,34 26.212,35 3.837,36 1,37 0.971,38 215.661,39 0.291,40 1,41 1,42 14.96,43 8.201,44 59.156,45 -1.891,46 1,49 1,57 8.316,58 1.79,59 4,60 4,61 8.316,62 2,63 7}
{0 CHEMBL337084,1 0.656,2 0.708,3 53.653,4 3.04,5 1.851,6 1.851,7 0.575,8 7.403,9 3.452,10 2.244,11 1.321,12 0.708,13 0.978,14 3.961,16 0.536,17 0.401,19 44.413,20 44.413,21 -0.285,22 0.311,23 1,24 3.622,25 140.715,26 1.003,27 4,28 1,29 0.012,30 1,31 1,32 1,33 0.507,34 10.484,35 3.14,36 1,37 0.617,38 107.292,43 7.46,44 36.971,45 -1.649,46 1,57 6.126,58 0.74,59 4,60 4,61 6.126,62 2,63 6.201}
{0 CHEMBL337165,1 1.015,2 1.304,3 99.235,4 4.768,5 1.698,6 1.698,7 0.631,8 7.403,9 5.308,10 3.456,11 2.256,12 0.685,13 0.977,14 6.222,16 0.52,17 0.615,19 69.633,20 69.633,21 -0.325,22 0.86,23 1,24 3.979,25 203.369,26 1.113,27 4,28 1,29 0.586,30 1,31 1,32 1,33 0.348,34 19.393,35 3.544,36 1,37 0.746,38 142.958,39 0.503,43 7.459,44 47.67,45 -1.74,46 1,57 7.225,58 1.119,59 4,60 4,61 7.225,62 2,63 7.337}
{0 CHEMBL337464,1 0.806,2 0.983,3 72.904,4 3.223,5 1.641,6 1.641,7 0.766,8 6.351,9 4.807,10 2.362,11 1.469,12 0.71,13 0.888,14 4.856,16 0.615,17 0.502,19 57.419,20 57.419,21 0.084,23 1,24 3.613,25 131.136,26 0.225,27 3,28 1,29 0.469,31 1,32 1,33 0.535,34 16.052,35 3.207,36 1,37 0.845,38 94.873,43 7.474,44 33.912,46 1,57 5.141,58 0.691,59 3,60 3,61 5.141,62 1,63 5}
{0 CHEMBL337469,1 0.744,2 0.894,3 67.047,4 2.959,5 1.677,6 1.677,7 0.735,8 6.351,9 4.307,10 2.19,11 1.326,12 0.719,13 0.887,14 4.521,16 0.623,17 0.463,19 53.677,20 53.677,21 -0.322,23 1,24 3.576,25 127.136,26 0.225,27 3,28 1,29 0.469,31 1,32 1,33 0.562,34 14.355,35 3.158,36 1,37 0.797,38 71.017,43 7.475,44 33.989,46 1,57 4.99,58 0.556,59 3,60 3,61 4.99,62 1,63 5}
{0 CHEMBL337706,1 0.608,2 0.646,3 57.917,4 2.518,5 1.76,6 1.76,7 0.69,8 6.351,9 3.585,10 1.774,11 1.083,12 0.766,13 0.907,14 3.567,16 0.631,17 0.386,19 45.773,20 45.773,21 0.069,23 1,24 3.437,25 108.306,26 0.145,27 3,28 1,29 0.028,31 1,32 1,33 0.532,34 10.288,35 3.047,36 1,37 0.643,38 101.798,43 7.474,44 29.864,46 1,57 5.135,58 0.316,59 3,60 3,61 5.135,62 1,63 5}
{0 CHEMBL337903,1 1.078,2 1.411,3 109.673,4 5.057,5 1.704,6 1.704,7 0.642,8 7.403,9 5.757,10 3.704,11 2.411,12 0.73,13 0.961,14 6.564,16 0.533,17 0.665,19 76.671,20 76.671,21 -0.422,22 0.86,23 1,24 4.049,25 219.802,26 1.113,27 4,28 1,29 0.587,30 1,31 1,32 1,33 0.34,34 22.227,35 3.623,36 1,37 0.794,38 148.387,39 0.86,43 7.459,44 52.175,45 -1.777,46 1,57 8.592,58 1.646,59 4,60 4,61 8.592,62 2,63 6.959}
{0 CHEMBL341433,1 1.022,2 1.384,3 101.365,4 5.35,5 2.089,6 2.089,7 0.455,8 7.413,9 5.967,10 3.92,11 2.79,12 0.63,13 0.997,14 7.612,16 0.528,17 0.605,19 77.289,20 77.289,21 -0.849,22 0.503,23 1,24 4.27,25 252.717,26 1.113,27 4,28 1,29 0.563,30 1,31 1,32 1,33 0.358,34 24.424,35 3.754,36 1,37 0.905,38 238.555,39 0.291,40 1,41 1,42 14.96,43 8.201,44 61.656,45 -1.945,46 1,49 1,57 8.316,58 1.799,59 4,60 4,61 8.316,62 2,63 7.301}
{0 CHEMBL346845,1 0.573,2 0.613,4 2.027,5 1.603,6 1.603,7 0.82,8 6.351,9 3.446,10 1.199,11 0.767,12 0.862,13 0.859,14 3.379,16 0.787,17 0.391,19 48.081,20 48.081,21 1.028,23 5,24 3.31,25 87.479,27 2,29 0.218,33 0.53,34 9.796,35 3.036,37 0.576,38 51.786,43 7.477,44 25.279,57 4.964,58 0.011,59 2,60 2,61 4.964,62 1,63 4.097}
{0 CHEMBL347103,1 0.594,2 0.65,3 64.296,4 2.531,5 1.626,6 1.626,7 0.737,8 6.351,9 3.467,10 1.703,11 1.043,12 0.831,13 0.901,14 3.683,15 1.163,16 0.753,17 0.377,19 45.533,20 45.533,21 -0.258,23 3,24 3.446,25 109.808,27 2,28 1,29 0.163,31 1,32 1,33 0.496,34 10.234,35 3.082,36 1,37 0.602,38 61.72,43 7.475,44 28.449,46 1,57 4.875,58 0.064,59 2,60 2,61 4.875,63 5.131}
{0 CHEMBL347525,1 0.582,2 0.625,3 60.085,4 2.522,5 1.576,6 1.576,7 0.724,8 4.754,9 3.261,10 1.8,11 1.111,12 0.719,13 0.927,14 3.54,16 0.647,17 0.362,19 42.554,20 42.554,21 1.435,23 1,24 3.36,25 99.815,27 2,29 0.175,33 0.496,34 9.202,35 3.018,37 0.575,38 37.427,43 7.477,44 20.876,57 4.131,58 -0.233,59 2,60 2,61 4.131,62 1,63 4.398}
{0 CHEMBL356447,1 0.577,2 0.615,3 60.085,4 2.421,5 1.576,6 1.576,7 0.724,8 4.916,9 3.312,10 1.635,11 1.018,12 0.719,13 0.935,14 3.532,15 1.795,16 0.645,17 0.362,19 42.554,20 42.554,21 -0.112,23 1,24 3.36,25 99.815,27 2,28 1,29 0.173,31 1,32 1,33 0.496,34 9.315,35 3.018,36 1,37 0.582,38 32.323,43 7.475,44 21.222,46 1,57 4.131,58 -0.015,59 2,60 2,61 4.131,63 4.62}
{0 CHEMBL379064,1 0.646,2 0.851,4 3.377,5 1.51,6 1.51,7 0.736,8 6.459,9 4.153,10 2.29,11 1.501,12 1.015,13 0.879,14 4.834,16 0.989,17 0.424,19 52.854,20 52.854,23 5,24 3.803,25 168.603,27 3,29 0.162,33 0.406,34 15.114,35 3.405,37 0.657,38 111.891,43 7.429,44 47.264,57 7.004,58 0.941,59 1,60 1,61 7.004,63 4.022}
{0 CHEMBL409108,1 0.994,2 1.397,3 105.629,4 7.143,5 2.087,6 2.087,7 0.467,8 7.413,9 6.812,10 4.776,11 3.5,12 0.649,13 1.006,14 8.871,16 0.529,17 0.579,19 77.224,20 77.224,21 -0.829,22 0.503,23 1,24 4.534,25 358.182,26 1.113,27 4,28 1,29 0.557,30 1,31 1,32 1,33 0.361,34 31.559,35 3.97,37 1.127,38 214.025,39 0.291,40 1,41 1,42 14.96,43 8.201,44 61.362,45 -1.947,46 1,49 1,57 8.53,58 2.014,59 4,60 4,61 8.53,62 2,63 7.284}
{0 CHEMBL422439,1 1.058,2 1.381,3 90.409,4 4.555,5 1.824,6 1.824,7 0.574,8 7.413,9 5.052,10 3.34,11 2.161,12 0.605,13 0.996,14 5.966,16 0.512,17 0.634,19 67.488,20 67.488,21 -0.716,22 0.503,23 1,24 3.963,25 200.203,26 1.113,27 4,28 1,29 0.569,30 1,31 1,32 1,33 0.368,34 18.393,35 3.505,36 1,37 0.736,38 217.005,39 0.291,40 1,41 1,42 14.96,43 8.201,44 55.67,45 -1.838,46 1,49 1,57 8.106,58 1.386,59 4,60 4,61 8.106,62 2,63 7.215}
{0 CHEMBL431145,1 1.082,2 1.288,3 83.281,4 3.964,5 1.941,6 1.941,7 0.653,8 7.474,9 5.365,10 2.872,11 1.974,12 0.612,13 0.936,14 5.478,15 -0.252,16 0.586,17 0.672,18 31.278,19 62.12,20 62.12,21 2.533,23 1,24 3.796,25 156.117,27 1,28 1,29 0.186,33 0.428,34 17.307,35 3.371,37 0.865,38 108.561,40 3,41 3,42 44.88,43 8.242,44 45.393,47 1,48 1,49 3,50 1,51 1,52 1,53 1,54 1,55 3.914,56 1.002,57 5.588,58 0.5,59 1,60 1,61 5.588,63 7.301}
{0 CHEMBL435190,1 1.182,2 1.555,3 96.742,4 4.612,5 1.904,6 1.904,7 0.541,8 7.435,9 5.243,10 3.363,11 2.189,12 0.603,13 0.997,14 6.11,16 0.525,17 0.712,19 70.454,20 70.454,21 -0.944,22 0.503,23 1,24 4.018,25 210.113,26 1.113,27 4,28 1,29 0.56,30 1,31 1,32 1,33 0.359,34 19.663,35 3.549,36 1,37 0.756,38 258.386,39 0.291,40 2,41 2,42 29.92,43 8.211,44 65.842,45 -1.916,46 1,49 2,57 8.216,58 1.532,59 4,60 4,61 8.216,62 2,63 7.143}
{0 CHEMBL436,1 1.472,2 1.688,4 4.008,5 1.911,6 1.911,7 0.564,8 7.474,9 4.926,10 2.71,11 1.768,12 0.669,13 0.924,14 5.483,15 0.235,16 0.662,17 0.713,18 45.192,19 72.609,20 72.609,21 -0.35,22 0.353,24 3.96,25 176.591,26 0.86,27 2,29 0.518,33 0.502,34 19.621,35 3.48,37 0.818,38 199.144,40 3,41 3,42 44.88,43 8.513,44 51.7,45 -4.599,57 7.037,58 1.049,59 1,60 1,61 7.037,62 1,63 7.796}
{0 CHEMBL43995,1 1.331,2 1.722,3 129.513,4 5.131,5 1.919,6 1.919,7 0.638,8 7.475,9 6.157,10 3.672,11 2.524,12 0.616,13 0.962,14 7.152,15 -0.523,16 0.58,17 0.822,18 31.278,19 82.506,20 82.506,21 -0.377,24 4.085,25 213.219,26 0.148,27 2,28 1,29 0.55,33 0.331,34 23.651,35 3.669,37 0.845,38 163.26,40 3,41 3,42 44.88,43 8.242,44 60.712,47 1,48 1,49 3,50 1,51 1,52 1,53 1,54 1,55 3.887,56 0.839,57 6.832,58 1.491,59 2,60 2,61 6.832,62 1,63 8.013}
{0 CHEMBL442690,1 1.133,2 1.48,3 95.137,4 4.55,5 2.108,6 2.108,7 0.593,8 7.474,9 5.247,10 2.963,11 2.053,12 0.659,13 0.934,14 6.138,15 -0.374,16 0.61,17 0.7,18 76.47,19 69.551,20 69.551,21 0.375,24 3.957,25 183.747,27 2,28 1,29 0.385,33 0.435,34 19.418,35 3.503,37 0.883,38 132.258,40 3,41 3,42 44.88,43 8.242,44 49.654,47 1,48 1,49 3,50 1,51 1,52 1,53 1,54 1,55 3.895,56 0.927,57 6.751,58 0.927,59 1,60 1,61 6.751,62 1,63 7.959}
{0 CHEMBL443545,1 1.019,2 1.365,3 101.006,4 5.455,5 2.089,6 2.089,7 0.455,8 7.413,9 5.958,10 4.052,11 2.778,12 0.63,13 0.997,14 7.526,16 0.528,17 0.605,19 77.289,20 77.289,21 -0.874,22 0.503,23 1,24 4.276,25 255.344,26 1.113,27 4,28 1,29 0.548,30 1,31 1,32 1,33 0.36,34 24.597,35 3.754,37 0.911,38 234.359,39 0.291,40 1,41 1,42 14.96,43 8.201,44 62.049,45 -1.993,46 1,49 1,57 8.457,58 1.814,59 4,60 4,61 8.457,62 2,63 7.456}
{0 CHEMBL44717,1 1.084,2 1.442,3 90.905,4 4.325,5 1.894,6 1.894,7 0.624,8 7.474,9 4.85,10 3.303,11 2.223,12 0.604,13 0.988,14 6.09,15 -0.343,16 0.596,17 0.656,18 31.278,19 62.491,20 62.491,21 0.176,23 1,24 3.935,25 184.117,27 1,28 1,29 0.164,33 0.361,34 17.48,35 3.495,37 0.76,38 112.521,40 3,41 3,42 44.88,43 8.242,44 48.151,47 1,48 1,49 3,50 1,51 1,52 1,53 1,54 1,55 3.967,56 0.952,57 6.908,58 0.927,59 1,60 1,61 6.908,63 8.18}
{0 CHEMBL44743,1 1.268,2 1.64,3 122.153,4 4.898,5 1.955,6 1.955,7 0.628,8 7.475,9 5.739,10 3.516,11 2.424,12 0.625,13 0.966,14 6.732,15 -0.535,16 0.589,17 0.783,18 31.278,19 78.203,20 78.203,21 -0.591,24 4.065,25 210.385,27 2,28 1,29 0.377,33 0.342,34 21.844,35 3.639,37 0.809,38 191.25,40 3,41 3,42 44.88,43 8.242,44 60.492,47 1,48 1,49 3,50 1,51 1,52 1,53 1,54 1,55 3.875,56 0.83,57 6.78,58 1.191,59 2,60 2,61 6.78,62 1,63 8.081}
{0 CHEMBL44780,1 1.269,2 1.755,3 122.153,4 5.322,5 1.974,6 1.974,7 0.586,8 7.474,9 5.964,10 3.788,11 2.711,12 0.627,13 0.971,14 7.204,15 -0.399,16 0.591,17 0.765,18 76.47,19 78.958,20 78.958,21 0.196,24 4.113,25 218.414,27 2,28 1,29 0.398,33 0.342,34 23.197,35 3.673,37 0.859,38 155.247,40 3,41 3,42 44.88,43 8.242,44 53.691,47 1,48 1,49 3,50 1,51 1,52 1,53 1,54 1,55 3.968,56 0.923,57 6.78,58 1.204,59 1,60 1,61 6.78,62 1,63 8.076}
{0 CHEMBL44941,1 1.336,2 1.853,3 129.513,4 5.593,5 1.936,6 1.936,7 0.594,8 7.474,9 6.384,10 3.903,11 2.824,12 0.619,13 0.967,14 7.624,15 -0.387,16 0.582,17 0.805,18 76.47,19 83.261,20 83.261,21 0.618,24 4.133,25 221.247,26 0.148,27 2,28 1,29 0.551,33 0.331,34 25.057,35 3.702,37 0.895,38 128.944,40 3,41 3,42 44.88,43 8.242,44 53.937,47 1,48 1,49 3,50 1,51 1,52 1,53 1,54 1,55 3.979,56 0.931,57 6.832,58 1.496,59 1,60 1,61 6.832,62 1,63 7.638}
{0 CHEMBL45074,1 1.139,2 1.548,3 106.587,4 4.633,5 1.963,6 1.963,7 0.641,8 7.477,9 5.366,10 3.543,11 2.405,12 0.686,13 0.953,14 6.614,15 -0.568,16 0.668,17 0.693,18 31.278,19 70.656,20 70.656,21 -0.351,23 2,24 4.052,25 206.439,26 0.242,27 2,28 1,29 0.167,33 0.362,34 20.859,35 3.601,37 0.802,38 216.776,40 3,41 3,42 44.88,43 8.242,44 63.68,47 1,48 1,49 3,50 1,51 1,52 1,53 1,54 1,55 3.894,56 0.819,57 7.162,58 1.501,59 2,60 2,61 7.162,63 8.06}
{0 CHEMBL45290,1 1.056,2 1.482,3 95.947,4 4.974,5 2.036,6 2.036,7 0.477,8 7.474,9 5.511,10 4.174,11 2.623,12 0.61,13 1.003,14 7.484,15 -0.343,16 0.6,17 0.627,18 88.06,19 67.181,20 67.181,21 0.168,23 1,24 4.279,25 238.948,27 1,28 1,29 0.155,33 0.363,34 21.936,35 3.771,37 0.914,38 106.289,40 3,41 3,42 44.88,43 8.242,44 48.956,47 1,48 1,49 3,50 1,51 1,52 1,53 1,54 1,55 3.994,56 0.956,57 6.951,58 0.927,59 1,60 1,61 6.951,63 7.959}
{0 CHEMBL45352,1 1.394,2 1.796,3 136.939,4 5.428,5 1.884,6 1.884,7 0.65,8 7.475,9 6.632,10 3.836,11 2.634,12 0.608,13 0.959,14 7.468,15 -0.515,16 0.572,17 0.861,18 31.278,19 86.649,20 86.649,21 0.272,24 4.108,25 217.052,27 2,28 1,29 0.715,33 0.32,34 25.51,35 3.698,37 0.88,38 165.029,40 3,41 3,42 44.88,43 8.242,44 60.958,47 1,48 1,49 3,50 1,51 1,52 1,53 1,54 1,55 3.896,56 0.845,57 6.947,58 1.573,59 2,60 2,61 6.947,62 1,63 7.678}
{0 CHEMBL457148,1 0.707,2 0.923,4 3.602,5 1.499,6 1.499,7 0.722,8 6.458,9 4.447,10 2.397,11 1.604,12 0.972,13 0.894,14 5.015,16 0.929,17 0.464,19 56.98,20 56.98,23 3,24 3.831,25 174.6,27 3,29 0.467,33 0.4,34 16.566,35 3.453,37 0.69,38 100.356,43 7.429,44 44.616,57 7.233,58 1.065,59 1,60 1,61 7.233,63 4.041}
{0 CHEMBL45751,1 1.058,2 1.394,3 94.906,4 4.951,5 2.036,6 2.036,7 0.567,8 7.474,9 5.174,10 3.584,11 2.508,12 0.618,13 0.986,14 6.539,15 -0.424,16 0.606,17 0.64,18 31.278,19 67.181,20 67.181,21 -0.076,23 1,24 4.041,25 206.779,27 1,28 1,29 0.147,33 0.368,34 20.046,35 3.579,37 0.835,38 124.709,40 3,41 3,42 44.88,43 8.242,44 52.901,47 1,48 1,49 3,50 1,51 1,52 1,53 1,54 1,55 3.949,56 0.902,57 7.025,58 1.1,59 1,60 1,61 7.025,63 8.032}
{0 CHEMBL457815,1 0.793,2 1.043,4 4.15,5 1.678,6 1.678,7 0.728,8 6.472,9 5.081,10 2.928,11 2.041,12 0.866,13 0.904,14 6.529,16 0.913,17 0.542,18 3.043,19 70.468,20 70.468,23 3,24 4.087,25 245.745,26 0.86,27 3,29 0.509,33 0.402,34 20.482,35 3.825,37 0.732,38 144.477,43 7.769,44 62.361,57 8.491,58 1.654,59 3,60 3,61 8.491,63 4.521}
{0 CHEMBL458251,1 1.184,2 1.594,4 6.035,5 1.66,6 1.66,7 0.764,8 6.52,9 8.401,10 4.176,11 2.721,12 0.981,13 0.833,14 9.14,16 1.022,17 0.775,18 3.043,19 99.595,20 99.595,21 -0.784,22 0.532,23 3,24 4.417,25 330.025,26 0.86,27 3,29 0.597,33 0.315,34 37.099,35 4.087,36 1,37 0.976,38 309.519,43 7.769,44 101.304,57 9.798,58 2.275,59 3,60 3,61 9.798,63 5.301}
{0 CHEMBL46074,1 1.052,2 1.44,3 95.947,4 4.809,5 2.036,6 2.036,7 0.495,8 7.474,9 5.443,10 3.962,11 2.517,12 0.618,13 0.992,14 7.154,15 -0.363,16 0.603,17 0.631,18 31.278,19 67.181,20 67.181,21 0.118,23 1,24 4.164,25 219.381,27 1,28 1,29 0.15,33 0.363,34 21.485,35 3.677,37 0.895,38 108.404,40 3,41 3,42 44.88,43 8.242,44 49.951,47 1,48 1,49 3,50 1,51 1,52 1,53 1,54 1,55 3.981,56 0.943,57 6.951,58 0.927,59 1,60 1,61 6.951,63 8.027}
{0 CHEMBL46170,1 1.149,2 1.558,3 95.947,4 4.531,5 1.857,6 1.857,7 0.632,8 7.474,9 5.203,10 3.605,11 2.339,12 0.594,13 0.982,14 6.597,15 -0.34,16 0.591,17 0.696,18 31.278,19 66.856,20 66.856,21 0.178,23 1,24 3.975,25 191.117,27 1,28 1,29 0.402,33 0.363,34 19.897,35 3.53,37 0.829,38 122.22,40 3,41 3,42 44.88,43 8.242,44 48.977,47 1,48 1,49 3,50 1,51 1,52 1,53 1,54 1,55 3.997,56 0.958,57 6.951,58 0.927,59 1,60 1,61 6.951,63 8.018}
{0 CHEMBL463753,1 0.677,2 0.896,4 3.721,5 1.697,6 1.697,7 0.782,8 6.531,9 4.494,10 2.666,11 1.847,12 0.958,13 0.879,14 6.164,16 1.034,17 0.466,18 3.043,19 61.075,20 61.075,23 6,24 4.044,25 233.752,27 3,29 0.151,33 0.411,34 17.365,35 3.758,37 0.668,38 175.138,43 7.769,44 67.324,57 8.065,58 1.635,59 3,60 3,61 8.065,63 4.293}
{0 CHEMBL463755,1 0.822,2 1.088,4 4.519,5 1.772,6 1.772,7 0.784,8 6.999,9 5.435,10 3.319,11 2.248,12 0.867,13 0.902,14 7.858,16 0.983,17 0.581,18 6.086,19 76.204,20 76.204,23 3,24 4.273,25 310.894,26 0.86,27 3,29 0.234,33 0.388,34 22.827,35 4.07,37 0.736,38 249.351,43 7.773,44 81.566,57 9.619,58 1.982,59 5,60 5,61 9.619,63 5.745}
{0 CHEMBL471479,1 0.737,2 0.968,4 3.925,5 1.69,6 1.69,7 0.75,8 6.493,9 4.787,10 2.82,11 1.938,12 0.908,13 0.892,14 6.347,16 0.971,17 0.504,18 3.043,19 65.892,20 65.892,23 5,24 4.066,25 239.749,27 3,29 0.183,33 0.407,34 18.919,35 3.792,37 0.701,38 162.282,43 7.769,44 64.901,57 8.482,58 1.654,59 3,60 3,61 8.482,63 4.161}
{0 CHEMBL47614,1 1.246,2 1.586,3 95.947,4 4.351,5 1.937,6 1.937,7 0.611,8 8.16,9 5.04,10 3.374,11 2.223,12 0.611,13 0.988,14 6.238,15 -0.527,16 0.602,17 0.756,18 31.278,19 63.936,20 63.936,21 -0.302,23 1,24 3.992,25 194.027,27 1,28 1,29 0.143,33 0.363,34 18.891,35 3.54,37 0.787,38 174.943,40 4,41 4,42 59.84,43 8.242,44 59.077,47 1,48 1,49 4,50 1,51 1,52 1,53 1,54 1,55 3.874,56 0.836,57 6.951,58 0.927,59 1,60 1,61 6.951,63 8.056}
{0 CHEMBL47646,1 1.312,2 1.765,3 99.995,4 6.48,5 2.039,6 2.039,7 0.644,8 7.474,9 6.288,10 5.129,11 3.768,12 0.627,13 0.991,14 8.364,15 -0.56,16 0.58,17 0.771,18 63.497,19 79.509,20 79.509,21 -0.463,22 0.078,23 1,24 4.246,25 257.741,26 0.726,27 2,28 1,29 0.294,33 0.322,34 24.549,35 3.766,37 0.877,38 151.163,40 3,41 3,42 44.88,43 8.242,44 62.645,47 1,48 1,49 3,50 1,51 1,52 1,53 1,54 2,55 3.968,56 0.822,57 7.673,58 1.682,59 2,60 2,61 7.673,62 1,63 8.022}
{0 CHEMBL50,1 0.581,2 0.783,4 3.173,5 1.516,6 1.516,7 0.762,8 6.459,9 3.859,10 2.135,11 1.41,12 1.065,13 0.863,14 4.65,16 1.049,17 0.385,19 48.526,20 48.526,23 6,24 3.775,25 162.607,27 3,29 0.095,33 0.413,34 13.685,35 3.355,37 0.622,38 129.32,43 7.429,44 49.811,57 6.971,58 0.598,59 1,60 1,61 6.971,63 4.3}
{0 CHEMBL542104,1 1.299,2 1.749,3 106.587,4 4.888,5 1.884,6 1.884,7 0.648,8 7.474,9 5.577,10 3.658,11 2.568,12 0.616,13 0.97,14 7.173,15 -0.356,16 0.588,17 0.801,18 31.278,19 77.243,20 77.243,21 0.122,23 1,24 4.042,25 205.282,26 0.242,27 1,28 1,29 0.533,33 0.362,34 22.348,35 3.607,37 0.86,38 91.361,40 3,41 3,42 44.88,43 8.242,44 50.166,47 1,48 1,49 3,50 1,51 1,52 1,53 1,54 1,55 4.028,56 0.953,57 7.162,58 1.303,59 1,60 1,61 7.162,63 7.921}
{0 CHEMBL7679,1 0.884,2 1.214,4 4.091,5 1.857,6 1.857,7 0.472,8 6.351,9 5.1,10 2.831,11 2.04,12 0.622,13 0.97,14 6.177,16 0.611,17 0.548,19 66.856,20 66.856,21 -0.39,23 1,24 4.024,25 190.401,26 0.473,27 3,29 0.251,33 0.386,34 19.152,35 3.587,37 0.798,38 115.611,40 1,41 1,42 14.96,43 8.201,44 40.584,49 1,57 6.821,58 1.2,59 2,60 2,61 6.821,62 1,63 7.678}
{0 CHEMBL84446,1 0.848,2 1.006,4 3.421,5 1.94,6 1.94,7 0.63,8 7.409,9 4.292,10 2.505,11 1.784,12 0.749,13 0.968,14 4.667,16 0.614,17 0.532,19 58.213,20 58.213,21 -0.184,22 0.725,23 2,24 3.766,25 155.787,26 0.878,27 3,29 0.113,30 1,33 0.465,34 14.494,35 3.295,37 0.725,38 182.232,40 1,41 1,42 14.96,43 8.201,44 44.58,45 -1.535,49 1,57 5.899,58 0.725,59 3,60 3,61 5.899,62 3,63 5.602}
