"molecule_id","FCFP4_1024b1","FCFP4_1024b10","FCFP4_1024b100","FCFP4_1024b1000","FCFP4_1024b1001","FCFP4_1024b1002","FCFP4_1024b1003","FCFP4_1024b1004","FCFP4_1024b1005","FCFP4_1024b1006","FCFP4_1024b1007","FCFP4_1024b1008","FCFP4_1024b1009","FCFP4_1024b101","FCFP4_1024b1010","FCFP4_1024b1011","FCFP4_1024b1012","FCFP4_1024b1013","FCFP4_1024b1014","FCFP4_1024b1015","FCFP4_1024b1016","FCFP4_1024b1017","FCFP4_1024b1018","FCFP4_1024b1019","FCFP4_1024b102","FCFP4_1024b1020","FCFP4_1024b1021","FCFP4_1024b1022","FCFP4_1024b1023","FCFP4_1024b1024","FCFP4_1024b103","FCFP4_1024b104","FCFP4_1024b105","FCFP4_1024b106","FCFP4_1024b107","FCFP4_1024b108","FCFP4_1024b109","FCFP4_1024b11","FCFP4_1024b110","FCFP4_1024b111","FCFP4_1024b112","FCFP4_1024b113","FCFP4_1024b114","FCFP4_1024b115","FCFP4_1024b116","FCFP4_1024b117","FCFP4_1024b118","FCFP4_1024b119","FCFP4_1024b12","FCFP4_1024b120","FCFP4_1024b121","pXC50"
{1 1,52 6}
{0 CHEMBL1159974,1 1,33 1,52 6}
{0 CHEMBL281041,1 1,42 1,52 4.222}
{0 CHEMBL284600,1 1,42 1,52 4}
{0 CHEMBL289247,1 1,42 1,52 6.244}
{0 CHEMBL30265,1 1,42 1,52 5.051}
{0 CHEMBL33036,1 1,42 1,52 5.097}
{0 CHEMBL33056,1 1,42 1,52 5.046}
{0 CHEMBL33529,1 1,42 1,52 4.222}
{0 CHEMBL33789,1 1,33 1,52 6.398}
{0 CHEMBL34115,1 1,42 1,52 4}
{0 CHEMBL418592,1 1,33 1,52 5.18}
{0 CHEMBL418597,1 1,42 1,52 4.301}
