{
  "data_set_description": {
    "collection_date": "November 2013",
    "creator": "Dr Jeremy Besnard, Dr Ivan Olier, Dr Noureddin Sadawi, Dr Larisa Soldatova, Dr Crina Grosan, Prof Ross King, Dr Richard Bickerton, Prof Andrew Hopkins and Dr Willem van Hoorn",
    "default_target_attribute": "pXC50",
    "description": "This dataset contains QSAR data (from ChEMBL version 17) showing activity values (unit is pseudo-pCI50) of several compounds on drug target ChEMBL_ID: CHEMBL2021750 (TID: 104517), and it has 10 rows and 1020 features (not including molecule IDs and class feature: molecule_id and pXC50). The features represent Molecular Descriptors which were generated from SMILES strings. Missing value imputation was applied to this dataset (By choosing the Median).",
    "description_version": "1",
    "file_id": "3397202",
    "format": "ARFF",
    "id": "29604",
    "licence": "Public",
    "md5_checksum": "85e257e3bbd24c79dcf0945c9ec664f4",
    "minio_url": "https://data.openml.org/datasets/0002/29604/dataset_29604.pq",
    "name": "QSAR-DATASET-FOR-DRUG-TARGET-CHEMBL2021750",
    "original_data_url": "https://www.ebi.ac.uk/chembl/target/inspect/CHEMBL2021750",
    "parquet_url": "https://data.openml.org/datasets/0002/29604/dataset_29604.pq",
    "processing_date": "2018-10-04 01:31:40",
    "row_id_attribute": "molecule_id",
    "status": "deactivated",
    "tag": [
      "MetaQSAR",
      "study_13"
    ],
    "upload_date": "2016-07-15T02:54:56",
    "url": "https://api.openml.org/data/v1/download/3397202/QSAR-DATASET-FOR-DRUG-TARGET-CHEMBL2021750.arff",
    "version": "7",
    "visibility": "public"
  }
}