{
  "data_features": {
    "feature": [
      {
        "data_type": "nominal",
        "index": "0",
        "is_ignore": "false",
        "is_row_identifier": "true",
        "is_target": "false",
        "name": "molecule_id",
        "nominal_value": [
          "CHEMBL142441",
          "CHEMBL145028",
          "CHEMBL145099",
          "CHEMBL145116",
          "CHEMBL145531",
          "CHEMBL145685",
          "CHEMBL189381",
          "CHEMBL191089",
          "CHEMBL191623",
          "CHEMBL191852",
          "CHEMBL192098",
          "CHEMBL192199",
          "CHEMBL192533",
          "CHEMBL192870",
          "CHEMBL192960",
          "CHEMBL214533",
          "CHEMBL214837",
          "CHEMBL214877",
          "CHEMBL216064",
          "CHEMBL216065",
          "CHEMBL216118",
          "CHEMBL216147",
          "CHEMBL216834",
          "CHEMBL216850",
          "CHEMBL216875",
          "CHEMBL217192",
          "CHEMBL217449",
          "CHEMBL217494",
          "CHEMBL217539",
          "CHEMBL217791",
          "CHEMBL217846",
          "CHEMBL217858",
          "CHEMBL218027",
          "CHEMBL218348",
          "CHEMBL261831",
          "CHEMBL364970",
          "CHEMBL365372",
          "CHEMBL365535",
          "CHEMBL370253",
          "CHEMBL371806",
          "CHEMBL384013",
          "CHEMBL384062",
          "CHEMBL387449",
          "CHEMBL413733",
          "CHEMBL415533",
          "CHEMBL453044",
          "CHEMBL454194",
          "CHEMBL454599",
          "CHEMBL460671",
          "CHEMBL460672",
          "CHEMBL460876",
          "CHEMBL461078",
          "CHEMBL461079",
          "CHEMBL461492",
          "CHEMBL461493",
          "CHEMBL461494",
          "CHEMBL510415",
          "CHEMBL511523",
          "CHEMBL512566",
          "CHEMBL516805",
          "CHEMBL516957",
          "CHEMBL98",
          "CHEMBL99"
        ],
        "number_of_missing_values": "0"
      },
      {
        "data_type": "numeric",
        "index": "1",
        "is_ignore": "false",
        "is_row_identifier": "false",
        "is_target": "false",
        "name": "C.",
        "number_of_missing_values": "0"
      },
      {
        "data_type": "numeric",
        "index": "2",
        "is_ignore": "false",
        "is_row_identifier": "false",
        "is_target": "false",
        "name": "RBF",
        "number_of_missing_values": "0"
      },
      {
        "data_type": "numeric",
        "index": "3",
        "is_ignore": "false",
        "is_row_identifier": "false",
        "is_target": "false",
        "name": "RBN",
        "number_of_missing_values": "0"
      },
      {
        "data_type": "numeric",
        "index": "4",
        "is_ignore": "false",
        "is_row_identifier": "false",
        "is_target": "false",
        "name": "nBM",
        "number_of_missing_values": "0"
      },
      {
        "data_type": "numeric",
        "index": "5",
        "is_ignore": "false",
        "is_row_identifier": "false",
        "is_target": "false",
        "name": "nCsp2",
        "number_of_missing_values": "0"
      },
      {
        "data_type": "numeric",
        "index": "6",
        "is_ignore": "false",
        "is_row_identifier": "false",
        "is_target": "false",
        "name": "nCsp3",
        "number_of_missing_values": "0"
      },
      {
        "data_type": "numeric",
        "index": "7",
        "is_ignore": "false",
        "is_row_identifier": "false",
        "is_target": "true",
        "name": "pXC50",
        "number_of_missing_values": "0"
      }
    ]
  }
}