"molecule_id","FCFP4_1024b105","FCFP4_1024b260","FCFP4_1024b603","FCFP4_1024b340","FCFP4_1024b574","FCFP4_1024b981","FCFP4_1024b152","FCFP4_1024b872","FCFP4_1024b139","FCFP4_1024b166","FCFP4_1024b879","FCFP4_1024b982","FCFP4_1024b1","FCFP4_1024b10","FCFP4_1024b100","FCFP4_1024b1000","FCFP4_1024b1001","FCFP4_1024b1002","FCFP4_1024b1003","FCFP4_1024b1004","FCFP4_1024b1005","FCFP4_1024b1006","FCFP4_1024b1007","FCFP4_1024b1008","FCFP4_1024b1009","FCFP4_1024b101","FCFP4_1024b1010","FCFP4_1024b1011","FCFP4_1024b1012","FCFP4_1024b1013","FCFP4_1024b1014","FCFP4_1024b1015","FCFP4_1024b1016","FCFP4_1024b1017","FCFP4_1024b1018","FCFP4_1024b1019","FCFP4_1024b102","FCFP4_1024b1020","FCFP4_1024b1021","FCFP4_1024b1022","FCFP4_1024b1023","FCFP4_1024b1024","FCFP4_1024b103","FCFP4_1024b104","FCFP4_1024b106","FCFP4_1024b107","FCFP4_1024b108","FCFP4_1024b109","FCFP4_1024b11","FCFP4_1024b110","FCFP4_1024b111","pXC50"
{5 1,13 1,21 1,35 1,52 6.751}
{0 CHEMBL117529,1 1,2 1,3 1,5 1,7 1,13 1,52 5.301}
{0 CHEMBL117663,1 1,2 1,3 1,5 1,7 1,13 1,52 5.301}
{0 CHEMBL117754,1 1,2 1,3 1,5 1,7 1,13 1,21 1,52 5.301}
{0 CHEMBL117798,1 1,2 1,3 1,5 1,7 1,13 1,52 5.301}
{0 CHEMBL117860,1 1,2 1,3 1,5 1,7 1,13 1,52 5.301}
{0 CHEMBL153043,4 1,5 1,13 1,21 1,35 1,52 9.354}
{0 CHEMBL181612,1 1,2 1,3 1,5 1,7 1,13 1,52 6.635}
{0 CHEMBL181906,1 1,2 1,3 1,5 1,7 1,13 1,52 5}
{0 CHEMBL181917,1 1,2 1,3 1,5 1,7 1,13 1,21 1,52 6.251}
{0 CHEMBL181956,1 1,2 1,3 1,5 1,7 1,13 1,52 5}
{0 CHEMBL182302,1 1,2 1,3 1,5 1,7 1,13 1,21 1,52 5.585}
{0 CHEMBL182446,1 1,2 1,3 1,5 1,7 1,13 1,20 1,21 1,52 6.374}
{0 CHEMBL182773,1 1,2 1,3 1,5 1,7 1,13 1,52 6.824}
{0 CHEMBL183143,1 1,2 1,3 1,5 1,7 1,13 1,21 1,52 7.409}
{0 CHEMBL183221,1 1,2 1,3 1,5 1,7 1,13 1,21 1,52 7.319}
{0 CHEMBL184055,1 1,2 1,3 1,5 1,7 1,13 1,21 1,52 5.773}
{0 CHEMBL185287,1 1,2 1,3 1,5 1,7 1,13 1,21 1,52 6.342}
{0 CHEMBL187402,5 1,6 1,8 1,13 1,21 1,52 7.704}
{0 CHEMBL187459,5 1,6 1,8 1,13 1,21 1,52 6.263}
{0 CHEMBL187633,5 1,6 1,8 1,13 1,21 1,52 6.526}
{0 CHEMBL187711,5 1,6 1,8 1,13 1,21 1,52 6.667}
{0 CHEMBL187795,5 1,6 1,8 1,13 1,21 1,52 6.914}
{0 CHEMBL188081,5 1,6 1,8 1,13 1,21 1,52 6.257}
{0 CHEMBL188083,5 1,13 1,52 5.921}
{0 CHEMBL188591,5 1,6 1,8 1,13 1,21 1,52 6.987}
{0 CHEMBL188859,5 1,13 1,52 5.82}
{0 CHEMBL189296,5 1,6 1,8 1,13 1,21 1,52 6.79}
{0 CHEMBL189515,1 1,2 1,3 1,5 1,7 1,13 1,52 5.444}
{0 CHEMBL190328,1 1,2 1,3 1,5 1,7 1,13 1,21 1,52 5.796}
{0 CHEMBL190349,5 1,6 1,8 1,13 1,21 1,52 7.532}
{0 CHEMBL190430,5 1,6 1,8 1,13 1,21 1,52 7.128}
{0 CHEMBL190484,5 1,6 1,8 1,13 1,21 1,52 7.712}
{0 CHEMBL190876,5 1,13 1,21 1,35 1,52 5}
{0 CHEMBL190999,5 1,13 1,52 5.73}
{0 CHEMBL191055,4 1,5 1,13 1,35 1,52 6.519}
{0 CHEMBL191365,5 1,6 1,8 1,13 1,21 1,52 7.704}
{0 CHEMBL191411,1 1,2 1,3 1,5 1,7 1,13 1,21 1,52 5.926}
{0 CHEMBL191614,5 1,7 1,13 1,35 1,52 5}
{0 CHEMBL191737,5 1,13 1,21 1,35 1,52 5}
{0 CHEMBL192210,5 1,13 1,21 1,35 1,52 5}
{0 CHEMBL192452,5 1,13 1,21 1,35 1,52 5}
{0 CHEMBL192861,5 1,13 1,21 1,35 1,52 5}
{0 CHEMBL193069,5 1,13 1,21 1,35 1,52 5}
{0 CHEMBL193196,5 1,7 1,13 1,35 1,52 5}
{0 CHEMBL193406,5 1,13 1,21 1,35 1,52 5}
{0 CHEMBL195383,5 1,13 1,21 1,35 1,52 5}
{0 CHEMBL201482,4 1,5 1,6 1,8 1,13 1,21 1,52 8.523}
{0 CHEMBL2017139,4 1,5 1,13 1,35 1,52 9.557}
{0 CHEMBL202185,4 1,5 1,13 1,21 1,35 1,52 7.24}
{0 CHEMBL202242,4 1,5 1,13 1,21 1,35 1,52 6.939}
{0 CHEMBL202243,4 1,5 1,6 1,8 1,13 1,21 1,52 6.785}
{0 CHEMBL202251,1 1,2 1,3 1,5 1,7 1,13 1,21 1,52 6.17}
{0 CHEMBL202361,4 1,5 1,13 1,21 1,35 1,52 7.959}
{0 CHEMBL203986,4 1,5 1,6 1,8 1,13 1,21 1,52 6.845}
{0 CHEMBL204037,1 1,2 1,3 1,5 1,7 1,13 1,21 1,52 6.546}
{0 CHEMBL210117,5 1,13 1,35 1,52 5.306}
{0 CHEMBL211465,5 1,13 1,35 1,52 5.785}
{0 CHEMBL212029,5 1,13 1,35 1,52 5.896}
{0 CHEMBL215722,5 1,13 1,35 1,52 5.153}
{0 CHEMBL2182023,5 1,9 1,10 1,11 1,12 1,13 1,36 1,37 1,38 1,46 1,52 6.321}
{0 CHEMBL2182032,5 1,13 1,36 1,37 1,38 1,46 1,52 5.164}
{0 CHEMBL2182042,13 1,37 1,46 1,52 4.659}
{0 CHEMBL2182043,5 1,13 1,37 1,46 1,52 5.64}
{0 CHEMBL2182044,5 1,13 1,37 1,46 1,52 4.563}
{0 CHEMBL2182046,5 1,13 1,36 1,37 1,46 1,52 6.879}
{0 CHEMBL2182047,5 1,13 1,36 1,37 1,46 1,52 5.201}
{0 CHEMBL2182049,3 1,5 1,7 1,13 1,37 1,46 1,52 5.636}
{0 CHEMBL2182050,3 1,5 1,7 1,13 1,36 1,37 1,46 1,52 7.187}
{0 CHEMBL2182051,5 1,13 1,37 1,46 1,52 4.73}
{0 CHEMBL2182053,9 1,10 1,11 1,12 1,13 1,37 1,38 1,46 1,52 4.523}
{0 CHEMBL2182054,9 1,10 1,11 1,12 1,13 1,37 1,38 1,46 1,52 4.523}
{0 CHEMBL2182055,9 1,10 1,11 1,12 1,13 1,37 1,38 1,46 1,52 4.523}
{0 CHEMBL2182056,9 1,10 1,11 1,12 1,13 1,37 1,38 1,46 1,52 4.523}
{0 CHEMBL2182057,9 1,10 1,11 1,12 1,13 1,37 1,38 1,46 1,52 4.523}
{0 CHEMBL2182058,9 1,10 1,11 1,12 1,13 1,37 1,38 1,46 1,52 4.523}
{0 CHEMBL2182059,9 1,10 1,11 1,12 1,13 1,37 1,38 1,46 1,52 4.523}
{0 CHEMBL2182060,9 1,10 1,11 1,12 1,13 1,37 1,38 1,46 1,52 4.523}
{0 CHEMBL2182061,9 1,10 1,11 1,12 1,13 1,37 1,38 1,46 1,52 4.523}
{0 CHEMBL2182062,5 1,9 1,10 1,11 1,12 1,13 1,37 1,38 1,46 1,52 4.523}
{0 CHEMBL2182063,5 1,9 1,10 1,11 1,12 1,13 1,37 1,38 1,46 1,52 5.079}
{0 CHEMBL2182064,5 1,9 1,10 1,11 1,12 1,13 1,37 1,38 1,46 1,52 5.237}
{0 CHEMBL2182065,5 1,9 1,10 1,11 1,12 1,13 1,37 1,38 1,46 1,52 5.083}
{0 CHEMBL2335047,4 1,5 1,6 1,8 1,13 1,21 1,52 9.431}
{0 CHEMBL2335048,4 1,5 1,6 1,8 1,13 1,21 1,52 8.969}
{0 CHEMBL2335049,4 1,5 1,6 1,8 1,13 1,21 1,52 9.442}
{0 CHEMBL2335050,4 1,5 1,6 1,8 1,13 1,21 1,52 9.405}
{0 CHEMBL2335051,4 1,5 1,13 1,21 1,35 1,52 9.684}
{0 CHEMBL2335052,4 1,5 1,6 1,8 1,13 1,21 1,52 9.644}
{0 CHEMBL256470,9 1,13 1,14 1,30 1,46 1,52 4.301}
{0 CHEMBL261872,7 1,13 1,46 1,52 6.48}
{0 CHEMBL262906,1 1,2 1,3 1,5 1,7 1,13 1,21 1,52 5.19}
{0 CHEMBL265967,1 1,2 1,3 1,5 1,7 1,13 1,21 1,52 6.991}
{0 CHEMBL272087,5 1,13 1,27 1,52 7.398}
{0 CHEMBL291229,1 1,2 1,3 1,5 1,7 1,13 1,21 1,52 5.78}
{0 CHEMBL313412,1 1,2 1,3 1,5 1,6 1,7 1,13 1,21 1,32 1,52 6.37}
{0 CHEMBL313413,1 1,2 1,3 1,5 1,7 1,13 1,21 1,38 1,52 5.636}
{0 CHEMBL314553,1 1,2 1,3 1,5 1,6 1,7 1,13 1,21 1,52 5}
{0 CHEMBL314554,1 1,2 1,3 1,5 1,7 1,13 1,21 1,42 1,43 1,52 5.58}
{0 CHEMBL314555,1 1,2 1,3 1,5 1,7 1,13 1,21 1,52 6.027}
{0 CHEMBL316067,1 1,2 1,3 1,5 1,7 1,13 1,21 1,52 5.141}
{0 CHEMBL325288,1 1,2 1,3 1,5 1,7 1,13 1,52 5.301}
{0 CHEMBL325970,1 1,2 1,3 1,5 1,7 1,13 1,52 5.301}
{0 CHEMBL327240,1 1,2 1,3 1,5 1,7 1,13 1,21 1,52 5}
{0 CHEMBL328016,1 1,2 1,3 1,5 1,7 1,13 1,21 1,52 5}
{0 CHEMBL328474,1 1,2 1,3 1,5 1,7 1,13 1,21 1,52 5}
{0 CHEMBL329378,1 1,2 1,3 1,5 1,7 1,13 1,21 1,52 5.395}
{0 CHEMBL329422,1 1,2 1,3 1,5 1,7 1,13 1,21 1,22 1,52 6.455}
{0 CHEMBL331661,1 1,2 1,3 1,5 1,7 1,13 1,52 5.301}
{0 CHEMBL357053,4 1,5 1,13 1,21 1,35 1,52 9.57}
{0 CHEMBL360064,1 1,2 1,3 1,5 1,7 1,13 1,52 5.979}
{0 CHEMBL360131,1 1,2 1,3 1,5 1,6 1,7 1,13 1,21 1,52 6.273}
{0 CHEMBL360397,1 1,2 1,3 1,5 1,7 1,13 1,21 1,52 5.157}
{0 CHEMBL360399,1 1,2 1,3 1,5 1,7 1,13 1,21 1,52 5.683}
{0 CHEMBL360727,1 1,2 1,3 1,5 1,7 1,13 1,21 1,52 5.205}
{0 CHEMBL360928,1 1,2 1,3 1,5 1,7 1,13 1,21 1,52 5.937}
{0 CHEMBL361255,5 1,6 1,8 1,13 1,21 1,52 6.667}
{0 CHEMBL361501,5 1,6 1,9 1,13 1,37 1,46 1,52 6.676}
{0 CHEMBL362053,1 1,2 1,3 1,5 1,7 1,13 1,21 1,52 7.409}
{0 CHEMBL363067,5 1,13 1,52 6.352}
{0 CHEMBL363776,5 1,6 1,8 1,13 1,21 1,52 6.206}
{0 CHEMBL363935,5 1,6 1,8 1,13 1,21 1,52 6.681}
{0 CHEMBL364797,5 1,13 1,21 1,35 1,52 6.239}
{0 CHEMBL366292,1 1,2 1,3 1,5 1,7 1,13 1,52 5.398}
{0 CHEMBL379248,1 1,2 1,3 1,5 1,7 1,13 1,21 1,52 6.724}
{0 CHEMBL383095,4 1,5 1,13 1,21 1,35 1,52 6.804}
{0 CHEMBL404452,13 1,14 1,46 1,52 4.301}
{0 CHEMBL404575,13 1,37 1,46 1,52 4.921}
{0 CHEMBL419507,1 1,2 1,3 1,5 1,7 1,13 1,21 1,52 5.159}
{0 CHEMBL419697,1 1,2 1,3 1,5 1,7 1,13 1,14 1,21 1,52 5}
{0 CHEMBL427017,4 1,5 1,6 1,8 1,13 1,21 1,52 6.735}
{0 CHEMBL432821,1 1,2 1,3 1,5 1,7 1,13 1,21 1,52 5}
{0 CHEMBL440396,1 1,2 1,3 1,5 1,7 1,13 1,21 1,52 6.766}
{0 CHEMBL440696,1 1,2 1,3 1,5 1,7 1,13 1,21 1,52 6.757}
{0 CHEMBL441066,1 1,2 1,3 1,5 1,7 1,13 1,21 1,52 5.165}
{0 CHEMBL482497,7 1,13 1,46 1,52 4.859}
{0 CHEMBL482498,7 1,13 1,46 1,52 5.91}
{0 CHEMBL482505,4 1,5 1,13 1,21 1,35 1,52 6.845}
{0 CHEMBL482506,4 1,5 1,13 1,21 1,35 1,52 6.735}
{0 CHEMBL482887,3 1,5 1,7 1,13 1,52 7.62}
{0 CHEMBL483303,13 1,52 4.928}
{0 CHEMBL485119,7 1,13 1,27 1,46 1,52 7.523}
{0 CHEMBL604677,13 1,27 1,36 1,52 6.381}
{0 CHEMBL607806,13 1,52 5.745}
{0 CHEMBL610179,13 1,52 5.346}
{0 CHEMBL83782,1 1,2 1,3 1,5 1,7 1,13 1,21 1,52 5.961}
{0 CHEMBL89937,1 1,2 1,3 1,5 1,7 1,13 1,21 1,52 6.192}
{0 CHEMBL91058,1 1,2 1,3 1,5 1,7 1,13 1,21 1,52 7.449}
{0 CHEMBL91168,1 1,2 1,3 1,5 1,7 1,13 1,21 1,52 5}
{0 CHEMBL92452,1 1,2 1,3 1,5 1,7 1,13 1,21 1,52 5}
{0 CHEMBL92584,1 1,2 1,3 1,5 1,7 1,13 1,21 1,42 1,43 1,52 5.033}
{0 CHEMBL92593,1 1,2 1,3 1,5 1,7 1,13 1,21 1,22 1,52 5.228}
{0 CHEMBL93940,1 1,2 1,3 1,5 1,7 1,13 1,21 1,52 5}
{0 CHEMBL94011,1 1,2 1,3 1,5 1,7 1,13 1,21 1,52 5}
{0 CHEMBL94034,1 1,2 1,3 1,5 1,7 1,8 1,13 1,21 1,52 5.484}
{0 CHEMBL94089,1 1,2 1,3 1,5 1,7 1,13 1,21 1,52 5.193}
{0 CHEMBL94245,1 1,2 1,3 1,5 1,6 1,7 1,13 1,21 1,38 1,52 5}
