"molecule_id","ATSC3p","CATS2D_08_LL","Eig05_EA.ri.","Eig07_AEA.dm.","GGI10","SpMax2_Bh.e.","SpMax2_Bh.i.","SpMax5_Bh.m.","SpMin2_Bh.e.","SpMin2_Bh.i.","BIC2","P_VSA_MR_7","ATS2v","ATS3p","ATS3s","ATS3v","ATS4s","C.024","Chi1_AEA.bo.","Chi1_AEA.dm.","Chi1_AEA.ed.","Chi1_AEA.ri.","Chi1_EA","D.Dtr06","D.Dtr10","Eig03_EA.ri.","Eig05_AEA.bo.","Eig05_AEA.ed.","Eig05_AEA.ri.","Eig05_EA","Eig05_EA.bo.","Eig05_EA.ed.","Eig08_AEA.bo.","Eig08_AEA.ed.","Eig08_EA.bo.","Eig08_EA.ed.","Eig09_AEA.bo.","Eig09_AEA.dm.","Eig09_AEA.ri.","Eig09_EA","Eig09_EA.bo.","Eig09_EA.ed.","Eig09_EA.ri.","Eig10_AEA.dm.","Eig10_AEA.ri.","Eig10_EA.bo.","Eig10_EA.ed.","Eig10_EA.ri.","Eig11_AEA.dm.","Eig12_AEA.dm.","Eig12_AEA.ed.","Eig13_AEA.dm.","Eig15_AEA.bo.","Eta_beta","Eta_betaP","Eta_F","GATS1e","LOC","NaaCH","nAB","nBM","nBnz","nCar","nCb.","nCbH","nR06","piPC01","piPC05","piPC07","P_VSA_MR_6","Rperim","SaaCH","SCBO","SM02_EA.ri.","SM03_AEA.dm.","SM03_AEA.ri.","SM04_AEA.ri.","SM04_EA.ri.","SM05_AEA.ri.","SM06_EA.ri.","SM13_AEA.bo.","SM14_AEA.dm.","SM15_AEA.ri.","SNar","SpAD_EA.ri.","SpDiam_AEA.ed.","SpMAD_EA.ri.","SpMax2_Bh.p.","SpMax2_Bh.v.","SpMin2_Bh.p.","SpMin4_Bh.e.","SpMin4_Bh.i.","TPC","TRS","Uc","Wap","Xt","DLS_04","DLS_cons","X4Av","ATS1m","ATS1v","ATS2m","ATS2p","ATS3m","ATS4e","ATS4i","ATS4m","ATS4p","ATS4v","ATS5m","ATS6m","ATSC3i","ATSC4i","ATSC4m","ATSC4p","BBI","BLTA96","BLTD48","BLTF96","C.016","Chi0_AEA.bo.","Chi0_AEA.dm.","Chi0_AEA.ed.","Chi0_AEA.ri.","Chi0_EA","Chi0_EA.bo.","Chi1_EA.bo.","Chi1_EA.ri.","CID","Eig02_EA.bo.","Eig02_EA.dm.","Eig03_AEA.dm.","Eig04_AEA.bo.","Eig04_AEA.dm.","Eig04_EA.bo.","Eig06_AEA.bo.","Eig06_AEA.ed.","Eig06_EA.ed.","Eig07_AEA.bo.","Eig07_AEA.ed.","Eig07_AEA.ri.","Eig07_EA","Eig07_EA.bo.","Eig07_EA.ed.","Eig07_EA.ri.","Eig08_AEA.dm.","Eig08_AEA.ri.","Eig08_EA","Eig08_EA.ri.","Eig09_AEA.ed.","Eig10_AEA.bo.","Eig11_AEA.ed.","Eig12_AEA.bo.","Eig13_AEA.bo.","Eig13_AEA.ed.","Eig14_AEA.bo.","GATS4v","GATS6i","GATS6p","GATS6v","GGI4","GGI8","GMTI","GMTIV","IDET","IDMT","IVDM","LPRS","MATS6i","MATS6p","MATS6v","MLOGP","MLOGP2","MPC02","MPC03","MPC04","MPC05","MPC06","MPC09","MPC10","MWC02","MWC03","MWC04","MWC05","MWC06","MWC07","MWC08","MWC09","MWC10","NdsCH","nR.Cs","PDI","piPC02","piPC03","piPC04","piPC06","piPC08","piPC09","Psi_e_1","Psi_i_0","Psi_i_1","P_VSA_e_2","P_VSA_p_3","P_VSA_v_3","PW5","Ram","RDSQ","SdsCH","SM02_AEA.bo.","SM02_AEA.dm.","SM02_AEA.ed.","SM02_AEA.ri.","SM02_EA","SM02_EA.bo.","SM02_EA.dm.","pXC50"
{1 12.71,2 3,3 1.862,4 1.929,5 0.103,6 3.828,7 3.828,8 3.264,9 1.662,10 1.626,11 0.695,12 16.786,13 3.925,14 4.269,15 5.708,16 4.107,17 5.885,18 2,19 12.778,20 12.778,21 12.778,22 12.778,23 12.778,24 119.272,25 102.049,26 2.628,27 3.527,28 5.372,29 3.053,30 2.173,31 2.793,32 6.465,33 2.582,34 3.78,35 1.538,36 2.69,37 2.165,38 0.928,39 1.564,40 0.661,41 0.982,42 1.611,43 0.564,44 0.778,45 1.496,46 0.576,47 1.379,48 0.539,49 0.584,50 0.437,51 2.867,52 0.238,53 0.082,54 26,55 12,56 15.535,57 0.736,58 0.901,59 3,60 11,61 12,62 1,63 9,64 4,65 2,66 2,67 3.512,68 5.688,69 6.201,70 32.328,71 15,72 6.068,73 32.5,74 4.323,75 0.661,76 2.69,77 1.611,78 6.119,79 1.379,80 8.297,81 2.173,82 6.465,83 2.793,84 16.008,85 38.59,86 6.862,87 1.484,88 3.841,89 3.756,90 1.769,91 1.477,92 1.488,93 7.128,94 17,95 3.7,96 10489,97 0.25,98 1,99 1,100 0.077,101 3.601,102 3.487,103 4.148,104 4.058,105 4.166,106 5.042,107 5.297,108 4.013,109 4.313,110 4.095,111 4.048,112 3.765,113 1.41,114 1.813,115 44.162,116 17.18,117 41,118 -5.35,119 -5.23,120 -4.89,122 15.013,123 15.013,124 15.013,125 15.013,126 15.013,127 13.575,128 10.486,129 13.605,130 3.895,131 3.851,132 1.437,133 3.58,134 4.044,135 3.309,136 3.181,137 3.089,138 5.15,139 5.875,140 2.859,141 4.462,142 2.441,143 1.479,144 1.973,145 4.216,146 1.407,147 1.833,148 2.032,149 1.097,150 0.994,151 3.578,152 1.593,153 3.253,154 0.882,155 0.598,156 2.68,157 0.471,158 1.009,159 1.376,160 1.547,161 1.416,162 2.601,163 0.297,164 5589,165 14410,166 910.719,167 10362.5,168 4.445,169 112.274,170 -0.32,171 -0.369,172 -0.376,173 4.12,174 16.978,175 3.738,176 3.97,177 4.22,178 4.522,179 4.554,180 4.828,181 4.828,182 4.905,183 5.771,184 6.701,185 7.597,186 8.522,187 9.431,188 10.354,189 11.269,190 12.193,193 0.917,194 4.155,195 4.683,196 5.22,197 5.957,198 6.513,199 6.901,200 3.821,201 17.342,202 14.882,203 154.068,204 154.068,205 154.068,206 0.106,207 11,208 203.181,210 4.834,211 1.097,212 5.883,213 4.216,214 4.419,215 4.84,216 3.115,217 6}
{0 CHEMBL118307,1 14.999,2 16,3 2.384,4 2.012,5 0.19,6 3.962,7 3.973,8 3.353,9 1.94,10 1.93,11 0.668,12 6.046,13 4.038,14 4.401,15 6.056,16 4.278,17 6.311,18 6,19 14.204,20 14.204,21 14.204,22 14.204,23 14.204,24 226.512,25 120.496,26 3.038,27 3.822,28 5.883,29 3.434,30 2.455,31 3.165,32 7.878,33 2.743,34 4.322,35 1.801,36 3.659,37 2.616,38 1.188,39 2.051,40 1.048,41 1.568,42 2.71,43 1.04,44 1,45 2,46 1.5,47 2.275,48 1,49 0.726,50 0.584,51 3.414,52 0.432,53 0.721,54 32,55 16.5,56 25.646,57 0.53,58 0.881,59 6,60 12,61 15,62 2,63 12,64 6,65 6,66 3,67 3.664,68 5.987,69 6.749,70 73.611,71 16,72 9.256,73 38,74 4.49,75 1.048,76 3.659,77 2.71,78 6.312,79 2.275,80 8.486,81 2.455,82 7.878,83 3.165,84 17.394,85 44.521,86 7.152,87 1.535,88 3.921,89 3.895,90 2.009,91 1.554,92 1.493,93 7.319,94 18,95 4,96 12967,97 0.24,98 0.8,99 0.84,100 0.07,101 3.722,102 3.591,103 4.117,104 4.126,105 4.284,106 5.239,107 5.469,108 4.208,109 4.443,110 4.286,111 4.095,112 4.064,113 1.636,114 2.061,115 50.613,116 19.074,117 47,118 -6.18,119 -6.03,120 -5.6,122 16.614,123 16.614,124 16.614,125 16.614,126 16.614,127 14.859,128 11.36,129 14.699,130 4.003,131 4.171,132 1.437,133 3.576,134 4.118,135 3.31,136 3.219,137 3.314,138 5.379,139 6.083,140 3.051,141 4.838,142 2.707,143 1.71,144 2.179,145 4.913,146 1.697,147 1.841,148 2.268,149 1.277,150 1.253,151 3.82,152 2.5,153 3.477,154 1.314,155 1,156 2.927,157 0.959,158 1.036,159 1.468,160 1.611,161 1.376,162 2.773,163 0.28,164 7289,165 19270,166 1185.26,167 14392,168 4.594,169 130.791,170 -0.403,171 -0.403,172 -0.326,173 4.953,174 24.532,175 3.871,176 4.127,177 4.357,178 4.663,179 4.787,180 4.934,181 4.898,182 5.03,183 5.911,184 6.853,185 7.762,186 8.702,187 9.622,188 10.562,189 11.488,190 12.428,193 0.925,194 4.357,195 4.909,196 5.437,197 6.361,198 6.729,199 7.035,200 4.843,201 19.209,202 16.789,203 128.852,204 128.852,205 128.852,206 0.101,207 13,208 245.061,210 4.997,211 1.277,212 6.052,213 4.913,214 4.554,215 5.043,216 3.115,217 5}
{0 CHEMBL118693,1 14.265,2 16,3 2.132,4 2.012,5 0.19,6 3.901,7 3.918,8 3.312,9 1.891,10 1.874,11 0.664,13 3.977,14 4.356,15 5.802,16 4.195,17 5.947,18 6,19 13.261,20 13.261,21 13.261,22 13.261,23 13.261,24 205.051,25 109.328,26 2.755,27 3.645,28 5.389,29 3.231,30 2.282,31 2.991,32 6.752,33 2.732,34 3.82,35 1.739,36 2.938,37 2.5,38 1,39 2,40 1,41 1.5,42 2.275,43 1,44 0.966,45 1.565,46 0.578,47 1.384,48 0.565,49 0.699,50 0.584,51 2.926,52 0.394,53 0.475,54 28,55 14,56 18.443,57 0.731,58 0.886,59 6,60 12,61 13,62 2,63 12,64 6,65 6,66 3,67 3.555,68 5.815,69 6.292,70 73.611,71 16,72 11.854,73 34,74 4.401,75 1,76 2.938,77 2.275,78 6.202,79 1.384,80 8.362,81 2.282,82 6.752,83 2.991,84 16.701,85 41.045,86 7.039,87 1.52,88 3.856,89 3.842,90 1.963,91 1.553,92 1.49,93 7.221,94 18,95 3.807,96 12013,97 0.245,98 0.9,99 0.88,100 0.068,101 3.533,102 3.543,103 3.994,104 4.092,105 4.126,106 5.122,107 5.376,108 3.974,109 4.376,110 4.165,111 3.926,112 3.804,113 1.526,114 1.916,115 45.106,116 18.111,117 42,118 -7.17,119 -6.96,120 -6.44,122 15.72,123 15.72,124 15.72,125 15.72,126 15.72,127 14.152,128 10.813,129 13.595,130 3.936,131 3.764,132 1.437,133 3.576,134 4.054,135 3.309,136 3.182,137 3.09,138 5.218,139 5.956,140 2.871,141 4.463,142 2.454,143 1.485,144 1.98,145 4.226,146 1.422,147 1.838,148 2.218,149 1.226,150 1.192,151 3.653,152 1.625,153 3.414,154 1.119,155 0.763,156 2.684,157 0.5,158 1.048,159 1.422,160 1.594,161 1.404,162 2.613,163 0.28,164 6435,165 14950,166 1022.93,167 12082.5,168 4.509,169 119.415,170 -0.369,171 -0.385,172 -0.356,173 5.938,174 35.257,175 3.761,176 3.989,177 4.22,178 4.564,179 4.585,180 4.844,181 4.787,182 4.934,183 5.796,184 6.718,185 7.609,186 8.529,187 9.433,188 10.352,189 11.263,190 12.183,193 0.919,194 4.19,195 4.714,196 5.235,197 6.033,198 6.565,199 6.968,200 3.95,201 18.147,202 15.525,203 155.026,204 155.026,205 155.026,206 0.106,207 11,208 212.69,210 4.868,211 1.226,212 5.9,213 4.226,214 4.443,215 4.875,216 3.115,217 5}
{0 CHEMBL119781,1 13.541,2 16,3 2.105,4 1.973,5 0.19,6 3.901,7 3.918,8 3.283,9 1.891,10 1.874,11 0.624,13 3.929,14 4.292,15 5.753,16 4.131,17 5.89,18 7,19 12.783,20 12.783,21 12.783,22 12.783,23 12.783,24 196.993,25 104.241,26 2.752,27 3.575,28 5.376,29 3.166,30 2.196,31 2.914,32 6.606,33 2.585,34 3.781,35 1.62,36 2.932,37 2.5,38 1,39 2,40 1,41 1.5,42 2.275,43 1,44 0.923,45 1.561,46 0.577,47 1.382,48 0.562,49 0.64,50 0.491,51 2.911,52 0.373,53 0.469,54 27.5,55 14,56 17.925,57 0.728,58 0.882,59 7,60 12,61 13,62 2,63 12,64 5,65 7,66 3,67 3.526,68 5.727,69 6.212,70 79.902,71 16,72 13.88,73 33,74 4.35,75 1,76 2.932,77 2.275,78 6.146,79 1.382,80 8.312,81 2.196,82 6.606,83 2.914,84 16.296,85 39.235,86 7.035,87 1.509,88 3.856,89 3.842,90 1.963,91 1.552,92 1.489,93 7.143,94 18,95 3.807,96 11099,97 0.248,98 0.9,99 0.81,100 0.068,101 3.498,102 3.498,103 3.954,104 4.044,105 4.044,106 5.05,107 5.309,108 3.895,109 4.288,110 4.082,111 3.794,112 3.638,113 1.444,114 1.769,115 40.261,116 16.445,117 40,118 -6.95,119 -6.75,120 -6.25,122 15.22,123 15.22,124 15.22,125 15.22,126 15.22,127 13.705,128 10.423,129 13.132,130 3.9,131 3.762,132 1.437,133 3.575,134 3.875,135 3.309,136 3.153,137 3.059,138 4.947,139 5.505,140 2.753,141 4.175,142 2.23,143 1.239,144 1.753,145 3.069,146 1.202,147 1.176,148 2.141,149 1.142,150 1.14,151 3.473,152 1.598,153 3.18,154 0.975,155 0.646,156 2.531,157 0.5,158 1.017,159 1.259,160 1.487,161 1.225,162 2.04,163 0.23,164 5998,165 14241,166 943.223,167 10950.8,168 4.459,169 113.665,170 -0.214,171 -0.245,172 -0.176,173 5.719,174 32.706,175 3.714,176 3.932,177 4.159,178 4.466,179 4.454,180 4.718,181 4.736,182 4.89,183 5.746,184 6.663,185 7.546,186 8.46,187 9.355,188 10.269,189 11.171,190 12.086,193 0.921,194 4.143,195 4.659,196 5.178,197 5.906,198 6.489,199 6.867,200 3.8,201 17.372,202 14.878,203 152.491,204 152.491,205 152.491,206 0.1,207 10,208 198.308,210 4.828,211 1.142,212 5.844,213 3.069,214 4.394,215 4.828,216 3.115,217 5}
{0 CHEMBL1783649,1 12.982,2 19,3 2.515,4 2.234,5 0.168,6 3.956,7 3.977,8 3.381,9 1.925,10 1.905,11 0.685,12 9.476,13 4.15,14 4.393,15 5.977,16 4.303,17 6.087,18 12,19 17.758,20 17.758,21 17.758,22 17.758,23 17.758,24 362.973,25 140.204,26 2.867,27 3.839,28 5.874,29 3.542,30 2.554,31 3.147,32 8.035,33 3.012,34 4.562,35 2.138,36 4.334,37 2.8,38 1.883,39 2.282,40 1.286,41 1.825,42 3.289,43 1.269,44 1.538,45 2.251,46 1.748,47 3.053,48 1.249,49 1.35,50 1.323,51 3.51,52 1.084,53 1.74,54 41.75,55 22.5,56 32.432,57 0.646,58 0.688,59 12,60 18,61 21,62 3,63 18,64 6,65 12,66 4,67 3.892,68 6.216,69 6.952,70 139.681,71 27,72 23.975,73 48,74 4.655,75 1.286,76 4.334,77 3.289,78 6.345,79 3.053,80 8.369,81 2.554,82 8.035,83 3.147,84 24.156,85 54.81,86 7.244,87 1.523,88 3.888,89 3.888,90 2.007,91 1.637,92 1.594,93 8.422,94 29,95 4.459,96 57725,97 0.203,98 0.7,99 0.78,100 0.048,101 3.71,102 3.737,103 4.106,104 4.206,105 4.182,106 5.106,107 5.321,108 4.143,109 4.403,110 4.289,111 4.038,112 3.965,113 1.614,114 1.855,115 36.03,116 15.239,117 53,118 -6.54,119 -6.37,120 -5.91,121 1,122 21.54,123 21.54,124 21.54,125 21.54,126 21.54,127 18.88,128 13.764,129 17.927,130 4.209,131 3.8,132 1.437,133 3.576,134 4.115,135 2.952,136 3.452,137 3.583,138 5.509,139 6.888,140 3.291,141 4.72,142 2.815,143 1.826,144 2.54,145 4.988,146 1.801,147 2.072,148 2.609,149 1.62,150 1.594,151 4.081,152 2.698,153 3.691,154 2.5,155 2.5,156 3.414,157 2.332,158 1.048,159 1.107,160 1.066,161 1.05,162 2.02,163 0.407,164 14915,165 37535,166 1888.18,167 27252.2,168 4.926,169 168.207,170 -0.111,171 -0.079,172 -0.044,173 5.313,174 28.226,175 3.989,176 4.29,177 4.564,178 4.844,179 5.011,180 5.497,181 5.609,182 5.187,183 6.061,184 6.965,185 7.858,186 8.767,187 9.668,188 10.58,189 11.486,190 12.401,191 1,192 1,193 0.983,194 4.505,195 5.095,196 5.657,197 6.523,198 7.264,199 7.692,200 5.169,201 22.87,202 19.628,203 171.876,204 171.876,205 171.876,206 0.102,207 12,208 307.632,209 2.352,210 5.162,211 1.62,212 6.089,213 4.988,214 4.673,215 5.193,216 2.933,217 5}
{0 CHEMBL1783651,1 12.89,2 30,3 2.518,4 2.764,5 0.169,6 3.95,7 3.97,8 3.385,9 1.924,10 1.905,11 0.708,12 43.537,13 4.181,14 4.406,15 6.021,16 4.316,17 6.102,18 12,19 18.747,20 18.747,21 18.747,22 18.747,23 18.747,24 406.089,25 154.796,26 2.758,27 3.857,28 5.871,29 3.537,30 2.546,31 3.157,32 8.027,33 3.222,34 4.6,35 2.278,36 4.669,37 2.983,38 2.065,39 2.49,40 1.491,41 2.076,42 3.302,43 1.489,44 1.647,45 2.274,46 1.805,47 3.202,48 1.259,49 1.538,50 1.342,51 3.629,52 1.262,53 2.333,54 44.75,55 24.5,56 35.265,57 0.648,58 0.662,59 12,60 18,61 22,62 3,63 18,64 6,65 12,66 4,67 3.97,68 6.28,69 7.044,70 139.681,71 27,72 23.306,73 52,74 4.692,75 1.491,76 4.669,77 3.302,78 6.359,79 3.202,80 8.355,81 2.546,82 8.027,83 3.157,84 25.542,85 57.349,86 7.236,87 1.509,88 3.885,89 3.884,90 2.007,91 1.647,92 1.607,93 8.516,94 29,95 4.524,96 67723,97 0.198,98 0.7,99 0.78,100 0.047,101 3.758,102 3.783,103 4.139,104 4.235,105 4.197,106 5.083,107 5.299,108 4.122,109 4.376,110 4.264,111 4.005,112 3.984,113 1.604,114 1.811,115 35.017,116 14.862,117 55,118 -6.86,119 -6.67,120 -6.18,121 1,122 22.902,123 22.902,124 22.902,125 22.902,126 22.902,127 19.996,128 14.342,129 18.917,130 4.266,131 3.798,132 1.437,133 3.576,134 4.126,135 3.047,136 3.522,137 3.821,138 5.347,139 6.968,140 3.469,141 5.071,142 2.928,143 1.937,144 2.668,145 5.679,146 1.916,147 2.124,148 2.64,149 1.655,150 1.621,151 4.082,152 2.792,153 3.691,154 2.554,155 2.5,156 3.414,157 2.5,158 1.039,159 1.092,160 1.032,161 1.011,162 2.02,163 0.512,164 18285,165 47225,166 2217.18,167 34312.1,168 5.017,169 183.754,170 -0.089,171 -0.056,172 -0.025,173 5.631,174 31.709,175 4.025,176 4.304,177 4.554,178 4.82,179 4.956,180 5.472,181 5.583,182 5.231,183 6.094,184 6.986,185 7.867,186 8.764,187 9.653,188 10.554,189 11.45,190 12.354,191 1,192 1,193 0.981,194 4.57,195 5.166,196 5.718,197 6.607,198 7.39,199 7.85,200 5.435,201 24.134,202 20.408,203 205.937,204 205.937,205 205.937,206 0.096,207 12,208 325.124,209 2.241,210 5.239,211 1.655,212 6.111,213 5.679,214 4.71,215 5.257,216 2.933,217 5.523}
{0 CHEMBL2111557,1 12.22,2 14,3 1.884,4 1.596,5 0.103,6 3.813,7 3.841,8 3.28,9 1.804,10 1.775,11 0.727,12 66.334,13 3.832,14 4.138,15 5.699,16 3.99,17 5.828,19 12.167,20 12.167,21 12.167,22 12.167,23 12.167,24 101.664,26 2.4,27 3.139,28 4.675,29 2.884,30 1.884,31 2.192,32 4.767,33 2.408,34 3.552,35 1.252,36 2.567,37 2.273,38 0.99,39 1.801,40 0.801,41 1.077,42 1.568,43 0.801,44 0.673,45 1.492,46 0.529,47 0.792,48 0.492,49 0.61,50 0.344,51 2.326,52 0.129,53 0.409,54 23.5,55 10.5,56 16.438,57 0.774,58 2.609,61 7,66 1,67 3.497,68 4.92,69 5.342,70 16.838,71 6,73 32,74 4.173,75 0.801,76 2.567,77 1.568,78 5.706,79 0.792,80 7.541,81 1.884,82 4.767,83 2.192,84 15.315,85 35.297,86 6.499,87 1.412,88 3.734,89 3.73,90 1.91,91 1.549,92 1.476,93 6.238,94 6,95 3,96 3683,97 0.256,98 1,99 0.94,100 0.076,101 3.38,102 3.52,103 3.656,104 3.961,105 3.763,106 4.952,107 5.19,108 3.795,109 4.222,110 4.06,111 3.664,112 3.472,113 1.389,114 1.556,115 32.008,116 13.658,117 32,118 -6.19,119 -6.03,120 -5.6,121 7,122 16.397,123 16.397,124 16.397,125 16.397,126 16.397,127 14.702,128 9.719,129 12.172,130 3.908,131 3.485,132 0.68,133 2.635,134 3.338,135 2.371,136 2.473,137 2.972,138 3.89,139 3.471,140 2.83,141 3.588,142 2.281,143 1.275,144 1.75,145 2.725,146 1.267,147 1.246,148 2.175,149 1.175,150 1.174,151 3.109,152 1.681,153 2.626,154 1.14,155 0.92,156 2.144,157 0.441,158 1.127,159 0.894,160 0.901,161 0.902,162 1.213,163 0.206,164 6723,165 14674,166 1102.82,167 14544.2,168 4.538,169 124.166,170 0.031,171 0.035,172 0.051,173 4.957,174 24.568,175 3.497,176 3.664,177 3.807,178 3.807,179 3.714,180 3.497,181 3.332,182 4.745,183 5.541,184 6.378,185 7.197,186 8.041,187 8.868,188 9.716,189 10.549,190 11.401,191 7,192 7,193 0.891,194 3.951,195 4.382,196 4.718,197 5.159,198 5.677,199 5.911,200 3.58,201 18.051,202 13.899,203 137.436,204 137.436,205 137.436,206 0.077,207 7,208 175.819,209 13.168,210 4.71,211 1.175,212 5.509,213 2.725,214 4.174,215 4.635,216 1.801,217 6.15}
{0 CHEMBL296193,1 9.446,2 11,3 1.831,4 1.314,5 0.103,6 3.808,7 3.838,8 3.15,9 1.803,10 1.773,11 0.75,12 47.381,13 3.697,14 3.941,15 5.488,16 3.803,17 5.54,18 4,19 11.381,20 11.381,21 11.381,22 11.381,23 11.381,24 120.416,25 102.956,26 2.379,27 3.239,28 4.314,29 2.844,30 1.84,31 2.341,32 4.346,33 2.536,34 3.379,35 1.371,36 2.33,37 2.231,38 0.906,39 1.846,40 0.845,41 1.112,42 1.908,43 0.845,44 0.572,45 1.001,49 0.133,50 -0.064,51 2.181,52 -0.151,53 0.402,54 25.5,55 13.5,56 17.391,57 0.741,58 2.271,59 4,60 6,61 11,62 1,63 6,64 2,65 4,66 2,67 3.466,68 5.344,69 5.839,70 54.743,71 10,72 8.603,73 31,74 4.11,75 0.845,76 2.33,77 1.908,78 5.608,80 7.381,81 1.84,82 4.346,83 2.341,84 14.909,85 33.021,86 6.202,87 1.436,88 3.734,89 3.728,90 1.905,91 1.502,92 1.445,93 6.436,94 12,95 3.585,96 4927,97 0.259,98 0.8,99 0.84,100 0.062,101 3.279,102 3.372,103 3.573,104 3.796,105 3.571,106 4.646,107 4.892,108 3.53,109 3.922,110 3.765,111 3.376,112 3.255,113 1.077,114 1.158,115 23.224,116 10.204,117 30,118 -5.84,119 -5.7,120 -5.31,121 5,122 14.552,123 14.552,124 14.552,125 14.552,126 14.552,127 12.722,128 8.644,129 11.387,130 3.808,131 3.332,133 2.598,134 3.389,135 2.448,136 2.589,137 2.944,138 4.131,139 3.761,140 2.671,141 3.593,142 2.272,143 1.272,144 1.681,145 2.832,146 1.272,147 1.172,148 2.061,149 1.061,150 1.06,151 3.184,152 1.413,153 2.351,154 0.816,155 0.682,156 2,157 0.583,158 1.053,159 0.916,160 0.925,161 0.933,162 0.796,163 0.115,164 5069,165 12981,166 814.385,167 9442.66,168 4.382,169 103.614,170 0.045,171 0.049,172 0.062,173 4.614,174 21.293,175 3.434,176 3.584,177 3.807,178 3.932,179 3.892,180 3.912,181 3.714,182 4.673,183 5.468,184 6.312,185 7.128,186 7.98,187 8.808,188 9.663,189 10.499,190 11.357,191 5,192 5,193 0.932,194 3.98,195 4.44,196 4.919,197 5.525,198 6.159,199 6.44,200 3.253,201 15.661,202 12.384,203 127.378,204 127.378,205 127.378,206 0.082,207 6,208 154.2,209 9.165,210 4.668,211 1.061,212 5.425,213 2.832,214 4.111,215 4.663,216 1.635,217 6}
{0 CHEMBL324960,1 14.636,2 16,3 2.227,4 2.012,5 0.19,6 3.922,7 3.936,8 3.349,9 1.908,10 1.895,11 0.669,13 4.003,14 4.379,15 5.932,16 4.237,17 6.142,18 6,19 13.713,20 13.713,21 13.713,22 13.713,23 13.713,24 215.782,25 114.912,26 2.782,27 3.731,28 5.667,29 3.327,30 2.369,31 3.082,32 7.399,33 2.737,34 4.091,35 1.766,36 3.118,37 2.5,38 1.053,39 2,40 1,41 1.5,42 2.275,43 1,44 1,45 1.791,46 1.208,47 2.18,48 0.785,49 0.712,50 0.584,51 3.34,52 0.409,53 0.5,54 29.75,55 15,56 21.963,57 0.6,58 0.885,59 6,60 12,61 14,62 2,63 12,64 6,65 6,66 3,67 3.611,68 5.904,69 6.547,70 73.611,71 16,72 10.635,73 36,74 4.434,75 1,76 3.118,77 2.275,78 6.231,79 2.18,80 8.388,81 2.369,82 7.399,83 3.082,84 17.107,85 42.546,86 7.04,87 1.52,88 3.883,89 3.862,90 1.977,91 1.553,92 1.491,93 7.271,94 18,95 3.907,96 12489,97 0.242,98 0.9,99 0.81,100 0.069,101 3.632,102 3.567,103 4.042,104 4.107,105 4.208,106 5.182,107 5.424,108 4.098,109 4.41,110 4.227,111 4.014,112 3.942,113 1.581,114 1.989,115 47.934,116 18.6,117 44,118 -6.25,119 -6.09,120 -5.66,122 16.272,123 16.272,124 16.272,125 16.272,126 16.272,127 14.676,128 11.129,129 14.165,130 3.971,131 3.877,132 1.437,133 3.576,134 4.1,135 3.31,136 3.186,137 3.146,138 5.33,139 6.026,140 2.995,141 4.577,142 2.562,143 1.587,144 2.117,145 4.437,146 1.525,147 1.839,148 2.238,149 1.247,150 1.216,151 3.74,152 2.401,153 3.414,154 1.301,155 0.961,156 2.698,157 0.724,158 1.042,159 1.445,160 1.603,161 1.389,162 2.693,163 0.28,164 6860,165 17074,166 1103.46,167 13220,168 4.557,169 125.104,170 -0.387,171 -0.394,172 -0.34,173 5.024,174 25.245,175 3.807,176 4.06,177 4.29,178 4.615,179 4.691,180 4.89,181 4.844,182 4.977,183 5.849,184 6.777,185 7.676,186 8.602,187 9.513,188 10.439,189 11.356,190 12.282,193 0.922,194 4.248,195 4.816,196 5.341,197 6.21,198 6.65,199 7.002,200 4.26,201 18.691,202 16.124,203 141.939,204 141.939,205 141.939,206 0.104,207 12,208 228.166,210 4.927,211 1.247,212 5.958,213 4.437,214 4.489,215 4.934,216 3.115,217 5}
{0 CHEMBL38,1 11.184,2 10,3 1.86,4 1.203,5 0.087,6 3.81,7 3.842,8 3.175,9 1.808,10 1.776,11 0.695,12 56.857,13 3.731,14 4.061,15 5.596,16 3.901,17 5.735,19 10.816,20 10.816,21 10.816,22 10.816,23 10.816,24 87.891,26 2.368,27 3.288,28 4.322,29 2.877,30 1.871,31 2.392,32 4.355,33 2.265,34 3.156,35 1.015,36 1.775,37 1.339,38 0.572,39 1.046,40 0.046,41 0.058,42 0.115,43 0.046,44 0.216,45 0.754,46 -0.281,47 -0.586,48 -0.248,49 -0.018,50 -0.064,51 2,52 -0.152,54 20.5,55 9,56 13.798,57 0.767,58 2.553,61 6,66 1,67 3.367,68 4.7,69 5.075,70 13.652,71 6,73 28,74 4.11,75 0.046,76 1.775,77 0.115,78 5.77,79 -0.586,80 7.802,81 1.871,82 4.355,83 2.392,84 13.118,85 31.739,86 6.946,87 1.443,88 3.734,89 3.727,90 1.913,91 1.428,92 1.355,93 5.966,94 6,95 2.807,96 2554,97 0.276,98 1,99 0.96,100 0.08,101 3.26,102 3.392,103 3.582,104 3.849,105 3.612,106 4.946,107 5.231,108 3.554,109 4.097,110 3.889,111 3.32,112 3.312,113 1.272,114 1.483,115 30.897,116 13.134,117 30,118 -5.61,119 -5.48,120 -5.11,121 6,122 13.714,123 13.714,124 13.714,125 13.714,126 13.714,127 12.351,128 8.762,129 10.822,130 3.776,131 3.324,132 0.68,133 2.617,134 3.518,135 2.558,136 2.601,137 2.819,138 4.296,139 3.717,140 2.53,141 3.452,142 2.109,143 1.109,144 1.396,145 2.396,146 1.108,147 0.954,148 1.8,149 0.799,150 0.799,151 2.831,152 1.068,153 2.387,154 0.718,155 0.402,156 2,158 1.066,159 0.637,160 0.639,161 0.635,162 0.884,163 0.132,164 4712,165 10736,166 819.109,167 9689.24,168 4.328,169 104.209,170 0.279,171 0.289,172 0.313,173 4.38,174 19.182,175 3.434,176 3.497,177 3.611,178 3.555,179 3.584,180 3.178,181 3.296,182 4.654,183 5.434,184 6.29,185 7.091,186 7.955,187 8.767,188 9.637,189 10.456,190 11.331,191 6,192 6,193 0.876,194 3.85,195 4.19,196 4.511,197 4.963,198 5.371,199 5.549,200 3.17,201 15.781,202 12.292,203 122.239,204 122.239,205 122.239,206 0.06,207 7,208 146.986,209 11.29,210 4.615,211 0.799,212 5.476,213 2.396,214 4.111,215 4.533,216 1.801,217 7.745}
{0 CHEMBL43833,1 11.503,2 12,3 1.905,4 1.264,5 0.116,6 3.796,7 3.828,8 3.218,9 1.794,10 1.762,11 0.72,12 47.381,13 3.764,14 4.077,15 5.592,16 3.92,17 5.705,19 11.272,20 11.272,21 11.272,22 11.272,23 11.272,24 91.091,26 2.38,27 3.197,28 4.674,29 2.914,30 1.911,31 2.261,32 4.769,33 2.276,34 3.302,35 1.215,36 2.161,37 1.679,38 0.673,39 1.492,40 0.492,41 0.528,42 0.792,43 0.492,44 0.573,45 1.016,46 0.02,47 0.039,48 0.016,49 0.152,50 -0.063,51 2.15,52 -0.151,53 0.191,54 21,55 9,56 13.94,57 0.771,58 2.479,61 6,66 1,67 3.401,68 4.875,69 5.283,70 16.838,71 6,73 29,74 4.11,75 0.492,76 2.161,77 0.792,78 5.637,79 0.039,80 7.453,81 1.911,82 4.769,83 2.261,84 13.929,85 32.793,86 6.317,87 1.426,88 3.718,89 3.711,90 1.902,91 1.545,92 1.472,93 6.094,94 6,95 2.807,96 2907,97 0.268,98 1,99 0.94,100 0.076,101 3.304,102 3.442,103 3.593,104 3.892,105 3.652,106 4.899,107 5.152,108 3.729,109 4.164,110 3.994,111 3.602,112 3.424,113 1.306,114 1.477,115 29.936,116 13.04,117 30,118 -5.83,119 -5.69,120 -5.3,121 5,122 14.767,123 14.767,124 14.767,125 14.767,126 14.767,127 13.404,128 9.085,129 11.277,130 3.824,131 3.322,132 0.68,133 2.641,134 3.34,135 2.46,136 2.464,137 2.972,138 4.311,139 4.334,140 2.561,141 3.588,142 2.197,143 1.197,144 1.374,145 2.609,146 1.197,147 1.141,148 2.001,149 1,150 0.999,151 2.913,152 1.37,153 2.332,154 0.802,155 0.409,156 1.893,157 0.402,158 1.085,159 0.87,160 0.877,161 0.877,162 1.133,163 0.132,164 5033,165 11245,166 892.959,167 10709.3,168 4.409,169 109.743,170 0.05,171 0.055,172 0.072,173 4.603,174 21.185,175 3.434,176 3.555,177 3.761,178 3.761,179 3.689,180 3.401,181 3.401,182 4.673,183 5.46,184 6.308,185 7.119,186 7.974,187 8.796,188 9.655,189 10.484,190 11.346,191 5,192 5,193 0.887,194 3.871,195 4.263,196 4.644,197 5.088,198 5.591,199 5.771,200 3.296,201 16.637,202 12.894,203 118.483,204 118.483,205 118.483,206 0.079,207 7,208 158.657,209 9.304,210 4.625,211 1,212 5.442,213 2.609,214 4.111,215 4.554,216 1.801,217 6.361}
{0 CHEMBL44478,1 11.184,2 10,3 1.86,4 1.203,5 0.087,6 3.81,7 3.842,8 3.175,9 1.808,10 1.776,11 0.695,12 56.857,13 3.731,14 4.061,15 5.596,16 3.901,17 5.735,19 10.816,20 10.816,21 10.816,22 10.816,23 10.816,24 87.891,26 2.368,27 3.288,28 4.322,29 2.877,30 1.871,31 2.392,32 4.355,33 2.265,34 3.156,35 1.015,36 1.775,37 1.339,38 0.572,39 1.046,40 0.046,41 0.058,42 0.115,43 0.046,44 0.216,45 0.754,46 -0.281,47 -0.586,48 -0.248,49 -0.018,50 -0.064,51 2,52 -0.152,54 20.5,55 9,56 13.798,57 0.767,58 2.553,61 6,66 1,67 3.367,68 4.7,69 5.075,70 13.652,71 6,73 28,74 4.11,75 0.046,76 1.775,77 0.115,78 5.77,79 -0.586,80 7.802,81 1.871,82 4.355,83 2.392,84 13.118,85 31.739,86 6.946,87 1.443,88 3.734,89 3.727,90 1.913,91 1.428,92 1.355,93 5.966,94 6,95 2.807,96 2554,97 0.276,98 1,99 0.96,100 0.08,101 3.26,102 3.392,103 3.582,104 3.849,105 3.612,106 4.946,107 5.231,108 3.554,109 4.097,110 3.889,111 3.32,112 3.312,113 1.272,114 1.483,115 30.897,116 13.134,117 30,118 -5.61,119 -5.48,120 -5.11,121 6,122 13.714,123 13.714,124 13.714,125 13.714,126 13.714,127 12.351,128 8.762,129 10.822,130 3.776,131 3.324,132 0.68,133 2.617,134 3.518,135 2.558,136 2.601,137 2.819,138 4.296,139 3.717,140 2.53,141 3.452,142 2.109,143 1.109,144 1.396,145 2.396,146 1.108,147 0.954,148 1.8,149 0.799,150 0.799,151 2.831,152 1.068,153 2.387,154 0.718,155 0.402,156 2,158 1.066,159 0.637,160 0.639,161 0.635,162 0.884,163 0.132,164 4712,165 10736,166 819.109,167 9689.24,168 4.328,169 104.209,170 0.279,171 0.289,172 0.313,173 4.38,174 19.182,175 3.434,176 3.497,177 3.611,178 3.555,179 3.584,180 3.178,181 3.296,182 4.654,183 5.434,184 6.29,185 7.091,186 7.955,187 8.767,188 9.637,189 10.456,190 11.331,191 6,192 6,193 0.876,194 3.85,195 4.19,196 4.511,197 4.963,198 5.371,199 5.549,200 3.17,201 15.781,202 12.292,203 122.239,204 122.239,205 122.239,206 0.06,207 7,208 146.986,209 11.29,210 4.615,211 0.799,212 5.476,213 2.396,214 4.111,215 4.533,216 1.801,217 7.222}
{0 CHEMBL44582,1 11.503,2 12,3 1.905,4 1.264,5 0.116,6 3.796,7 3.828,8 3.218,9 1.794,10 1.762,11 0.72,12 47.381,13 3.764,14 4.077,15 5.592,16 3.92,17 5.705,19 11.272,20 11.272,21 11.272,22 11.272,23 11.272,24 91.091,26 2.38,27 3.197,28 4.674,29 2.914,30 1.911,31 2.261,32 4.769,33 2.276,34 3.302,35 1.215,36 2.161,37 1.679,38 0.673,39 1.492,40 0.492,41 0.528,42 0.792,43 0.492,44 0.573,45 1.016,46 0.02,47 0.039,48 0.016,49 0.152,50 -0.063,51 2.15,52 -0.151,53 0.191,54 21,55 9,56 13.94,57 0.771,58 2.479,61 6,66 1,67 3.401,68 4.875,69 5.283,70 16.838,71 6,73 29,74 4.11,75 0.492,76 2.161,77 0.792,78 5.637,79 0.039,80 7.453,81 1.911,82 4.769,83 2.261,84 13.929,85 32.793,86 6.317,87 1.426,88 3.718,89 3.711,90 1.902,91 1.545,92 1.472,93 6.094,94 6,95 2.807,96 2907,97 0.268,98 1,99 0.94,100 0.076,101 3.304,102 3.442,103 3.593,104 3.892,105 3.652,106 4.899,107 5.152,108 3.729,109 4.164,110 3.994,111 3.602,112 3.424,113 1.306,114 1.477,115 29.936,116 13.04,117 30,118 -5.83,119 -5.69,120 -5.3,121 5,122 14.767,123 14.767,124 14.767,125 14.767,126 14.767,127 13.404,128 9.085,129 11.277,130 3.824,131 3.322,132 0.68,133 2.641,134 3.34,135 2.46,136 2.464,137 2.972,138 4.311,139 4.334,140 2.561,141 3.588,142 2.197,143 1.197,144 1.374,145 2.609,146 1.197,147 1.141,148 2.001,149 1,150 0.999,151 2.913,152 1.37,153 2.332,154 0.802,155 0.409,156 1.893,157 0.402,158 1.085,159 0.87,160 0.877,161 0.877,162 1.133,163 0.132,164 5033,165 11245,166 892.959,167 10709.3,168 4.409,169 109.743,170 0.05,171 0.055,172 0.072,173 4.603,174 21.185,175 3.434,176 3.555,177 3.761,178 3.761,179 3.689,180 3.401,181 3.401,182 4.673,183 5.46,184 6.308,185 7.119,186 7.974,187 8.796,188 9.655,189 10.484,190 11.346,191 5,192 5,193 0.887,194 3.871,195 4.263,196 4.644,197 5.088,198 5.591,199 5.771,200 3.296,201 16.637,202 12.894,203 118.483,204 118.483,205 118.483,206 0.079,207 7,208 158.657,209 9.304,210 4.625,211 1,212 5.442,213 2.609,214 4.111,215 4.554,216 1.801,217 6.15}
{0 CHEMBL44979,1 9.446,2 11,3 1.831,4 1.314,5 0.103,6 3.808,7 3.838,8 3.15,9 1.803,10 1.773,11 0.75,12 47.381,13 3.697,14 3.941,15 5.488,16 3.803,17 5.54,18 4,19 11.381,20 11.381,21 11.381,22 11.381,23 11.381,24 120.416,25 102.956,26 2.379,27 3.239,28 4.314,29 2.844,30 1.84,31 2.341,32 4.346,33 2.536,34 3.379,35 1.371,36 2.33,37 2.231,38 0.906,39 1.846,40 0.845,41 1.112,42 1.908,43 0.845,44 0.572,45 1.001,49 0.133,50 -0.064,51 2.181,52 -0.151,53 0.402,54 25.5,55 13.5,56 17.391,57 0.741,58 2.271,59 4,60 6,61 11,62 1,63 6,64 2,65 4,66 2,67 3.466,68 5.344,69 5.839,70 54.743,71 10,72 8.603,73 31,74 4.11,75 0.845,76 2.33,77 1.908,78 5.608,80 7.381,81 1.84,82 4.346,83 2.341,84 14.909,85 33.021,86 6.202,87 1.436,88 3.734,89 3.728,90 1.905,91 1.502,92 1.445,93 6.436,94 12,95 3.585,96 4927,97 0.259,98 0.8,99 0.84,100 0.062,101 3.279,102 3.372,103 3.573,104 3.796,105 3.571,106 4.646,107 4.892,108 3.53,109 3.922,110 3.765,111 3.376,112 3.255,113 1.077,114 1.158,115 23.224,116 10.204,117 30,118 -5.84,119 -5.7,120 -5.31,121 5,122 14.552,123 14.552,124 14.552,125 14.552,126 14.552,127 12.722,128 8.644,129 11.387,130 3.808,131 3.332,133 2.598,134 3.389,135 2.448,136 2.589,137 2.944,138 4.131,139 3.761,140 2.671,141 3.593,142 2.272,143 1.272,144 1.681,145 2.832,146 1.272,147 1.172,148 2.061,149 1.061,150 1.06,151 3.184,152 1.413,153 2.351,154 0.816,155 0.682,156 2,157 0.583,158 1.053,159 0.916,160 0.925,161 0.933,162 0.796,163 0.115,164 5069,165 12981,166 814.385,167 9442.66,168 4.382,169 103.614,170 0.045,171 0.049,172 0.062,173 4.614,174 21.293,175 3.434,176 3.584,177 3.807,178 3.932,179 3.892,180 3.912,181 3.714,182 4.673,183 5.468,184 6.312,185 7.128,186 7.98,187 8.808,188 9.663,189 10.499,190 11.357,191 5,192 5,193 0.932,194 3.98,195 4.44,196 4.919,197 5.525,198 6.159,199 6.44,200 3.253,201 15.661,202 12.384,203 127.378,204 127.378,205 127.378,206 0.082,207 6,208 154.2,209 9.165,210 4.668,211 1.061,212 5.425,213 2.832,214 4.111,215 4.663,216 1.635,217 5.699}
{0 CHEMBL46397,1 9.446,2 11,3 1.831,4 1.314,5 0.103,6 3.808,7 3.838,8 3.15,9 1.803,10 1.773,11 0.75,12 47.381,13 3.697,14 3.941,15 5.488,16 3.803,17 5.54,18 4,19 11.381,20 11.381,21 11.381,22 11.381,23 11.381,24 120.416,25 102.956,26 2.379,27 3.239,28 4.314,29 2.844,30 1.84,31 2.341,32 4.346,33 2.536,34 3.379,35 1.371,36 2.33,37 2.231,38 0.906,39 1.846,40 0.845,41 1.112,42 1.908,43 0.845,44 0.572,45 1.001,49 0.133,50 -0.064,51 2.181,52 -0.151,53 0.402,54 25.5,55 13.5,56 17.391,57 0.741,58 2.271,59 4,60 6,61 11,62 1,63 6,64 2,65 4,66 2,67 3.466,68 5.344,69 5.839,70 54.743,71 10,72 8.603,73 31,74 4.11,75 0.845,76 2.33,77 1.908,78 5.608,80 7.381,81 1.84,82 4.346,83 2.341,84 14.909,85 33.021,86 6.202,87 1.436,88 3.734,89 3.728,90 1.905,91 1.502,92 1.445,93 6.436,94 12,95 3.585,96 4927,97 0.259,98 0.8,99 0.84,100 0.062,101 3.279,102 3.372,103 3.573,104 3.796,105 3.571,106 4.646,107 4.892,108 3.53,109 3.922,110 3.765,111 3.376,112 3.255,113 1.077,114 1.158,115 23.224,116 10.204,117 30,118 -5.84,119 -5.7,120 -5.31,121 5,122 14.552,123 14.552,124 14.552,125 14.552,126 14.552,127 12.722,128 8.644,129 11.387,130 3.808,131 3.332,133 2.598,134 3.389,135 2.448,136 2.589,137 2.944,138 4.131,139 3.761,140 2.671,141 3.593,142 2.272,143 1.272,144 1.681,145 2.832,146 1.272,147 1.172,148 2.061,149 1.061,150 1.06,151 3.184,152 1.413,153 2.351,154 0.816,155 0.682,156 2,157 0.583,158 1.053,159 0.916,160 0.925,161 0.933,162 0.796,163 0.115,164 5069,165 12981,166 814.385,167 9442.66,168 4.382,169 103.614,170 0.045,171 0.049,172 0.062,173 4.614,174 21.293,175 3.434,176 3.584,177 3.807,178 3.932,179 3.892,180 3.912,181 3.714,182 4.673,183 5.468,184 6.312,185 7.128,186 7.98,187 8.808,188 9.663,189 10.499,190 11.357,191 5,192 5,193 0.932,194 3.98,195 4.44,196 4.919,197 5.525,198 6.159,199 6.44,200 3.253,201 15.661,202 12.384,203 127.378,204 127.378,205 127.378,206 0.082,207 6,208 154.2,209 9.165,210 4.668,211 1.061,212 5.425,213 2.832,214 4.111,215 4.663,216 1.635,217 6.432}
{0 CHEMBL46398,1 11.503,2 12,3 1.905,4 1.264,5 0.116,6 3.796,7 3.828,8 3.218,9 1.794,10 1.762,11 0.72,12 47.381,13 3.764,14 4.077,15 5.592,16 3.92,17 5.705,19 11.272,20 11.272,21 11.272,22 11.272,23 11.272,24 91.091,26 2.38,27 3.197,28 4.674,29 2.914,30 1.911,31 2.261,32 4.769,33 2.276,34 3.302,35 1.215,36 2.161,37 1.679,38 0.673,39 1.492,40 0.492,41 0.528,42 0.792,43 0.492,44 0.573,45 1.016,46 0.02,47 0.039,48 0.016,49 0.152,50 -0.063,51 2.15,52 -0.151,53 0.191,54 21,55 9,56 13.94,57 0.771,58 2.479,61 6,66 1,67 3.401,68 4.875,69 5.283,70 16.838,71 6,73 29,74 4.11,75 0.492,76 2.161,77 0.792,78 5.637,79 0.039,80 7.453,81 1.911,82 4.769,83 2.261,84 13.929,85 32.793,86 6.317,87 1.426,88 3.718,89 3.711,90 1.902,91 1.545,92 1.472,93 6.094,94 6,95 2.807,96 2907,97 0.268,98 1,99 0.94,100 0.076,101 3.304,102 3.442,103 3.593,104 3.892,105 3.652,106 4.899,107 5.152,108 3.729,109 4.164,110 3.994,111 3.602,112 3.424,113 1.306,114 1.477,115 29.936,116 13.04,117 30,118 -5.83,119 -5.69,120 -5.3,121 5,122 14.767,123 14.767,124 14.767,125 14.767,126 14.767,127 13.404,128 9.085,129 11.277,130 3.824,131 3.322,132 0.68,133 2.641,134 3.34,135 2.46,136 2.464,137 2.972,138 4.311,139 4.334,140 2.561,141 3.588,142 2.197,143 1.197,144 1.374,145 2.609,146 1.197,147 1.141,148 2.001,149 1,150 0.999,151 2.913,152 1.37,153 2.332,154 0.802,155 0.409,156 1.893,157 0.402,158 1.085,159 0.87,160 0.877,161 0.877,162 1.133,163 0.132,164 5033,165 11245,166 892.959,167 10709.3,168 4.409,169 109.743,170 0.05,171 0.055,172 0.072,173 4.603,174 21.185,175 3.434,176 3.555,177 3.761,178 3.761,179 3.689,180 3.401,181 3.401,182 4.673,183 5.46,184 6.308,185 7.119,186 7.974,187 8.796,188 9.655,189 10.484,190 11.346,191 5,192 5,193 0.887,194 3.871,195 4.263,196 4.644,197 5.088,198 5.591,199 5.771,200 3.296,201 16.637,202 12.894,203 118.483,204 118.483,205 118.483,206 0.079,207 7,208 158.657,209 9.304,210 4.625,211 1,212 5.442,213 2.609,214 4.111,215 4.554,216 1.801,217 8.35}
{0 CHEMBL547,1 11.184,2 10,3 1.86,4 1.203,5 0.087,6 3.81,7 3.842,8 3.175,9 1.808,10 1.776,11 0.695,12 56.857,13 3.731,14 4.061,15 5.596,16 3.901,17 5.735,19 10.816,20 10.816,21 10.816,22 10.816,23 10.816,24 87.891,26 2.368,27 3.288,28 4.322,29 2.877,30 1.871,31 2.392,32 4.355,33 2.265,34 3.156,35 1.015,36 1.775,37 1.339,38 0.572,39 1.046,40 0.046,41 0.058,42 0.115,43 0.046,44 0.216,45 0.754,46 -0.281,47 -0.586,48 -0.248,49 -0.018,50 -0.064,51 2,52 -0.152,54 20.5,55 9,56 13.798,57 0.767,58 2.553,61 6,66 1,67 3.367,68 4.7,69 5.075,70 13.652,71 6,73 28,74 4.11,75 0.046,76 1.775,77 0.115,78 5.77,79 -0.586,80 7.802,81 1.871,82 4.355,83 2.392,84 13.118,85 31.739,86 6.946,87 1.443,88 3.734,89 3.727,90 1.913,91 1.428,92 1.355,93 5.966,94 6,95 2.807,96 2554,97 0.276,98 1,99 0.96,100 0.08,101 3.26,102 3.392,103 3.582,104 3.849,105 3.612,106 4.946,107 5.231,108 3.554,109 4.097,110 3.889,111 3.32,112 3.312,113 1.272,114 1.483,115 30.897,116 13.134,117 30,118 -5.61,119 -5.48,120 -5.11,121 6,122 13.714,123 13.714,124 13.714,125 13.714,126 13.714,127 12.351,128 8.762,129 10.822,130 3.776,131 3.324,132 0.68,133 2.617,134 3.518,135 2.558,136 2.601,137 2.819,138 4.296,139 3.717,140 2.53,141 3.452,142 2.109,143 1.109,144 1.396,145 2.396,146 1.108,147 0.954,148 1.8,149 0.799,150 0.799,151 2.831,152 1.068,153 2.387,154 0.718,155 0.402,156 2,158 1.066,159 0.637,160 0.639,161 0.635,162 0.884,163 0.132,164 4712,165 10736,166 819.109,167 9689.24,168 4.328,169 104.209,170 0.279,171 0.289,172 0.313,173 4.38,174 19.182,175 3.434,176 3.497,177 3.611,178 3.555,179 3.584,180 3.178,181 3.296,182 4.654,183 5.434,184 6.29,185 7.091,186 7.955,187 8.767,188 9.637,189 10.456,190 11.331,191 6,192 6,193 0.876,194 3.85,195 4.19,196 4.511,197 4.963,198 5.371,199 5.549,200 3.17,201 15.781,202 12.292,203 122.239,204 122.239,205 122.239,206 0.06,207 7,208 146.986,209 11.29,210 4.615,211 0.799,212 5.476,213 2.396,214 4.111,215 4.533,216 1.801,217 6}
{0 CHEMBL705,1 11.184,2 10,3 1.86,4 1.203,5 0.087,6 3.81,7 3.842,8 3.175,9 1.808,10 1.776,11 0.695,12 56.857,13 3.731,14 4.061,15 5.596,16 3.901,17 5.735,19 10.816,20 10.816,21 10.816,22 10.816,23 10.816,24 87.891,26 2.368,27 3.288,28 4.322,29 2.877,30 1.871,31 2.392,32 4.355,33 2.265,34 3.156,35 1.015,36 1.775,37 1.339,38 0.572,39 1.046,40 0.046,41 0.058,42 0.115,43 0.046,44 0.216,45 0.754,46 -0.281,47 -0.586,48 -0.248,49 -0.018,50 -0.064,51 2,52 -0.152,54 20.5,55 9,56 13.798,57 0.767,58 2.553,61 6,66 1,67 3.367,68 4.7,69 5.075,70 13.652,71 6,73 28,74 4.11,75 0.046,76 1.775,77 0.115,78 5.77,79 -0.586,80 7.802,81 1.871,82 4.355,83 2.392,84 13.118,85 31.739,86 6.946,87 1.443,88 3.734,89 3.727,90 1.913,91 1.428,92 1.355,93 5.966,94 6,95 2.807,96 2554,97 0.276,98 1,99 0.96,100 0.08,101 3.26,102 3.392,103 3.582,104 3.849,105 3.612,106 4.946,107 5.231,108 3.554,109 4.097,110 3.889,111 3.32,112 3.312,113 1.272,114 1.483,115 30.897,116 13.134,117 30,118 -5.61,119 -5.48,120 -5.11,121 6,122 13.714,123 13.714,124 13.714,125 13.714,126 13.714,127 12.351,128 8.762,129 10.822,130 3.776,131 3.324,132 0.68,133 2.617,134 3.518,135 2.558,136 2.601,137 2.819,138 4.296,139 3.717,140 2.53,141 3.452,142 2.109,143 1.109,144 1.396,145 2.396,146 1.108,147 0.954,148 1.8,149 0.799,150 0.799,151 2.831,152 1.068,153 2.387,154 0.718,155 0.402,156 2,158 1.066,159 0.637,160 0.639,161 0.635,162 0.884,163 0.132,164 4712,165 10736,166 819.109,167 9689.24,168 4.328,169 104.209,170 0.279,171 0.289,172 0.313,173 4.38,174 19.182,175 3.434,176 3.497,177 3.611,178 3.555,179 3.584,180 3.178,181 3.296,182 4.654,183 5.434,184 6.29,185 7.091,186 7.955,187 8.767,188 9.637,189 10.456,190 11.331,191 6,192 6,193 0.876,194 3.85,195 4.19,196 4.511,197 4.963,198 5.371,199 5.549,200 3.17,201 15.781,202 12.292,203 122.239,204 122.239,205 122.239,206 0.06,207 7,208 146.986,209 11.29,210 4.615,211 0.799,212 5.476,213 2.396,214 4.111,215 4.533,216 1.801,217 7.77}
{0 CHEMBL72988,1 12.955,2 17,3 1.981,4 1.994,5 0.157,6 3.833,7 3.868,8 3.309,9 1.836,10 1.803,11 0.737,12 37.905,13 3.865,14 4.198,15 5.681,16 4.04,17 5.811,19 12.199,20 12.199,21 12.199,22 12.199,23 12.199,24 100.417,26 2.318,27 3.289,28 4.83,29 2.982,30 1.982,31 2.387,32 5.301,33 2.279,34 3.587,35 1.237,36 2.582,37 1.679,38 0.975,39 1.495,40 0.495,41 0.531,42 0.806,43 0.495,44 0.673,45 1.373,46 0.397,47 0.536,48 0.373,49 0.586,50 0.196,51 2.36,52 0.114,53 0.408,54 21.5,55 8.5,56 14.671,57 0.778,58 2.355,61 6,66 1,67 3.466,68 4.99,69 5.361,70 20.023,71 6,73 31,74 4.203,75 0.495,76 2.582,77 0.806,78 5.751,79 0.536,80 7.574,81 1.982,82 5.301,83 2.387,84 15.027,85 35.609,86 6.316,87 1.424,88 3.758,89 3.75,90 1.942,91 1.548,92 1.476,93 6.238,94 6,95 2.807,96 3295,97 0.258,98 0.9,99 0.88,100 0.075,101 3.386,102 3.535,103 3.684,104 3.998,105 3.768,106 5.048,107 5.305,108 3.88,109 4.316,110 4.146,111 3.837,112 3.781,113 1.47,114 1.715,115 34.659,116 15.162,117 33,118 -6.27,119 -6.1,120 -5.67,121 4,122 16.085,123 16.085,124 16.085,125 16.085,126 16.085,127 14.481,128 9.875,129 12.205,130 3.905,131 3.481,132 0.962,133 2.985,134 3.622,135 2.632,136 2.854,137 3.002,138 4.651,139 4.784,140 2.932,141 4.218,142 2.579,143 1.577,144 1.918,145 3.95,146 1.573,147 1.243,148 2.173,149 1.173,150 1.173,151 3.043,152 1.534,153 2.639,154 1.036,155 0.746,156 2.158,157 0.457,158 1.052,159 0.947,160 0.94,161 0.895,162 1.293,163 0.263,164 5747,165 11619,166 1021.1,167 12817.3,168 4.523,169 120.844,170 -0.009,171 0.005,172 0.06,173 5.036,174 25.365,175 3.526,176 3.664,177 3.892,178 3.932,179 3.912,180 3.738,181 3.738,182 4.762,183 5.557,184 6.415,185 7.235,186 8.1,187 8.929,188 9.797,189 10.63,190 11.5,191 4,192 4,193 0.888,194 3.951,195 4.317,196 4.727,197 5.257,198 5.635,199 5.866,200 3.607,201 18.228,202 14.207,203 123.552,204 123.552,205 123.552,206 0.089,207 8,208 184.181,209 7.648,210 4.7,211 1.173,212 5.549,213 3.95,214 4.205,215 4.635,216 2.067,217 5.799}
{0 CHEMBL75548,1 12.808,2 11,3 1.924,4 1.405,5 0.087,6 3.82,7 3.865,8 3.191,9 1.827,10 1.785,11 0.732,12 47.381,13 3.812,14 4.162,15 5.678,16 3.988,17 5.797,19 11.243,20 11.243,21 11.243,22 11.243,23 11.243,24 92.03,26 2.329,27 3.298,28 4.44,29 2.942,30 1.936,31 2.387,32 4.61,33 2.276,34 3.234,35 1.061,36 1.862,37 1.395,38 0.603,39 1.326,40 0.326,41 0.331,42 0.483,43 0.326,44 0.491,45 1.037,46 0.044,47 0.086,48 0.035,49 0.193,50 -0.018,51 2.259,52 -0.064,54 19,55 7,56 12.503,57 0.776,58 2.512,61 5,66 1,67 3.367,68 4.663,69 5.1,70 10.467,71 6,73 28,74 4.142,75 0.326,76 1.862,77 0.483,78 5.801,79 0.086,80 7.827,81 1.936,82 4.61,83 2.387,84 13.811,85 32.799,86 6.988,87 1.426,88 3.733,89 3.722,90 1.95,91 1.429,92 1.357,93 6.043,94 6,95 2.585,96 2617,97 0.269,98 1,99 0.94,100 0.082,101 3.31,102 3.459,103 3.63,104 3.945,105 3.68,106 5.058,107 5.347,108 3.632,109 4.199,110 3.984,111 3.487,112 3.521,113 1.452,114 1.63,115 34.001,116 14.445,117 31,118 -5.92,119 -5.77,120 -5.37,121 5,122 14.585,123 14.585,124 14.585,125 14.585,126 14.585,127 13.534,128 9.553,129 11.249,130 3.822,131 3.329,132 0.68,133 2.745,134 3.504,135 2.61,136 2.602,137 2.754,138 4.294,139 3.717,140 2.536,141 3.474,142 2.165,143 1.165,144 1.426,145 2.467,146 1.165,147 0.98,148 1.834,149 0.834,150 0.833,151 2.865,152 1.311,153 2.546,154 0.736,155 0.553,156 2,157 0.31,158 1.078,159 0.669,160 0.665,161 0.652,162 0.964,163 0.21,164 4813,165 9286,166 858.341,167 10287.5,168 4.398,169 108.735,170 0.258,171 0.267,172 0.29,173 4.685,174 21.952,175 3.466,176 3.555,177 3.664,178 3.664,179 3.714,180 3.401,181 3.434,182 4.691,183 5.476,184 6.33,185 7.138,186 8.001,187 8.821,188 9.69,189 10.518,190 11.393,191 5,192 5,193 0.868,194 3.807,195 4.143,196 4.466,197 4.934,198 5.38,199 5.094,200 3.363,201 16.799,202 13.32,203 114.647,204 114.647,205 114.647,206 0.065,207 7,208 159.989,209 9.698,210 4.615,211 0.834,212 5.509,213 2.467,214 4.143,215 4.489,216 1.943,217 7.222}
