"molecule_id","nAB","nCsp3","nDB","AMW","C.","H.","Me","Mi","Mp","pXC50"
{2 17,3 3,4 5.934,5 39.6,6 56.6,7 0.979,8 1.125,9 0.629,10 7.553}
{0 CHEMBL104,1 23,2 1,4 8.211,5 52.4,6 40.5,7 0.99,8 1.101,9 0.737,10 5.5}
{0 CHEMBL1062,2 17,3 3,4 6.121,5 38.9,6 55.6,7 0.986,8 1.127,9 0.626,10 7.921}
{0 CHEMBL110691,2 16,3 5,4 7.105,5 40.4,6 50.9,7 0.998,8 1.123,9 0.651,10 8.278}
{0 CHEMBL1159650,2 18,3 5,4 7.297,5 39.1,6 50,7 1.008,8 1.131,9 0.641,10 7.921}
{0 CHEMBL1159655,1 12,2 18,3 2,4 6.681,5 37.6,6 52.9,7 0.991,8 1.129,9 0.641,10 4.352}
{0 CHEMBL1162,2 15,3 2,4 6.218,5 41.7,6 54.2,7 0.982,8 1.121,9 0.642,10 8.472}
{0 CHEMBL118,1 17,2 2,3 2,4 9.535,5 42.5,6 35,7 1.044,8 1.144,9 0.693,10 4.742}
{0 CHEMBL1200324,1 5,2 18,4 5.867,5 37.5,6 57.1,7 0.978,8 1.133,9 0.623,10 5.431}
{0 CHEMBL1200545,2 18,3 6,4 7.382,5 38.8,6 47.8,7 1.02,8 1.137,9 0.627,10 6.936}
{0 CHEMBL1200600,2 16,3 4,4 6.723,5 39.3,6 51.8,7 1.001,8 1.132,9 0.628,10 6.532}
{0 CHEMBL1200623,2 18,3 1,4 5.444,5 37.7,6 60.4,7 0.971,8 1.129,9 0.616,10 6.697}
{0 CHEMBL1200624,2 18,3 3,4 6.409,5 40,6 53.3,7 0.991,8 1.125,9 0.633,10 6.796}
{0 CHEMBL1200845,2 20,3 3,4 7.222,5 38.1,6 50.8,7 1.008,8 1.133,9 0.635,10 9.475}
{0 CHEMBL1201012,2 20,3 3,4 6.821,5 37.5,6 51.6,7 1.008,8 1.135,9 0.619,10 6.764}
{0 CHEMBL1201139,2 17,3 5,4 6.409,5 40,6 53.3,7 0.991,8 1.125,9 0.633,10 7.959}
{0 CHEMBL1201146,2 16,3 3,4 6.425,5 41.5,6 52.8,7 0.988,8 1.122,9 0.642,10 7.553}
{0 CHEMBL1201151,1 6,2 13,4 6.336,5 42.9,6 53.1,7 0.982,8 1.119,9 0.649,10 4.516}
{0 CHEMBL1276308,1 6,2 16,3 3,4 6.413,5 43.3,6 52.2,7 0.982,8 1.119,9 0.655,10 8.488}
{0 CHEMBL135,1 6,2 12,4 6.191,5 40.9,6 54.5,7 0.983,8 1.123,9 0.637,10 4.487}
{0 CHEMBL1370,2 19,3 4,4 6.624,5 38.5,6 52.3,7 1,8 1.128,9 0.626,10 6.678}
{0 CHEMBL1393,2 19,3 4,4 6.83,5 39.3,6 52.5,7 0.992,8 1.121,9 0.65,10 5.778}
{0 CHEMBL1395,2 17,3 2,4 5.817,5 38.5,6 57.7,7 0.979,8 1.128,9 0.622,10 6.6}
{0 CHEMBL139835,2 17,3 5,4 7.189,5 41.4,6 50,7 0.998,8 1.121,9 0.657,10 7.432}
{0 CHEMBL1405,1 6,2 11,3 1,4 6.438,5 42.9,6 52.4,7 0.985,8 1.119,9 0.65,10 4.793}
{0 CHEMBL1479,1 5,2 15,3 1,4 6.49,5 42.3,6 51.9,7 0.985,8 1.121,9 0.65,10 6.587}
{0 CHEMBL1501,2 19,3 5,4 7.382,5 38.8,6 47.8,7 1.02,8 1.137,9 0.627,10 7.658}
{0 CHEMBL1504,2 18,3 4,4 7.009,5 38.7,6 50,7 1.01,8 1.133,9 0.627,10 6.747}
{0 CHEMBL1512,2 18,3 4,4 7.009,5 38.7,6 50,7 1.01,8 1.133,9 0.627,10 6.445}
{0 CHEMBL1766,2 16,3 4,4 6.723,5 39.3,6 51.8,7 1.001,8 1.132,9 0.628,10 7.518}
{0 CHEMBL2103774,2 16,3 2,4 6.127,5 41.2,6 54.9,7 0.981,8 1.122,9 0.639,10 6.658}
{0 CHEMBL2107797,2 16,3 2,4 6.127,5 41.2,6 54.9,7 0.981,8 1.122,9 0.639,10 8.455}
{0 CHEMBL241694,2 16,3 2,4 6.127,5 41.2,6 54.9,7 0.981,8 1.122,9 0.639,10 7.229}
{0 CHEMBL27769,2 18,3 1,4 5.696,5 37.3,6 58.8,7 0.979,8 1.13,9 0.614,10 5.904}
{0 CHEMBL282575,1 12,2 12,3 1,4 6.724,5 44.6,6 50,7 0.988,8 1.115,9 0.661,10 5.46}
{0 CHEMBL384467,2 16,3 4,4 6.886,5 38.6,6 50.9,7 1.007,8 1.134,9 0.625,10 4.633}
{0 CHEMBL386630,2 16,3 2,4 5.887,5 38.8,6 57.1,7 0.98,8 1.127,9 0.624,10 5.713}
{0 CHEMBL411,1 12,2 4,3 1,4 6.709,5 45,6 50,7 0.987,8 1.114,9 0.663,10 5.33}
{0 CHEMBL434063,1 24,2 5,3 2,4 7.509,5 45.5,6 43.9,7 1.002,8 1.117,9 0.678,10 4.514}
{0 CHEMBL691,1 6,2 12,4 6.444,5 43.5,6 52.2,7 0.984,8 1.117,9 0.653,10 5.972}
{0 CHEMBL7002,1 6,2 10,3 2,4 7.25,5 39.1,6 50,7 0.997,8 1.122,9 0.661,10 4.536}
{0 CHEMBL717,2 19,3 4,4 6.235,5 38.7,6 54.8,7 0.989,8 1.127,9 0.625,10 6.148}
{0 CHEMBL757,2 15,3 2,4 5.966,5 39.1,6 56.5,7 0.981,8 1.126,9 0.626,10 6.766}
{0 CHEMBL808,1 17,2 3,4 9.787,5 46.2,6 38.5,7 1.015,8 1.112,9 0.747,10 4.991}
{0 CHEMBL83,1 18,2 6,3 1,4 6.519,5 45.6,6 50.9,7 0.979,8 1.114,9 0.669,10 4.702}
{0 CHEMBL91,1 17,2 3,4 10.67,5 46.2,6 35.9,7 1.023,8 1.11,9 0.769,10 4.826}
{0 CHEMBL989,2 18,3 4,4 7.299,5 38.7,6 48.4,7 1.018,8 1.138,9 0.626,10 7.585}
