"molecule_id","FCFP4_1024b8","FCFP4_1024b826","FCFP4_1024b778","FCFP4_1024b855","FCFP4_1024b156","FCFP4_1024b298","FCFP4_1024b314","FCFP4_1024b497","FCFP4_1024b796","FCFP4_1024b87","FCFP4_1024b876","FCFP4_1024b679","FCFP4_1024b642","FCFP4_1024b635","FCFP4_1024b604","FCFP4_1024b322","FCFP4_1024b521","FCFP4_1024b2","FCFP4_1024b858","FCFP4_1024b925","FCFP4_1024b351","FCFP4_1024b862","FCFP4_1024b360","FCFP4_1024b18","FCFP4_1024b746","FCFP4_1024b553","FCFP4_1024b787","FCFP4_1024b728","FCFP4_1024b868","FCFP4_1024b490","FCFP4_1024b1","FCFP4_1024b10","FCFP4_1024b100","FCFP4_1024b1000","FCFP4_1024b1001","FCFP4_1024b1002","FCFP4_1024b1003","FCFP4_1024b1004","FCFP4_1024b1005","FCFP4_1024b1006","FCFP4_1024b1007","FCFP4_1024b1008","FCFP4_1024b1009","FCFP4_1024b101","FCFP4_1024b1010","FCFP4_1024b1011","FCFP4_1024b1012","FCFP4_1024b1013","FCFP4_1024b1014","FCFP4_1024b1015","FCFP4_1024b1016","pXC50"
{1 1,17 1,18 1,20 1,24 1,26 1,27 1,30 1,31 1,52 4.523}
{0 CHEMBL141732,1 1,18 1,20 1,23 1,31 1,32 1,52 4.497}
{0 CHEMBL142996,1 1,18 1,20 1,23 1,26 1,27 1,31 1,32 1,52 4.585}
{0 CHEMBL1450,1 1,12 1,18 1,20 1,23 1,31 1,52 5}
{0 CHEMBL1529387,2 1,3 1,4 1,5 1,6 1,7 1,8 1,9 1,10 1,11 1,12 1,13 1,16 1,17 1,21 1,24 1,25 1,31 1,52 4}
{0 CHEMBL1714424,2 1,3 1,4 1,5 1,6 1,7 1,8 1,9 1,10 1,11 1,12 1,13 1,14 1,15 1,16 1,17 1,19 1,21 1,22 1,24 1,25 1,31 1,52 6.215}
{0 CHEMBL1784555,2 1,3 1,4 1,5 1,6 1,7 1,8 1,9 1,10 1,11 1,12 1,13 1,14 1,15 1,16 1,17 1,19 1,21 1,22 1,24 1,25 1,31 1,52 6.004}
{0 CHEMBL1784556,2 1,3 1,4 1,5 1,6 1,7 1,8 1,9 1,10 1,11 1,12 1,13 1,14 1,15 1,16 1,17 1,19 1,21 1,22 1,24 1,25 1,31 1,52 6.553}
{0 CHEMBL1784557,2 1,3 1,4 1,5 1,6 1,7 1,8 1,9 1,10 1,11 1,12 1,13 1,14 1,15 1,16 1,17 1,19 1,21 1,22 1,24 1,25 1,31 1,52 6.086}
{0 CHEMBL1784558,2 1,3 1,4 1,5 1,6 1,7 1,8 1,9 1,10 1,11 1,12 1,13 1,14 1,15 1,16 1,17 1,19 1,21 1,22 1,24 1,25 1,31 1,52 5.377}
{0 CHEMBL1784559,2 1,3 1,4 1,5 1,6 1,7 1,8 1,9 1,10 1,11 1,12 1,13 1,14 1,15 1,16 1,17 1,19 1,21 1,22 1,24 1,25 1,31 1,52 4.62}
{0 CHEMBL1784560,2 1,3 1,4 1,5 1,6 1,7 1,8 1,9 1,10 1,11 1,12 1,13 1,14 1,15 1,16 1,17 1,19 1,21 1,22 1,24 1,25 1,31 1,52 4.301}
{0 CHEMBL1784561,2 1,3 1,4 1,5 1,6 1,7 1,8 1,9 1,10 1,11 1,12 1,13 1,14 1,15 1,16 1,17 1,19 1,21 1,22 1,24 1,25 1,31 1,33 1,52 7.108}
{0 CHEMBL1784562,2 1,3 1,4 1,5 1,6 1,7 1,8 1,9 1,10 1,11 1,12 1,13 1,14 1,15 1,16 1,17 1,19 1,21 1,22 1,24 1,25 1,31 1,52 6.377}
{0 CHEMBL1784563,2 1,3 1,4 1,5 1,6 1,7 1,8 1,9 1,10 1,11 1,12 1,13 1,14 1,15 1,16 1,17 1,19 1,21 1,22 1,24 1,25 1,31 1,52 6.097}
{0 CHEMBL1784564,2 1,3 1,4 1,5 1,6 1,7 1,8 1,9 1,10 1,11 1,12 1,13 1,14 1,15 1,16 1,17 1,19 1,21 1,22 1,24 1,25 1,31 1,52 5.959}
{0 CHEMBL1784565,2 1,3 1,4 1,5 1,6 1,7 1,8 1,9 1,10 1,11 1,12 1,13 1,14 1,15 1,16 1,17 1,19 1,21 1,22 1,24 1,25 1,31 1,52 5.602}
{0 CHEMBL1784566,2 1,3 1,4 1,5 1,6 1,7 1,8 1,9 1,10 1,11 1,12 1,13 1,14 1,15 1,16 1,17 1,18 1,19 1,21 1,22 1,24 1,25 1,31 1,52 6.215}
{0 CHEMBL1784567,2 1,3 1,4 1,5 1,6 1,7 1,8 1,9 1,10 1,11 1,12 1,13 1,14 1,15 1,16 1,17 1,19 1,21 1,22 1,24 1,25 1,31 1,52 6.886}
{0 CHEMBL1784568,2 1,3 1,4 1,5 1,6 1,7 1,8 1,9 1,10 1,11 1,12 1,13 1,14 1,15 1,16 1,17 1,18 1,19 1,21 1,22 1,24 1,25 1,31 1,52 5.268}
{0 CHEMBL1784569,2 1,3 1,4 1,5 1,6 1,7 1,8 1,9 1,10 1,11 1,12 1,13 1,14 1,15 1,16 1,17 1,18 1,19 1,21 1,22 1,24 1,25 1,31 1,52 5.456}
{0 CHEMBL1784570,2 1,3 1,4 1,5 1,6 1,7 1,8 1,9 1,10 1,11 1,12 1,13 1,14 1,15 1,16 1,17 1,18 1,19 1,20 1,21 1,22 1,24 1,25 1,31 1,52 4}
{0 CHEMBL1784571,2 1,3 1,4 1,5 1,6 1,7 1,8 1,9 1,10 1,11 1,12 1,13 1,14 1,15 1,16 1,17 1,19 1,21 1,22 1,24 1,25 1,31 1,52 4.301}
{0 CHEMBL1784572,2 1,3 1,4 1,5 1,6 1,7 1,8 1,9 1,10 1,11 1,12 1,13 1,14 1,15 1,16 1,17 1,18 1,19 1,21 1,22 1,24 1,25 1,31 1,52 4.357}
{0 CHEMBL1784573,2 1,3 1,4 1,5 1,6 1,7 1,8 1,9 1,10 1,11 1,12 1,13 1,14 1,15 1,16 1,17 1,19 1,21 1,22 1,24 1,25 1,31 1,32 1,52 6}
{0 CHEMBL1784574,2 1,3 1,4 1,5 1,6 1,7 1,8 1,9 1,10 1,11 1,12 1,13 1,14 1,15 1,16 1,17 1,19 1,21 1,22 1,24 1,25 1,31 1,33 1,52 7.456}
{0 CHEMBL1784575,2 1,3 1,4 1,5 1,6 1,7 1,8 1,9 1,10 1,11 1,12 1,13 1,14 1,15 1,16 1,17 1,19 1,21 1,22 1,24 1,25 1,31 1,52 6.26}
{0 CHEMBL1784576,2 1,3 1,4 1,5 1,6 1,7 1,8 1,9 1,10 1,11 1,12 1,13 1,14 1,15 1,16 1,17 1,19 1,21 1,22 1,24 1,25 1,31 1,52 6.268}
{0 CHEMBL1784577,2 1,3 1,4 1,5 1,6 1,7 1,8 1,9 1,10 1,11 1,12 1,13 1,14 1,15 1,16 1,17 1,19 1,21 1,22 1,24 1,25 1,31 1,52 6.721}
{0 CHEMBL1784578,2 1,3 1,4 1,5 1,6 1,7 1,8 1,9 1,10 1,11 1,12 1,13 1,14 1,15 1,16 1,17 1,19 1,21 1,22 1,24 1,25 1,31 1,52 7.194}
{0 CHEMBL1784579,2 1,3 1,4 1,5 1,6 1,7 1,8 1,9 1,10 1,11 1,12 1,13 1,14 1,15 1,16 1,17 1,18 1,19 1,21 1,22 1,24 1,25 1,31 1,52 5.796}
{0 CHEMBL1784580,2 1,3 1,4 1,5 1,6 1,7 1,8 1,9 1,10 1,11 1,12 1,13 1,14 1,15 1,16 1,17 1,19 1,21 1,22 1,24 1,25 1,31 1,52 7.046}
{0 CHEMBL1784581,2 1,3 1,4 1,5 1,6 1,7 1,8 1,9 1,10 1,11 1,12 1,13 1,14 1,15 1,16 1,17 1,19 1,21 1,22 1,24 1,25 1,31 1,52 4.678}
{0 CHEMBL1784582,2 1,3 1,4 1,5 1,6 1,7 1,8 1,9 1,10 1,11 1,12 1,13 1,16 1,17 1,21 1,24 1,25 1,28 1,29 1,31 1,52 4}
{0 CHEMBL1784583,2 1,3 1,4 1,5 1,6 1,7 1,8 1,9 1,10 1,11 1,12 1,13 1,16 1,17 1,21 1,24 1,25 1,28 1,29 1,31 1,52 4}
{0 CHEMBL1784584,2 1,3 1,4 1,5 1,6 1,7 1,8 1,9 1,10 1,11 1,12 1,13 1,16 1,17 1,21 1,24 1,25 1,28 1,29 1,31 1,52 4}
{0 CHEMBL1784585,2 1,3 1,4 1,5 1,6 1,7 1,8 1,9 1,10 1,11 1,12 1,13 1,16 1,17 1,21 1,24 1,25 1,28 1,29 1,31 1,52 4}
{0 CHEMBL1784586,2 1,3 1,4 1,5 1,6 1,7 1,8 1,9 1,10 1,11 1,12 1,13 1,16 1,17 1,21 1,24 1,25 1,28 1,29 1,31 1,52 4}
{0 CHEMBL1784587,2 1,3 1,4 1,5 1,6 1,7 1,8 1,9 1,10 1,11 1,12 1,13 1,16 1,17 1,21 1,24 1,25 1,28 1,29 1,31 1,52 4}
{0 CHEMBL1784588,2 1,3 1,4 1,5 1,6 1,7 1,8 1,9 1,10 1,11 1,12 1,13 1,16 1,17 1,21 1,24 1,25 1,28 1,29 1,31 1,52 4.237}
{0 CHEMBL1784589,2 1,3 1,4 1,5 1,6 1,7 1,8 1,9 1,10 1,11 1,12 1,13 1,16 1,17 1,21 1,24 1,25 1,31 1,52 6.301}
{0 CHEMBL1784590,2 1,3 1,4 1,5 1,6 1,7 1,8 1,9 1,10 1,11 1,12 1,13 1,16 1,17 1,21 1,24 1,25 1,31 1,52 6.215}
{0 CHEMBL1784591,2 1,3 1,4 1,5 1,6 1,7 1,8 1,9 1,10 1,11 1,12 1,13 1,16 1,17 1,21 1,24 1,25 1,31 1,52 5.921}
{0 CHEMBL1784592,2 1,3 1,4 1,5 1,6 1,7 1,8 1,9 1,10 1,11 1,12 1,13 1,16 1,17 1,18 1,21 1,24 1,25 1,31 1,52 5.337}
{0 CHEMBL1784593,2 1,3 1,4 1,5 1,6 1,7 1,8 1,9 1,10 1,11 1,12 1,13 1,16 1,17 1,21 1,24 1,25 1,31 1,52 6.268}
{0 CHEMBL1784594,2 1,3 1,4 1,5 1,6 1,7 1,8 1,9 1,10 1,11 1,12 1,13 1,16 1,17 1,21 1,24 1,25 1,31 1,52 6.201}
{0 CHEMBL1784595,2 1,3 1,4 1,5 1,6 1,7 1,8 1,9 1,10 1,11 1,12 1,13 1,16 1,17 1,21 1,24 1,25 1,31 1,52 6.174}
{0 CHEMBL1784596,2 1,3 1,4 1,5 1,6 1,7 1,8 1,9 1,10 1,11 1,12 1,13 1,16 1,17 1,18 1,20 1,21 1,24 1,25 1,31 1,52 4}
{0 CHEMBL1784706,2 1,3 1,4 1,5 1,6 1,7 1,8 1,9 1,10 1,11 1,12 1,13 1,16 1,17 1,21 1,24 1,25 1,31 1,52 4}
{0 CHEMBL1784707,2 1,3 1,4 1,5 1,6 1,7 1,8 1,9 1,10 1,11 1,12 1,13 1,16 1,17 1,21 1,24 1,25 1,31 1,52 4}
{0 CHEMBL1784708,2 1,3 1,4 1,5 1,6 1,7 1,8 1,9 1,10 1,11 1,12 1,13 1,16 1,17 1,21 1,24 1,25 1,31 1,52 4.824}
{0 CHEMBL1784709,2 1,3 1,4 1,5 1,6 1,7 1,8 1,9 1,10 1,11 1,12 1,13 1,16 1,17 1,21 1,24 1,25 1,31 1,52 4.585}
{0 CHEMBL1784710,2 1,3 1,4 1,5 1,6 1,7 1,8 1,9 1,10 1,11 1,12 1,13 1,16 1,17 1,21 1,24 1,25 1,31 1,52 5.066}
{0 CHEMBL1784711,2 1,3 1,4 1,5 1,6 1,7 1,8 1,9 1,10 1,11 1,12 1,13 1,14 1,15 1,16 1,17 1,19 1,22 1,24 1,31 1,52 6.108}
{0 CHEMBL1784712,2 1,3 1,4 1,5 1,6 1,7 1,8 1,9 1,10 1,11 1,12 1,13 1,14 1,15 1,16 1,17 1,19 1,22 1,24 1,31 1,52 5.77}
{0 CHEMBL1784713,3 1,4 1,5 1,6 1,7 1,8 1,9 1,10 1,11 1,12 1,14 1,15 1,17 1,19 1,22 1,24 1,31 1,52 6.77}
{0 CHEMBL1784714,2 1,3 1,4 1,5 1,6 1,7 1,8 1,9 1,10 1,11 1,12 1,13 1,14 1,15 1,17 1,19 1,21 1,24 1,31 1,52 5.77}
{0 CHEMBL1784715,2 1,3 1,4 1,5 1,6 1,7 1,8 1,9 1,10 1,11 1,12 1,13 1,14 1,15 1,17 1,18 1,19 1,21 1,24 1,31 1,52 5.495}
{0 CHEMBL1784716,2 1,3 1,4 1,5 1,6 1,7 1,8 1,9 1,10 1,11 1,12 1,13 1,14 1,15 1,17 1,19 1,21 1,24 1,31 1,52 4}
{0 CHEMBL1784717,2 1,3 1,4 1,5 1,6 1,7 1,8 1,9 1,10 1,11 1,12 1,13 1,14 1,15 1,17 1,19 1,21 1,24 1,31 1,52 5.854}
{0 CHEMBL199572,1 1,18 1,20 1,23 1,26 1,27 1,30 1,31 1,45 1,52 4.371}
{0 CHEMBL199574,1 1,18 1,20 1,23 1,31 1,45 1,52 4.785}
{0 CHEMBL211501,1 1,18 1,20 1,24 1,31 1,49 1,52 5}
{0 CHEMBL2170881,1 1,17 1,18 1,20 1,24 1,26 1,27 1,30 1,31 1,52 4.523}
{0 CHEMBL2170884,1 1,17 1,18 1,20 1,24 1,26 1,27 1,30 1,31 1,52 4.523}
{0 CHEMBL2170887,1 1,17 1,18 1,20 1,24 1,26 1,27 1,30 1,31 1,52 4.523}
{0 CHEMBL2178105,17 1,18 1,20 1,24 1,31 1,52 5.714}
{0 CHEMBL2178108,2 1,14 1,17 1,18 1,19 1,20 1,21 1,24 1,31 1,52 6.119}
{0 CHEMBL2178109,17 1,18 1,20 1,24 1,31 1,52 5.331}
{0 CHEMBL217893,18 1,20 1,21 1,31 1,52 6.638}
{0 CHEMBL217897,1 1,18 1,20 1,23 1,26 1,27 1,31 1,52 4.062}
{0 CHEMBL217951,18 1,20 1,21 1,31 1,52 6.745}
{0 CHEMBL218467,1 1,17 1,18 1,20 1,23 1,24 1,31 1,52 6.796}
{0 CHEMBL218703,1 1,18 1,20 1,23 1,24 1,31 1,32 1,52 6.357}
{0 CHEMBL219855,1 1,17 1,18 1,20 1,23 1,24 1,31 1,52 4.396}
{0 CHEMBL219856,1 1,18 1,20 1,21 1,23 1,31 1,52 4.398}
{0 CHEMBL222556,1 1,18 1,20 1,31 1,52 5.023}
{0 CHEMBL224182,14 1,18 1,20 1,24 1,31 1,52 5.398}
{0 CHEMBL269671,18 1,19 1,20 1,31 1,52 5}
{0 CHEMBL275638,18 1,20 1,31 1,52 5}
{0 CHEMBL370865,1 1,18 1,20 1,23 1,26 1,27 1,31 1,45 1,52 4.752}
{0 CHEMBL372561,1 1,18 1,20 1,23 1,30 1,31 1,45 1,52 4.499}
{0 CHEMBL387254,1 1,18 1,20 1,23 1,26 1,27 1,31 1,32 1,52 4.672}
{0 CHEMBL397686,52 5}
{0 CHEMBL413583,1 1,18 1,20 1,21 1,23 1,31 1,52 4.401}
{0 CHEMBL429023,18 1,20 1,31 1,52 5}
{0 CHEMBL435137,1 1,18 1,20 1,23 1,24 1,31 1,34 1,52 4.556}
{0 CHEMBL446825,2 1,3 1,4 1,5 1,6 1,7 1,8 1,9 1,10 1,11 1,12 1,13 1,14 1,15 1,16 1,17 1,19 1,21 1,22 1,24 1,25 1,31 1,52 4}
{0 CHEMBL449358,2 1,3 1,4 1,5 1,6 1,7 1,8 1,9 1,10 1,11 1,12 1,13 1,14 1,15 1,16 1,17 1,21 1,22 1,24 1,25 1,31 1,52 4.347}
{0 CHEMBL451880,2 1,3 1,4 1,5 1,6 1,7 1,8 1,9 1,10 1,11 1,12 1,13 1,14 1,15 1,16 1,17 1,19 1,21 1,22 1,24 1,25 1,31 1,52 5.921}
{0 CHEMBL475813,2 1,3 1,4 1,5 1,6 1,7 1,8 1,9 1,10 1,11 1,12 1,13 1,14 1,15 1,16 1,17 1,19 1,21 1,22 1,24 1,25 1,31 1,52 7.328}
{0 CHEMBL475814,2 1,3 1,4 1,5 1,6 1,7 1,8 1,9 1,10 1,11 1,12 1,13 1,14 1,15 1,16 1,17 1,19 1,21 1,22 1,24 1,25 1,31 1,52 7.252}
{0 CHEMBL481680,52 5}
{0 CHEMBL483161,1 1,18 1,20 1,23 1,26 1,27 1,31 1,32 1,52 5.066}
{0 CHEMBL483552,1 1,18 1,20 1,23 1,26 1,27 1,31 1,32 1,52 5.398}
{0 CHEMBL483994,1 1,18 1,20 1,23 1,26 1,27 1,31 1,32 1,52 4.292}
{0 CHEMBL483995,1 1,18 1,20 1,23 1,26 1,27 1,31 1,32 1,52 4.668}
{0 CHEMBL484294,2 1,3 1,4 1,5 1,6 1,7 1,8 1,9 1,10 1,11 1,12 1,13 1,14 1,15 1,16 1,17 1,19 1,22 1,24 1,31 1,52 6.721}
{0 CHEMBL484305,2 1,3 1,4 1,5 1,6 1,7 1,8 1,9 1,10 1,11 1,12 1,13 1,14 1,15 1,16 1,17 1,18 1,19 1,20 1,21 1,22 1,24 1,25 1,31 1,52 5.699}
{0 CHEMBL484531,1 1,18 1,20 1,23 1,26 1,27 1,31 1,32 1,52 4.324}
{0 CHEMBL484594,1 1,18 1,20 1,23 1,26 1,27 1,31 1,32 1,52 4.991}
{0 CHEMBL484595,1 1,18 1,20 1,23 1,26 1,27 1,31 1,32 1,52 4.309}
{0 CHEMBL484602,1 1,18 1,20 1,23 1,26 1,27 1,31 1,32 1,36 1,52 4.243}
{0 CHEMBL484780,1 1,18 1,20 1,23 1,26 1,27 1,31 1,32 1,52 4.688}
{0 CHEMBL486489,2 1,3 1,4 1,5 1,6 1,7 1,8 1,9 1,10 1,11 1,12 1,13 1,14 1,15 1,17 1,19 1,21 1,23 1,24 1,31 1,52 6.796}
{0 CHEMBL486490,2 1,5 1,6 1,7 1,8 1,9 1,10 1,11 1,12 1,13 1,17 1,18 1,21 1,24 1,25 1,31 1,52 5.523}
{0 CHEMBL486697,2 1,5 1,6 1,7 1,8 1,9 1,10 1,11 1,12 1,13 1,17 1,18 1,21 1,24 1,25 1,31 1,52 4.032}
{0 CHEMBL487518,1 1,2 1,3 1,4 1,5 1,6 1,7 1,8 1,9 1,10 1,11 1,12 1,13 1,14 1,15 1,16 1,17 1,21 1,22 1,24 1,25 1,31 1,52 6.481}
{0 CHEMBL503135,2 1,3 1,4 1,5 1,6 1,7 1,8 1,9 1,10 1,11 1,12 1,13 1,14 1,15 1,16 1,17 1,20 1,21 1,22 1,24 1,25 1,31 1,52 5.77}
{0 CHEMBL505315,1 1,18 1,20 1,23 1,26 1,27 1,31 1,32 1,52 4.565}
{0 CHEMBL519160,1 1,18 1,20 1,23 1,26 1,27 1,31 1,32 1,52 4.59}
{0 CHEMBL519836,2 1,3 1,4 1,5 1,6 1,7 1,8 1,9 1,10 1,11 1,12 1,13 1,14 1,15 1,16 1,17 1,19 1,22 1,24 1,31 1,52 6.678}
{0 CHEMBL520008,1 1,18 1,20 1,23 1,26 1,27 1,31 1,32 1,52 4.553}
{0 CHEMBL520306,1 1,18 1,20 1,23 1,26 1,27 1,31 1,32 1,36 1,52 5.208}
{0 CHEMBL520999,1 1,18 1,20 1,23 1,26 1,27 1,31 1,32 1,52 5.463}
{0 CHEMBL582694,2 1,3 1,4 1,5 1,6 1,7 1,8 1,9 1,10 1,11 1,12 1,13 1,14 1,15 1,16 1,17 1,18 1,19 1,21 1,22 1,24 1,25 1,31 1,52 6.086}
{0 CHEMBL586157,2 1,3 1,4 1,5 1,6 1,7 1,8 1,9 1,10 1,11 1,12 1,13 1,14 1,15 1,16 1,17 1,19 1,21 1,22 1,24 1,25 1,31 1,52 6.658}
{0 CHEMBL600255,2 1,3 1,4 1,5 1,6 1,7 1,8 1,9 1,10 1,11 1,12 1,13 1,14 1,15 1,16 1,17 1,19 1,21 1,22 1,24 1,25 1,31 1,52 6.658}
{0 CHEMBL973,1 1,18 1,20 1,23 1,31 1,32 1,52 4.658}
