"molecule_id","nHet","RBN","N.","AMW","C.","H.","Me","Mi","Mp","Mv","MW","nAB","nAT","nB","nBM","nBO","nBR","nBT","nC","nCL","nCsp","nCsp2","nCsp3","nDB","pXC50"
{1 5,2 5,3 4.6,4 6.302,5 38.5,6 53.8,7 0.986,8 1.132,9 0.632,10 0.583,11 409.63,12 11,13 65,15 12,16 33,18 68,19 25,22 11,23 14,24 1,25 5.873}
{0 CHEMBL100911,1 5,2 5,3 4.2,4 6.165,5 38,6 54.9,7 0.984,8 1.132,9 0.629,10 0.577,11 437.69,12 11,13 71,15 12,16 35,18 74,19 27,22 11,23 16,24 1,25 6}
{0 CHEMBL101516,1 5,2 5,3 4.6,4 6.549,5 38.5,6 53.8,7 0.982,8 1.127,9 0.651,10 0.591,11 425.7,12 11,13 65,15 12,16 33,18 68,19 25,22 11,23 14,24 1,25 6.348}
{0 CHEMBL101623,1 5,2 3,3 5.1,4 6.467,5 39,6 52.5,7 0.989,8 1.131,9 0.637,10 0.591,11 381.57,12 11,13 59,15 12,16 31,18 62,19 23,22 11,23 12,24 1,25 6}
{0 CHEMBL101694,1 5,2 2,3 1.5,4 7.04,5 44.6,6 47.7,7 0.995,8 1.116,9 0.665,10 0.627,11 457.61,12 12,13 65,15 13,16 41,18 72,19 29,22 13,23 16,24 1,25 6}
{0 CHEMBL104159,1 4,3 1.8,4 7.045,5 45.6,6 47.4,7 0.992,8 1.114,9 0.671,10 0.632,11 401.54,12 12,13 57,15 13,16 36,18 63,19 26,22 13,23 13,24 1,25 7.056}
{0 CHEMBL104179,1 5,3 1.7,4 7.199,5 44.8,6 46.6,7 0.998,8 1.116,9 0.668,10 0.633,11 417.54,12 12,13 58,15 13,16 37,18 64,19 26,22 13,23 13,24 1,25 6}
{0 CHEMBL105081,1 5,2 2,3 1.5,4 7.04,5 44.6,6 47.7,7 0.995,8 1.116,9 0.665,10 0.627,11 457.61,12 12,13 65,15 13,16 41,18 72,19 29,22 13,23 16,24 1,25 6.833}
{0 CHEMBL107670,1 3,2 2,3 3.8,4 6.664,5 44.2,6 50,7 0.983,8 1.119,9 0.665,10 0.617,11 346.51,12 16,13 52,15 16,16 30,18 56,19 23,22 14,23 9,25 6.476}
{0 CHEMBL108076,1 5,2 4,3 4.8,4 6.381,5 38.7,6 53.2,7 0.987,8 1.131,9 0.635,10 0.587,11 395.6,12 11,13 62,15 12,16 32,18 65,19 24,22 11,23 13,24 1,25 6.301}
{0 CHEMBL115800,1 4,2 6,3 3.6,4 6.331,5 39.3,6 53.6,7 0.986,8 1.129,9 0.635,10 0.587,11 354.54,12 6,13 56,15 9,16 28,18 58,19 22,22 10,23 12,24 3,25 7.717}
{0 CHEMBL116262,1 4,2 4,3 3.6,4 6.331,5 39.3,6 53.6,7 0.986,8 1.129,9 0.635,10 0.587,11 354.54,12 6,13 56,15 8,16 29,18 59,19 22,22 8,23 14,24 2,25 8.119}
{0 CHEMBL116630,1 4,2 6,3 3.4,4 6.148,5 37.9,6 55.2,7 0.985,8 1.132,9 0.627,10 0.575,11 356.56,12 6,13 58,15 8,16 28,18 60,19 22,22 8,23 14,24 2,25 7.654}
{0 CHEMBL117008,1 3,2 4,3 3.5,4 5.975,5 38.6,6 56.1,7 0.979,8 1.13,9 0.63,10 0.573,11 340.56,12 6,13 57,15 7,16 28,18 60,19 22,22 7,23 15,24 1,25 9.092}
{0 CHEMBL117370,1 4,2 5,3 3.4,4 6.148,5 37.9,6 55.2,7 0.985,8 1.132,9 0.627,10 0.575,11 356.56,12 6,13 58,15 8,16 28,18 60,19 22,22 8,23 14,24 2,25 8.39}
{0 CHEMBL117782,1 4,2 4,3 3.6,4 6.331,5 39.3,6 53.6,7 0.986,8 1.129,9 0.635,10 0.587,11 354.54,12 6,13 56,15 8,16 29,18 59,19 22,22 8,23 14,24 2,25 8.251}
{0 CHEMBL117859,1 4,2 5,3 3.6,4 6.228,5 38.2,6 54.5,7 0.986,8 1.131,9 0.629,10 0.579,11 342.53,12 6,13 55,15 8,16 27,18 57,19 21,22 8,23 13,24 2,25 7.987}
{0 CHEMBL119162,1 4,2 5,3 3.2,4 6.171,5 38.7,6 54.8,7 0.984,8 1.13,9 0.631,10 0.579,11 382.6,12 6,13 62,15 8,16 31,18 65,19 24,22 8,23 16,24 2,25 7.699}
{0 CHEMBL119473,1 4,2 6,3 3.4,4 6.148,5 37.9,6 55.2,7 0.985,8 1.132,9 0.627,10 0.575,11 356.56,12 6,13 58,15 8,16 28,18 60,19 22,22 8,23 14,24 2,25 7.095}
{0 CHEMBL119524,1 4,2 4,3 3.8,4 6.317,5 38.5,6 53.8,7 0.987,8 1.131,9 0.631,10 0.583,11 328.5,12 6,13 52,15 8,16 26,18 54,19 20,22 8,23 12,24 2,25 7.328}
{0 CHEMBL13470,1 5,2 9,3 4.2,4 6.246,5 38.9,6 54.2,7 0.984,8 1.13,9 0.634,10 0.583,11 449.7,12 12,13 72,15 14,16 35,18 74,19 28,22 15,23 13,24 2,25 5.87}
{0 CHEMBL146030,1 2,2 4,3 2.1,4 5.947,5 39.6,6 56.3,7 0.977,8 1.127,9 0.632,10 0.575,11 285.47,12 6,13 48,15 7,16 23,18 50,19 19,22 8,23 11,24 1,25 8.229}
{0 CHEMBL146575,1 2,2 3,3 2.2,4 6.162,5 41.3,6 54.3,7 0.979,8 1.124,9 0.643,10 0.588,11 283.45,12 6,13 46,15 7,16 23,18 48,19 19,21 2,22 6,23 11,25 7.959}
{0 CHEMBL146775,1 3,2 3,3 4.4,4 6.321,5 40,6 53.3,7 0.983,8 1.128,9 0.641,10 0.59,11 284.44,12 6,13 45,15 7,16 23,18 47,19 18,21 1,22 6,23 11,25 6.62}
{0 CHEMBL147539,1 13,2 16,3 8.1,4 6.951,5 34.9,6 50,7 1.007,8 1.142,9 0.622,10 0.592,11 597.8,12 12,13 86,15 17,16 44,18 87,19 30,22 17,23 13,24 5,25 6}
{0 CHEMBL147581,1 2,2 5,3 2,4 5.873,5 39.2,6 56.9,7 0.976,8 1.128,9 0.63,10 0.571,11 299.5,12 6,13 51,15 7,16 24,18 53,19 20,22 8,23 12,24 1,25 8.237}
{0 CHEMBL147649,1 3,2 5,3 3.9,4 6.127,5 39.2,6 54.9,7 0.981,8 1.129,9 0.635,10 0.581,11 312.5,12 6,13 51,15 7,16 25,18 53,19 20,21 1,22 6,23 13,25 7.959}
{0 CHEMBL147784,1 3,2 5,3 3.9,4 6.127,5 39.2,6 54.9,7 0.981,8 1.129,9 0.635,10 0.581,11 312.5,12 6,13 51,15 7,16 25,18 53,19 20,21 1,22 6,23 13,25 6.301}
{0 CHEMBL147945,1 2,2 1,3 2.3,4 6.266,5 41.9,6 53.5,7 0.98,8 1.123,9 0.647,10 0.594,11 269.42,12 6,13 43,15 7,16 22,18 45,19 18,21 2,22 6,23 10,25 8.409}
{0 CHEMBL148019,1 2,2 4,3 2.1,4 5.947,5 39.6,6 56.3,7 0.977,8 1.127,9 0.632,10 0.575,11 285.47,12 6,13 48,15 7,16 23,18 50,19 19,22 8,23 11,24 1,25 6.398}
{0 CHEMBL148075,1 3,2 4,3 4.2,4 6.218,5 39.6,6 54.2,7 0.982,8 1.129,9 0.638,10 0.585,11 298.47,12 6,13 48,15 7,16 24,18 50,19 19,21 1,22 6,23 12,25 8.161}
{0 CHEMBL148086,1 3,2 2,3 4.8,4 6.438,5 40.5,6 52.4,7 0.985,8 1.128,9 0.645,10 0.596,11 270.41,12 6,13 42,15 7,16 22,18 44,19 17,21 1,22 6,23 10,25 6.222}
{0 CHEMBL148240,1 3,2 4,3 4.2,4 6.218,5 39.6,6 54.2,7 0.982,8 1.129,9 0.638,10 0.585,11 298.47,12 6,13 48,15 7,16 24,18 50,19 19,21 1,22 6,23 12,25 5.886}
{0 CHEMBL148588,1 15,2 16,3 11,4 7.29,5 34.1,6 47.6,7 1.014,8 1.146,9 0.624,10 0.602,11 597.76,12 12,13 82,15 18,16 44,18 83,19 28,22 18,23 10,24 6,25 6}
{0 CHEMBL149490,1 3,2 3,3 4.4,4 6.321,5 40,6 53.3,7 0.983,8 1.128,9 0.641,10 0.59,11 284.44,12 6,13 45,15 7,16 23,18 47,19 18,21 1,22 6,23 11,25 9.398}
{0 CHEMBL149491,1 3,2 2,3 4.8,4 6.438,5 40.5,6 52.4,7 0.985,8 1.128,9 0.645,10 0.596,11 270.41,12 6,13 42,15 7,16 22,18 44,19 17,21 1,22 6,23 10,25 9.398}
{0 CHEMBL149867,1 15,2 16,3 10.6,4 7.198,5 34.1,6 48.2,7 1.012,8 1.146,9 0.623,10 0.599,11 611.79,12 12,13 85,15 18,16 45,18 86,19 29,22 18,23 11,24 6,25 6}
{0 CHEMBL150121,1 16,2 20,3 10.4,4 6.968,5 33.3,6 50,7 1.008,8 1.147,9 0.617,10 0.589,11 668.9,12 12,13 96,15 18,16 49,18 97,19 32,22 18,23 14,24 6,25 6}
{0 CHEMBL150163,1 2,2 2,3 2.3,4 6.266,5 41.9,6 53.5,7 0.98,8 1.123,9 0.647,10 0.594,11 269.42,12 6,13 43,15 7,16 22,18 45,19 18,21 2,22 6,23 10,25 8.854}
{0 CHEMBL1770603,1 3,2 2,3 2.3,4 7.382,5 48.8,6 44.2,7 0.993,8 1.108,9 0.692,10 0.656,11 317.41,12 18,13 43,15 18,16 27,18 46,19 21,22 18,23 3,25 5.664}
{0 CHEMBL1795711,1 7,2 4,3 3.2,4 9.087,5 42.9,6 46,7 0.999,8 1.117,9 0.701,10 0.644,11 572.48,12 12,13 63,15 13,16 40,18 69,19 27,22 13,23 14,24 1,25 10.523}
{0 CHEMBL1795712,1 7,2 4,3 3.3,4 9.307,5 43.3,6 45,7 1.001,8 1.116,9 0.706,10 0.651,11 558.45,12 12,13 60,15 14,16 38,18 65,19 26,22 15,23 11,24 2,25 10.097}
{0 CHEMBL1795713,1 7,2 2,3 3.6,4 9.507,5 42.9,6 44.6,7 1.003,8 1.117,9 0.708,10 0.653,11 532.41,12 12,13 56,15 13,16 36,18 61,19 24,22 13,23 11,24 1,25 7.326}
{0 CHEMBL19019,1 5,2 2,3 2.1,4 7.113,5 41.7,6 47.9,7 1.003,8 1.123,9 0.65,10 0.618,11 341.44,12 6,13 48,15 7,16 30,18 53,19 20,22 7,23 13,24 1,25 7.74}
{0 CHEMBL1907786,1 13,2 9,3 4.4,4 8.745,5 46.2,6 39.6,7 1.012,8 1.111,9 0.715,10 0.683,11 795.79,12 24,13 91,15 31,16 61,18 97,19 42,20 2,22 34,23 8,24 7,25 8.921}
{0 CHEMBL1907787,1 21,2 17,3 6.7,4 8.605,5 42,6 40.3,7 1.02,8 1.123,9 0.689,10 0.666,11 1024.03,12 24,13 119,15 35,16 77,18 125,19 50,20 2,22 38,23 12,24 11,25 8.187}
{0 CHEMBL1907788,1 15,2 11,3 5.1,4 8.703,5 44.9,6 39.8,7 1.015,8 1.115,9 0.707,10 0.678,11 852.85,12 24,13 98,15 32,16 65,18 104,19 44,20 2,22 35,23 9,24 8,25 8.921}
{0 CHEMBL1907789,1 17,2 13,3 5.7,4 8.666,5 43.8,6 40,7 1.017,8 1.118,9 0.7,10 0.673,11 909.91,12 24,13 105,15 33,16 69,18 111,19 46,20 2,22 36,23 10,24 9,25 8.824}
{0 CHEMBL2051964,1 4,2 3,3 2,4 6.234,5 36.7,6 55.1,7 0.991,8 1.133,9 0.618,10 0.572,11 305.46,12 6,13 49,15 7,16 23,18 50,19 18,22 7,23 11,24 1,25 8.022}
{0 CHEMBL2114080,1 3,2 4,3 2.2,4 6.121,5 37.8,6 55.6,7 0.986,8 1.131,9 0.623,10 0.573,11 275.43,12 6,13 45,15 6,16 22,18 47,19 17,22 6,23 11,25 5.301}
{0 CHEMBL2163531,1 6,2 4,3 3,4 6.646,5 39.4,6 51.5,7 0.995,8 1.128,9 0.637,10 0.596,11 438.62,12 6,13 66,15 8,16 37,18 71,19 26,22 9,23 17,24 2,25 7.747}
{0 CHEMBL2163532,1 6,2 4,3 2.7,4 6.631,5 40.5,6 51.4,7 0.992,8 1.126,9 0.642,10 0.6,11 490.7,12 6,13 74,15 8,16 43,18 81,19 30,22 9,23 21,24 2,25 8.149}
{0 CHEMBL2163533,1 7,2 5,3 3.2,4 9.087,5 42.9,6 46,7 0.999,8 1.117,9 0.701,10 0.644,11 572.48,12 12,13 63,15 14,16 39,18 68,19 27,22 15,23 12,24 2,25 7}
{0 CHEMBL2163534,1 7,2 4,3 3.3,4 9.307,5 43.3,6 45,7 1.001,8 1.116,9 0.706,10 0.651,11 558.45,12 12,13 60,15 14,16 38,18 65,19 26,22 15,23 11,24 2,25 7.915}
{0 CHEMBL2163535,1 7,2 4,3 3.3,4 9.307,5 43.3,6 45,7 1.001,8 1.116,9 0.706,10 0.651,11 558.45,12 12,13 60,15 14,16 38,18 65,19 26,22 15,23 11,24 2,25 9}
{0 CHEMBL2163536,1 7,2 4,3 3.3,4 9.307,5 43.3,6 45,7 1.001,8 1.116,9 0.706,10 0.651,11 558.45,12 12,13 60,15 14,16 38,18 65,19 26,22 15,23 11,24 2,25 9.553}
{0 CHEMBL2163537,1 7,2 4,3 3.3,4 7.509,5 43.3,6 45,7 1.009,8 1.126,9 0.661,10 0.636,11 450.55,12 12,13 60,15 14,16 38,18 65,19 26,22 15,23 11,24 2,25 8.688}
{0 CHEMBL2163538,1 7,2 4,3 3.3,4 7.783,5 43.3,6 45,7 1.005,8 1.12,9 0.676,10 0.643,11 467,12 12,13 60,15 14,16 38,18 65,19 26,20 1,22 15,23 11,24 2,25 9.284}
{0 CHEMBL2163539,1 7,2 4,3 3.3,4 8.524,5 43.3,6 45,7 1.004,8 1.118,9 0.685,10 0.646,11 511.45,12 12,13 60,15 14,16 38,17 1,18 65,19 26,22 15,23 11,24 2,25 8.801}
{0 CHEMBL2163540,1 6,2 4,3 3.3,4 7.209,5 43.3,6 46.7,7 1,8 1.121,9 0.662,10 0.629,11 432.56,12 12,13 60,15 14,16 37,18 65,19 26,22 15,23 11,24 2,25 7.846}
{0 CHEMBL2163541,1 6,2 4,3 3.2,4 7.089,5 42.9,6 47.6,7 0.998,8 1.121,9 0.659,10 0.623,11 446.59,12 12,13 63,15 14,16 38,18 68,19 27,22 15,23 12,24 2,25 8.79}
{0 CHEMBL2163542,1 9,2 4,3 3.2,4 7.945,5 42.9,6 42.9,7 1.023,8 1.138,9 0.656,10 0.642,11 500.56,12 12,13 63,15 14,16 41,18 68,19 27,22 15,23 12,24 2,25 9.658}
{0 CHEMBL2163543,1 7,2 5,3 3.1,4 7.228,5 42.2,6 46.9,7 1.003,8 1.123,9 0.655,10 0.625,11 462.59,12 12,13 64,15 14,16 39,18 69,19 27,22 15,23 12,24 2,25 8.304}
{0 CHEMBL2163544,1 7,2 4,3 4.8,4 7.219,5 41.9,6 46.8,7 1.002,8 1.125,9 0.657,10 0.625,11 447.58,12 12,13 62,15 14,16 38,18 67,19 26,22 15,23 11,24 2,25 9.398}
{0 CHEMBL2163545,1 7,2 5,3 4.4,4 6.995,5 41.2,6 48.5,7 0.998,8 1.126,9 0.651,10 0.615,11 475.64,12 12,13 68,15 14,16 40,18 73,19 28,22 15,23 13,24 2,25 7.457}
{0 CHEMBL2163546,1 7,2 4,3 3.3,4 7.353,5 42.6,6 45.9,7 1.005,8 1.122,9 0.659,10 0.631,11 448.56,12 12,13 61,15 14,16 38,18 66,19 26,22 15,23 11,24 2,25 8.561}
{0 CHEMBL2164295,1 9,2 5,3 4.8,4 7.703,5 41.9,6 43.5,7 1.014,8 1.125,9 0.659,10 0.64,11 477.56,12 12,13 62,15 16,16 40,18 67,19 26,22 15,23 11,24 4,25 8.821}
{0 CHEMBL2164296,1 10,2 5,3 3.1,4 8.071,5 42.2,6 42.2,7 1.027,8 1.139,9 0.652,10 0.643,11 516.56,12 12,13 64,15 14,16 42,18 69,19 27,22 15,23 12,24 2,25 8.5}
{0 CHEMBL2164297,1 6,2 4,3 3,4 7.312,5 45.5,6 45.5,7 0.998,8 1.116,9 0.674,10 0.641,11 482.62,12 17,13 66,15 19,16 42,18 72,19 30,22 19,23 11,24 2,25 8.889}
{0 CHEMBL2164298,1 6,2 5,3 2.9,4 7.267,5 45.7,6 45.7,7 0.997,8 1.115,9 0.675,10 0.64,11 508.66,12 18,13 70,15 20,16 44,18 76,19 32,22 21,23 11,24 2,25 7.589}
{0 CHEMBL2164299,1 6,2 3,3 3.8,4 6.99,5 39.6,6 49.1,7 1.002,8 1.129,9 0.641,10 0.608,11 370.49,12 6,13 53,15 8,16 31,18 57,19 21,22 9,23 12,24 2,25 7}
{0 CHEMBL2164300,1 6,2 8,3 2.9,4 6.48,5 38.2,6 52.9,7 0.993,8 1.131,9 0.629,10 0.586,11 440.64,12 6,13 68,15 8,16 36,18 72,19 26,22 9,23 17,24 2,25 8.039}
{0 CHEMBL2164301,1 6,2 14,3 2.3,4 6.103,5 37.2,6 55.8,7 0.986,8 1.132,9 0.62,10 0.57,11 524.82,12 6,13 86,15 8,16 42,18 90,19 32,22 9,23 23,24 2,25 8.029}
{0 CHEMBL2207677,1 4,2 2,3 2,4 6.892,5 43.1,6 49,7 0.994,8 1.12,9 0.657,10 0.617,11 351.48,12 6,13 51,15 8,16 31,18 56,19 22,22 8,23 14,24 2,25 7.248}
{0 CHEMBL2207678,1 3,2 2,3 1.9,4 6.49,5 42.3,6 51.9,7 0.985,8 1.121,9 0.65,10 0.602,11 337.5,12 6,13 52,15 7,16 30,18 57,19 22,22 7,23 15,24 1,25 9.076}
{0 CHEMBL2207679,1 3,2 2,3 2,4 6.71,5 44,6 50,7 0.987,8 1.118,9 0.661,10 0.615,11 335.48,12 6,13 50,15 8,16 30,18 55,19 22,22 9,23 13,24 2,25 8.717}
{0 CHEMBL2207680,1 4,2 2,3 1.9,4 6.67,5 41.5,6 50.9,7 0.992,8 1.123,9 0.647,10 0.604,11 353.5,12 6,13 53,15 7,16 31,18 58,19 22,22 7,23 15,24 1,25 8.117}
{0 CHEMBL2207681,1 4,2 2,3 1.9,4 6.67,5 41.5,6 50.9,7 0.992,8 1.123,9 0.647,10 0.604,11 353.5,12 6,13 53,15 7,16 31,18 58,19 22,22 7,23 15,24 1,25 7.777}
{0 CHEMBL2305067,1 7,2 5,3 3,4 7.114,5 41.8,6 47.8,7 1.001,8 1.123,9 0.652,10 0.62,11 476.62,12 11,13 67,15 13,16 41,18 73,19 28,22 13,23 15,24 2,25 9.377}
{0 CHEMBL263031,1 24,2 32,3 10.3,4 6.811,5 32.2,6 51.4,7 1.007,8 1.149,9 0.61,10 0.579,11 994.37,12 12,13 146,15 22,16 72,18 147,19 47,22 22,23 25,24 10,25 8.839}
{0 CHEMBL266035,1 24,2 32,3 10.1,4 6.768,5 32.2,6 51.7,7 1.006,8 1.149,9 0.609,10 0.578,11 1008.4,12 12,13 149,15 22,16 73,18 150,19 48,22 22,23 26,24 10,25 8.86}
{0 CHEMBL266845,1 24,2 32,3 10.1,4 6.768,5 32.2,6 51.7,7 1.006,8 1.149,9 0.609,10 0.578,11 1008.4,12 12,13 149,15 22,16 73,18 150,19 48,22 22,23 26,24 10,25 8.034}
{0 CHEMBL293273,1 5,2 4,3 4,4 7.827,5 42,6 48,7 0.996,8 1.122,9 0.686,10 0.635,11 391.37,12 12,13 50,15 13,16 28,18 52,19 21,20 2,22 13,23 8,24 1,25 7.932}
{0 CHEMBL294231,1 5,2 3,3 3.5,4 7.955,5 45.6,6 45.6,7 0.994,8 1.114,9 0.703,10 0.654,11 453.44,12 17,13 57,15 18,16 35,18 61,19 26,20 2,22 17,23 9,24 1,25 7.071}
{0 CHEMBL294832,1 5,2 4,3 3.7,4 7.73,5 42.6,6 48.1,7 0.994,8 1.12,9 0.687,10 0.634,11 417.41,12 12,13 54,15 13,16 31,18 57,19 23,20 2,22 13,23 10,24 1,25 8.137}
{0 CHEMBL296184,1 5,2 3,3 4.3,4 8.029,5 42.6,6 46.8,7 0.998,8 1.12,9 0.693,10 0.643,11 377.34,12 12,13 47,15 13,16 27,18 49,19 20,20 2,22 13,23 7,24 1,25 7.256}
{0 CHEMBL297470,1 5,3 1.6,4 7.436,5 47.5,6 44.3,7 0.998,8 1.11,9 0.684,10 0.651,11 453.57,12 17,13 61,15 18,16 41,18 68,19 29,22 17,23 12,24 1,25 5.523}
{0 CHEMBL297525,1 6,2 5,3 3,4 7.054,5 43.3,6 47.8,7 0.997,8 1.12,9 0.66,10 0.624,11 472.63,12 12,13 67,15 14,16 41,18 73,19 29,22 15,23 14,24 2,25 8.252}
{0 CHEMBL297756,1 6,2 5,3 2.9,4 6.952,5 42.9,6 48.6,7 0.995,8 1.121,9 0.657,10 0.619,11 486.66,12 12,13 70,15 14,16 42,18 76,19 30,22 15,23 15,24 2,25 4.767}
{0 CHEMBL297933,1 6,2 3,3 1.5,4 7.176,5 43.9,6 47,7 1,8 1.118,9 0.662,10 0.629,11 473.61,12 12,13 66,15 13,16 42,18 73,19 29,22 13,23 16,24 1,25 5.523}
{0 CHEMBL298314,1 6,2 1,3 1.7,4 7.348,5 44.1,6 45.8,7 1.004,8 1.118,9 0.664,10 0.635,11 433.54,12 12,13 59,15 13,16 38,18 65,19 26,22 13,23 13,24 1,25 5.523}
{0 CHEMBL299314,1 5,2 4,3 3.7,4 7.73,5 42.6,6 48.1,7 0.994,8 1.12,9 0.687,10 0.634,11 417.41,12 12,13 54,15 13,16 31,18 57,19 23,20 2,22 13,23 10,24 1,25 8.284}
{0 CHEMBL302977,1 3,2 3,3 2,4 6.152,5 38.8,6 55.1,7 0.985,8 1.129,9 0.629,10 0.578,11 301.47,12 6,13 49,15 6,16 25,18 52,19 19,22 6,23 13,25 6.26}
{0 CHEMBL303301,1 5,2 5,3 3,4 6.585,5 40.9,6 51.5,7 0.99,8 1.125,9 0.645,10 0.6,11 434.63,12 11,13 66,15 11,16 38,18 72,19 27,22 10,23 17,25 7.409}
{0 CHEMBL304616,1 3,2 3,3 2.4,4 6.224,5 38.1,6 54.8,7 0.988,8 1.131,9 0.626,10 0.577,11 261.4,12 6,13 42,15 6,16 21,18 44,19 16,22 6,23 10,25 6.475}
{0 CHEMBL305146,1 5,2 3,3 3.3,4 7.223,5 45.9,6 45.9,7 0.995,8 1.115,9 0.677,10 0.64,11 440.58,12 17,13 61,15 17,16 40,18 68,19 28,22 16,23 12,25 7.347}
{0 CHEMBL316863,1 5,2 4,3 4.8,4 6.381,5 38.7,6 53.2,7 0.987,8 1.131,9 0.635,10 0.587,11 395.6,12 11,13 62,15 12,16 32,18 65,19 24,22 11,23 13,24 1,25 6}
{0 CHEMBL318361,1 4,3 1.8,4 7.045,5 45.6,6 47.4,7 0.992,8 1.114,9 0.671,10 0.632,11 401.54,12 12,13 57,15 13,16 36,18 63,19 26,22 13,23 13,24 1,25 6}
{0 CHEMBL318598,1 5,3 1.7,4 7.199,5 44.8,6 46.6,7 0.998,8 1.116,9 0.668,10 0.633,11 417.54,12 12,13 58,15 13,16 37,18 64,19 26,22 13,23 13,24 1,25 5.523}
{0 CHEMBL322181,1 5,2 5,3 3.4,4 6.596,5 39.7,6 51.7,7 0.992,8 1.128,9 0.639,10 0.596,11 382.55,12 11,13 58,15 12,16 31,18 61,19 23,22 11,23 12,24 1,25 6.772}
{0 CHEMBL324119,1 4,2 5,3 3.6,4 6.331,5 39.3,6 53.6,7 0.986,8 1.129,9 0.635,10 0.587,11 354.54,12 6,13 56,15 8,16 29,18 59,19 22,22 8,23 14,24 2,25 7.283}
{0 CHEMBL324236,1 5,2 6,3 4.3,4 6.314,5 39.1,6 53.6,7 0.985,8 1.13,9 0.636,10 0.586,11 435.67,12 11,13 69,15 12,16 36,18 73,19 27,22 11,23 16,24 1,25 7.2}
{0 CHEMBL326304,1 4,2 6,3 3.4,4 6.247,5 39,6 54.2,7 0.985,8 1.13,9 0.633,10 0.583,11 368.57,12 6,13 59,15 8,16 30,18 62,19 23,22 8,23 15,24 2,25 7.517}
{0 CHEMBL326540,1 4,2 5,3 3.7,4 6.528,5 40.7,6 51.9,7 0.988,8 1.126,9 0.645,10 0.599,11 352.52,12 6,13 54,15 9,16 28,18 56,19 22,21 2,22 8,23 12,24 2,25 8.205}
{0 CHEMBL326553,1 4,2 4,3 3.4,4 6.247,5 39,6 54.2,7 0.985,8 1.13,9 0.633,10 0.583,11 368.57,12 6,13 59,15 8,16 30,18 62,19 23,22 8,23 15,24 2,25 8.264}
{0 CHEMBL326957,1 4,2 5,3 3.3,4 6.075,5 37.7,6 55.7,7 0.984,8 1.132,9 0.625,10 0.572,11 370.59,12 6,13 61,15 8,16 29,18 63,19 23,22 8,23 15,24 2,25 7}
{0 CHEMBL327745,1 3,2 1,3 4,4 6.89,5 46,6 48,7 0.985,8 1.115,9 0.677,10 0.631,11 344.49,12 17,13 50,15 17,16 30,18 54,19 23,22 15,23 8,25 6.506}
{0 CHEMBL327956,1 5,2 3,3 5.7,4 6.67,5 39.6,6 50.9,7 0.992,8 1.13,9 0.643,10 0.6,11 353.51,12 11,13 53,15 12,16 29,18 56,19 21,22 11,23 10,24 1,25 7.152}
{0 CHEMBL331716,1 4,2 5,3 3.4,4 6.247,5 39,6 54.2,7 0.985,8 1.13,9 0.633,10 0.583,11 368.57,12 6,13 59,15 8,16 30,18 62,19 23,22 8,23 15,24 2,25 7.458}
{0 CHEMBL332390,1 4,2 4,3 3.8,4 6.425,5 39.6,6 52.8,7 0.988,8 1.129,9 0.638,10 0.591,11 340.51,12 6,13 53,15 8,16 28,18 56,19 21,22 8,23 13,24 2,25 8.101}
{0 CHEMBL333621,1 5,2 4,3 3.8,4 6.803,5 37.7,6 52.8,7 0.989,8 1.127,9 0.65,10 0.594,11 360.57,12 5,13 53,15 7,16 28,18 56,19 20,22 6,23 14,24 2,25 8.184}
{0 CHEMBL344108,1 14,2 17,3 8.6,4 7.231,5 34.6,6 48.1,7 1.014,8 1.143,9 0.622,10 0.6,11 585.74,12 12,13 81,15 17,16 43,18 82,19 28,22 17,23 11,24 5,25 6}
{0 CHEMBL356525,1 2,2 2,3 2.4,4 6.129,5 40.5,6 54.8,7 0.98,8 1.126,9 0.639,10 0.584,11 257.41,12 6,13 42,15 7,16 21,18 44,19 17,22 8,23 9,24 1,25 9.523}
{0 CHEMBL357859,1 2,2 3,3 2.2,4 6.032,5 40,6 55.6,7 0.978,8 1.126,9 0.635,10 0.579,11 271.44,12 6,13 45,15 7,16 22,18 47,19 18,22 8,23 10,24 1,25 8.886}
{0 CHEMBL358350,1 13,2 16,3 8.4,4 7.033,5 34.9,6 49.4,7 1.008,8 1.142,9 0.623,10 0.595,11 583.77,12 12,13 83,15 17,16 43,18 84,19 29,22 17,23 12,24 5,25 6}
{0 CHEMBL358665,1 13,2 15,3 8.8,4 7.122,5 35,6 48.8,7 1.01,8 1.142,9 0.624,10 0.598,11 569.74,12 12,13 80,15 17,16 42,18 81,19 28,22 17,23 11,24 5,25 6}
{0 CHEMBL358992,1 3,2 1,3 5.1,4 6.574,5 41,6 51.3,7 0.987,8 1.127,9 0.649,10 0.603,11 256.38,12 6,13 39,15 7,16 21,18 41,19 16,21 1,22 6,23 9,25 7.155}
{0 CHEMBL38576,1 5,2 6,3 4,4 7.827,5 42,6 48,7 0.996,8 1.122,9 0.686,10 0.635,11 391.37,12 12,13 50,15 13,16 28,18 52,19 21,20 2,22 13,23 8,24 1,25 8.602}
{0 CHEMBL401093,1 5,3 4,4 7.489,5 46,6 44,7 1,8 1.116,9 0.68,10 0.649,11 374.47,12 16,13 50,15 16,16 34,18 56,19 23,22 14,23 9,25 7.114}
{0 CHEMBL410611,1 27,2 33,3 10.8,4 7.023,5 31.8,6 50,7 1.013,8 1.151,9 0.609,10 0.584,11 1039.37,12 12,13 148,15 24,16 75,18 149,19 47,22 22,23 25,24 12,25 9.114}
{0 CHEMBL412325,1 24,2 33,3 9.7,4 6.687,5 32.3,6 52.3,7 1.004,8 1.149,9 0.608,10 0.575,11 1036.46,12 12,13 155,15 22,16 75,18 156,19 50,22 22,23 28,24 10,25 8.719}
{0 CHEMBL412689,1 21,2 17,3 6.7,4 8.605,5 42,6 40.3,7 1.02,8 1.123,9 0.689,10 0.666,11 1024.03,12 24,13 119,15 35,16 77,18 125,19 50,20 2,22 38,23 12,24 11,25 6.376}
{0 CHEMBL413530,1 6,2 6,3 5.8,4 7.815,5 40.4,6 48.1,7 0.998,8 1.126,9 0.679,10 0.63,11 406.39,12 12,13 52,15 13,16 29,18 54,19 21,20 2,22 13,23 8,24 1,25 9.921}
{0 CHEMBL415410,1 27,2 34,3 10.2,4 6.888,5 31.8,6 51,7 1.01,8 1.15,9 0.608,10 0.58,11 1081.46,12 12,13 157,15 24,16 78,18 158,19 50,22 22,23 28,24 12,25 8.405}
{0 CHEMBL423565,1 3,2 6,3 3.7,4 6.047,5 38.9,6 55.6,7 0.98,8 1.13,9 0.632,10 0.577,11 326.53,12 6,13 54,15 7,16 26,18 56,19 21,21 1,22 6,23 14,25 7.42}
{0 CHEMBL430441,1 3,2 1,3 2.8,4 6.482,5 38.9,6 52.8,7 0.992,8 1.129,9 0.632,10 0.589,11 233.34,12 6,13 36,15 6,16 19,18 38,19 14,22 6,23 8,25 5.301}
{0 CHEMBL430971,1 13,2 9,3 4.4,4 8.745,5 46.2,6 39.6,7 1.012,8 1.111,9 0.715,10 0.683,11 795.79,12 24,13 91,15 31,16 61,18 97,19 42,20 2,22 34,23 8,24 7,25 7.9}
{0 CHEMBL432056,1 5,3 1.8,4 7.337,5 45.5,6 45.5,7 1,8 1.115,9 0.672,10 0.64,11 403.51,12 12,13 55,15 13,16 36,18 61,19 25,22 13,23 12,24 1,25 5.523}
{0 CHEMBL433508,1 6,2 4,3 4,4 7.089,5 38,6 50,7 1.011,8 1.152,9 0.624,10 0.595,11 354.46,12 6,13 50,15 7,16 27,18 52,19 19,22 7,23 12,24 1,25 9.194}
{0 CHEMBL437242,1 24,2 31,3 10.5,4 6.856,5 32.2,6 51,7 1.008,8 1.15,9 0.61,10 0.581,11 980.34,12 12,13 143,15 22,16 71,18 144,19 46,22 22,23 24,24 10,25 8.936}
{0 CHEMBL441765,1 5,2 4,3 4,4 7.387,5 38,6 52,7 0.993,8 1.13,9 0.662,10 0.605,11 369.37,12 6,13 50,15 7,16 26,18 52,19 19,20 2,22 7,23 12,24 1,25 8.449}
{0 CHEMBL441939,1 26,2 24,3 10.3,4 7.236,5 32.2,6 50,7 1.009,8 1.145,9 0.627,10 0.592,11 1056.49,12 12,13 146,15 22,16 75,18 148,19 47,22 22,23 25,24 10,25 8.52}
{0 CHEMBL449561,1 9,2 6,3 4.2,4 7.384,5 41.7,6 45.8,7 1.007,8 1.125,9 0.655,10 0.629,11 531.66,12 12,13 72,15 16,16 45,18 78,19 30,22 15,23 15,24 4,25 9.638}
{0 CHEMBL453495,1 9,2 5,3 2.7,4 7.598,5 42.5,6 45.2,7 1.015,8 1.136,9 0.652,10 0.63,11 554.66,12 12,13 73,15 14,16 46,18 79,19 31,22 15,23 16,24 2,25 10.155}
{0 CHEMBL456659,1 6,2 7,3 2.9,4 6.48,5 38.2,6 52.9,7 0.993,8 1.131,9 0.629,10 0.586,11 440.64,12 6,13 68,15 7,16 37,18 73,19 26,22 7,23 19,24 1,25 7.602}
{0 CHEMBL457735,1 5,2 8,3 2.9,4 6.183,5 37.7,6 55.1,7 0.987,8 1.132,9 0.624,10 0.575,11 426.66,12 6,13 69,15 6,16 36,18 74,19 26,22 6,23 20,25 8.699}
{0 CHEMBL458089,1 6,2 5,3 2.6,4 6.483,5 39.5,6 52.6,7 0.991,8 1.128,9 0.635,10 0.591,11 492.72,12 6,13 76,15 8,16 42,18 82,19 30,22 9,23 21,24 2,25 9.34}
{0 CHEMBL458971,1 5,2 8,3 1.5,4 6.289,5 38.2,6 54.4,7 0.99,8 1.13,9 0.625,10 0.579,11 427.64,12 6,13 68,15 6,16 36,18 73,19 26,22 6,23 20,25 7.796}
{0 CHEMBL459978,1 6,2 8,3 2.7,4 6.334,5 37.8,6 54.1,7 0.991,8 1.131,9 0.626,10 0.58,11 468.7,12 6,13 74,15 7,16 39,18 79,19 28,22 7,23 21,24 1,25 7.824}
{0 CHEMBL459979,1 6,2 6,3 2.9,4 6.56,5 39.1,6 52.2,7 0.993,8 1.129,9 0.634,10 0.592,11 452.65,12 6,13 69,15 8,16 38,18 74,19 27,22 9,23 18,24 2,25 9.189}
{0 CHEMBL469027,1 5,2 2,3 3,4 6.995,5 44.8,6 47.8,7 0.992,8 1.117,9 0.669,10 0.628,11 468.64,12 16,13 67,15 16,16 43,18 75,19 30,22 14,23 16,25 7.29}
{0 CHEMBL469046,1 5,2 2,3 3,4 6.995,5 44.8,6 47.8,7 0.992,8 1.117,9 0.669,10 0.628,11 468.64,12 16,13 67,15 16,16 43,18 75,19 30,22 14,23 16,25 5.78}
{0 CHEMBL47318,1 17,2 13,3 5.7,4 8.666,5 43.8,6 40,7 1.017,8 1.118,9 0.7,10 0.673,11 909.91,12 24,13 105,15 33,16 69,18 111,19 46,20 2,22 36,23 10,24 9,25 6.77}
{0 CHEMBL476540,1 5,2 2,3 3.3,4 7.223,5 45.9,6 45.9,7 0.995,8 1.115,9 0.677,10 0.64,11 440.58,12 16,13 61,15 16,16 41,18 69,19 28,22 14,23 14,25 8.1}
{0 CHEMBL48344,1 6,2 6,3 5.8,4 7.815,5 40.4,6 48.1,7 0.998,8 1.126,9 0.679,10 0.63,11 406.39,12 12,13 52,15 13,16 29,18 54,19 21,20 2,22 13,23 8,24 1,25 8.347}
{0 CHEMBL483566,1 6,2 5,3 3,4 6.979,5 42.4,6 48.5,7 0.996,8 1.122,9 0.655,10 0.618,11 460.62,12 11,13 66,15 13,16 40,18 72,19 28,22 13,23 15,24 2,25 10.456}
{0 CHEMBL484582,1 7,2 5,3 3.1,4 7.228,5 42.2,6 46.9,7 1.003,8 1.123,9 0.655,10 0.625,11 462.59,12 11,13 64,15 13,16 40,18 70,19 27,22 13,23 14,24 2,25 9.061}
{0 CHEMBL485428,1 7,2 5,3 3,4 7.354,5 41.8,6 47.8,7 0.998,8 1.119,9 0.67,10 0.627,11 492.69,12 11,13 67,15 13,16 41,18 73,19 28,22 13,23 15,24 2,25 10}
{0 CHEMBL485554,1 7,2 3,3 3.3,4 7.276,5 41.7,6 46.7,7 1.005,8 1.124,9 0.653,10 0.624,11 436.55,12 11,13 60,15 13,16 37,18 65,19 25,22 13,23 12,24 2,25 7.26}
{0 CHEMBL485583,1 6,2 5,3 3,4 6.979,5 42.4,6 48.5,7 0.996,8 1.122,9 0.655,10 0.618,11 460.62,12 11,13 66,15 13,16 40,18 72,19 28,22 13,23 15,24 2,25 7.565}
{0 CHEMBL485599,1 7,2 5,3 3,4 7.354,5 41.8,6 47.8,7 0.998,8 1.119,9 0.67,10 0.627,11 492.69,12 11,13 67,15 13,16 41,18 73,19 28,22 13,23 15,24 2,25 10}
{0 CHEMBL485605,1 7,2 5,3 3,4 7.114,5 41.8,6 47.8,7 1.001,8 1.123,9 0.652,10 0.62,11 476.62,12 11,13 67,15 13,16 41,18 73,19 28,22 13,23 15,24 2,25 9.26}
{0 CHEMBL489866,1 6,2 6,3 2.8,4 6.787,5 41.7,6 50,7 0.994,8 1.124,9 0.65,10 0.609,11 488.68,12 12,13 72,15 13,16 42,18 78,19 30,22 13,23 17,24 1,25 10.721}
{0 CHEMBL490666,1 6,2 5,3 2.9,4 6.952,5 42.9,6 48.6,7 0.995,8 1.121,9 0.657,10 0.619,11 486.66,12 12,13 70,15 14,16 42,18 76,19 30,22 15,23 15,24 2,25 9.377}
{0 CHEMBL491075,1 8,2 5,3 2.9,4 7.877,5 42,6 46.4,7 1.004,8 1.121,9 0.677,10 0.637,11 543.53,12 12,13 69,15 13,16 43,18 75,19 29,20 2,22 13,23 16,24 1,25 9.398}
{0 CHEMBL491868,1 6,2 5,3 2.9,4 6.952,5 42.9,6 48.6,7 0.995,8 1.121,9 0.657,10 0.619,11 486.66,12 12,13 70,15 14,16 42,18 76,19 30,22 15,23 15,24 2,25 9.78}
{0 CHEMBL491869,1 7,2 6,3 2.7,4 6.982,5 41.9,6 48.6,7 0.998,8 1.123,9 0.652,10 0.616,11 516.69,12 12,13 74,15 14,16 44,18 80,19 31,22 15,23 16,24 2,25 9.125}
{0 CHEMBL492073,1 6,2 5,3 2.7,4 6.859,5 42.5,6 49.3,7 0.994,8 1.122,9 0.654,10 0.614,11 500.69,12 12,13 73,15 14,16 43,18 79,19 31,22 15,23 16,24 2,25 9.495}
{0 CHEMBL49591,1 15,2 11,3 5.1,4 8.703,5 44.9,6 39.8,7 1.015,8 1.115,9 0.707,10 0.678,11 852.85,12 24,13 98,15 32,16 65,18 104,19 44,20 2,22 35,23 9,24 8,25 6.991}
{0 CHEMBL49704,1 5,2 2,3 1.5,4 7.259,5 47.1,6 45.6,7 0.995,8 1.111,9 0.68,10 0.644,11 493.64,12 17,13 68,15 18,16 45,18 76,19 32,22 17,23 15,24 1,25 5.988}
{0 CHEMBL503928,1 9,2 5,3 2.7,4 7.598,5 42.5,6 45.2,7 1.015,8 1.136,9 0.652,10 0.63,11 554.66,12 12,13 73,15 14,16 46,18 79,19 31,22 15,23 16,24 2,25 9.328}
{0 CHEMBL504916,1 5,2 3,3 3,4 6.995,5 44.8,6 47.8,7 0.992,8 1.117,9 0.669,10 0.628,11 468.64,12 16,13 67,15 16,16 43,18 75,19 30,22 14,23 16,25 7.17}
{0 CHEMBL511773,1 5,2 3,3 2.9,4 6.895,5 44.3,6 48.6,7 0.99,8 1.118,9 0.665,10 0.623,11 482.67,12 16,13 70,15 16,16 44,18 78,19 31,22 14,23 17,25 7.77}
{0 CHEMBL519367,1 7,2 5,3 3,4 7.114,5 41.8,6 47.8,7 1.001,8 1.123,9 0.652,10 0.62,11 476.62,12 11,13 67,15 13,16 41,18 73,19 28,22 13,23 15,24 2,25 10.31}
{0 CHEMBL520557,1 5,2 2,3 3.1,4 7.103,5 45.3,6 46.9,7 0.993,8 1.116,9 0.672,10 0.634,11 454.61,12 16,13 64,15 16,16 42,18 72,19 29,22 14,23 15,25 7.56}
{0 CHEMBL520872,1 6,2 2,3 3.1,4 7.384,5 45.3,6 45.3,7 1.001,8 1.122,9 0.671,10 0.64,11 472.6,12 16,13 64,15 16,16 43,18 72,19 29,22 14,23 15,25 6.48}
{0 CHEMBL522142,1 7,2 5,3 2.9,4 7.209,5 42.9,6 47.1,7 1.002,8 1.126,9 0.656,10 0.624,11 504.65,12 12,13 70,15 14,16 43,18 76,19 30,22 15,23 15,24 2,25 8.796}
{0 CHEMBL523151,1 8,2 5,3 2.9,4 7.877,5 42,6 46.4,7 1.004,8 1.121,9 0.677,10 0.637,11 543.53,12 12,13 69,15 13,16 43,18 75,19 29,20 2,22 13,23 16,24 1,25 7.77}
{0 CHEMBL542150,1 3,2 3,3 2.2,4 6.249,5 39.1,6 54.3,7 0.986,8 1.128,9 0.632,10 0.582,11 287.44,12 6,13 46,15 6,16 24,18 49,19 18,22 6,23 12,25 6.569}
{0 CHEMBL542881,1 4,2 3,3 2.3,4 6.963,5 41.9,6 48.8,7 0.998,8 1.123,9 0.651,10 0.615,11 299.4,12 11,13 43,15 11,16 25,18 46,19 18,22 10,23 8,25 6.721}
{0 CHEMBL544292,1 4,2 3,3 2.1,4 6.456,5 38.3,6 53.2,7 0.993,8 1.13,9 0.628,10 0.585,11 303.44,12 6,13 47,15 6,16 25,18 50,19 18,22 6,23 12,25 5.456}
{0 CHEMBL55244,1 5,2 4,3 3.3,4 7.791,5 45,6 46.7,7 0.992,8 1.115,9 0.697,10 0.646,11 467.47,12 17,13 60,15 18,16 36,18 64,19 27,20 2,22 17,23 10,24 1,25 6.839}
{0 CHEMBL552619,1 4,2 3,3 2.3,4 6.963,5 41.9,6 48.8,7 0.998,8 1.123,9 0.651,10 0.615,11 299.4,12 11,13 43,15 11,16 25,18 46,19 18,22 10,23 8,25 5.824}
{0 CHEMBL55421,1 5,2 3,3 3.9,4 7.909,5 43.1,6 47.1,7 0.996,8 1.119,9 0.693,10 0.642,11 403.38,12 12,13 51,15 13,16 30,18 54,19 22,20 2,22 13,23 9,24 1,25 7.538}
{0 CHEMBL555891,1 3,2 3,3 2.3,4 6.358,5 39.5,6 53.5,7 0.988,8 1.128,9 0.635,10 0.587,11 273.41,12 6,13 43,15 6,16 23,18 46,19 17,22 6,23 11,25 7.469}
{0 CHEMBL55705,1 5,2 3,3 3.9,4 7.909,5 43.1,6 47.1,7 0.996,8 1.119,9 0.693,10 0.642,11 403.38,12 12,13 51,15 13,16 30,18 54,19 22,20 2,22 13,23 9,24 1,25 6.434}
{0 CHEMBL55809,1 5,2 3,3 4.3,4 8.029,5 42.6,6 46.8,7 0.998,8 1.12,9 0.693,10 0.643,11 377.34,12 12,13 47,15 13,16 27,18 49,19 20,20 2,22 13,23 7,24 1,25 5.658}
{0 CHEMBL567175,1 5,2 2,3 3.5,4 7.273,5 45.6,6 45.6,7 0.996,8 1.116,9 0.676,10 0.641,11 414.54,12 16,13 57,15 16,16 38,18 64,19 26,22 14,23 12,25 6.45}
{0 CHEMBL573214,1 9,2 4,3 3.3,4 7.194,5 43.5,6 46.7,7 0.999,8 1.12,9 0.663,10 0.629,11 661.86,12 17,13 92,15 17,16 61,18 104,19 40,22 16,23 24,25 8.783}
{0 CHEMBL592,1 2,3 2.4,4 6.129,5 40.5,6 54.8,7 0.98,8 1.126,9 0.639,10 0.584,11 257.41,12 6,13 42,15 6,16 22,18 45,19 17,22 6,23 11,25 8}
{0 CHEMBL60404,1 5,2 2,3 3.5,4 6.887,5 42.1,6 49.1,7 0.994,8 1.123,9 0.654,10 0.615,11 392.54,12 11,13 57,15 11,16 35,18 63,19 24,22 10,23 14,25 7.658}
{0 CHEMBL60407,1 5,2 4,3 3,4 6.995,5 44.8,6 47.8,7 0.992,8 1.117,9 0.669,10 0.628,11 468.64,12 17,13 67,15 17,16 42,18 74,19 30,22 16,23 14,25 7.387}
{0 CHEMBL610293,1 5,2 2,3 1.6,4 7.155,5 45.2,6 46.8,7 0.996,8 1.115,9 0.669,10 0.633,11 443.58,12 12,13 62,15 13,16 40,18 69,19 28,22 13,23 15,24 1,25 5.523}
{0 CHEMBL69559,1 3,2 1,3 2.6,4 6.343,5 38.5,6 53.8,7 0.99,8 1.13,9 0.629,10 0.583,11 247.37,12 6,13 39,15 6,16 20,18 41,19 15,22 6,23 9,25 5.585}
{0 CHEMBL70,1 4,3 2.5,4 7.134,5 42.5,6 47.5,7 1.001,8 1.122,9 0.656,10 0.623,11 285.37,12 6,13 40,15 7,16 25,18 44,19 17,22 8,23 9,24 1,25 6.68}
{0 CHEMBL70586,1 6,2 4,3 3.4,4 7.335,5 37.9,6 51.7,7 0.996,8 1.13,9 0.656,10 0.604,11 425.44,12 6,13 58,15 7,16 31,18 61,19 22,20 2,22 7,23 15,24 1,25 8.947}
{0 CHEMBL71301,1 3,2 3,3 2.1,4 6.371,5 40.4,6 53.2,7 0.986,8 1.126,9 0.639,10 0.591,11 299.45,12 6,13 47,15 7,16 25,18 50,19 19,22 7,23 12,24 1,25 8.222}
{0 CHEMBL72180,1 3,2 4,3 2,4 6.601,5 42.9,6 51,7 0.987,8 1.12,9 0.654,10 0.608,11 323.47,12 12,13 49,15 12,16 27,18 52,19 21,22 12,23 9,25 5.699}
{0 CHEMBL80,1 5,2 2,3 2.2,4 7.276,5 42.2,6 46.7,7 1.005,8 1.122,9 0.654,10 0.626,11 327.41,12 6,13 45,15 8,16 28,18 49,19 19,22 9,23 10,24 2,25 6.9}
