"molecule_id","RBF","RBN","pXC50"
{1 0.018,2 1,3 5.94}
{0 CHEMBL1062,1 0.018,2 1,3 6}
{0 CHEMBL110739,1 0.034,2 2,3 5.34}
{0 CHEMBL111861,1 0.034,2 2,3 5.43}
{0 CHEMBL1162,3 7.97}
{0 CHEMBL121458,3 8.62}
{0 CHEMBL135,3 7.566}
{0 CHEMBL1389,1 0.019,2 1,3 8.91}
{0 CHEMBL1395,3 8.429}
{0 CHEMBL1405,3 7.18}
{0 CHEMBL1479,3 8.2}
{0 CHEMBL1498,1 0.035,2 2,3 6.38}
{0 CHEMBL153062,1 0.2,2 8,3 5.92}
{0 CHEMBL1531,1 0.018,2 1,3 8.23}
{0 CHEMBL1533,1 0.018,2 1,3 6.6}
{0 CHEMBL1868702,1 0.02,2 1,3 8.11}
{0 CHEMBL193200,1 0.097,2 3,3 4.866}
{0 CHEMBL193482,3 5.63}
{0 CHEMBL194392,1 0.059,2 3,3 4.65}
{0 CHEMBL195836,3 9}
{0 CHEMBL216530,1 0.071,2 3,3 4.953}
{0 CHEMBL216660,1 0.114,2 5,3 4.985}
{0 CHEMBL218958,1 0.095,2 4,3 4.317}
{0 CHEMBL223967,3 8.759}
{0 CHEMBL225546,3 8.62}
{0 CHEMBL229861,1 0.048,2 2,3 4}
{0 CHEMBL241694,3 8.78}
{0 CHEMBL253144,1 0.034,2 2,3 6.2}
{0 CHEMBL253363,1 0.017,2 1,3 6.15}
{0 CHEMBL258918,3 9.6}
{0 CHEMBL259126,3 9.541}
{0 CHEMBL259313,3 6.86}
{0 CHEMBL259327,1 0.081,2 3,3 5.67}
{0 CHEMBL259383,1 0.135,2 5,3 6.23}
{0 CHEMBL259384,1 0.103,2 4,3 6.97}
{0 CHEMBL259548,3 8.759}
{0 CHEMBL259599,3 8.51}
{0 CHEMBL259635,1 0.017,2 1,3 7.67}
{0 CHEMBL259997,1 0.051,2 2,3 5.66}
{0 CHEMBL260202,3 9.74}
{0 CHEMBL260341,1 0.081,2 6,3 7.53}
{0 CHEMBL260639,3 8.36}
{0 CHEMBL260640,3 8.36}
{0 CHEMBL260641,3 8.36}
{0 CHEMBL260658,3 6.44}
{0 CHEMBL260659,3 9.07}
{0 CHEMBL260660,3 9.12}
{0 CHEMBL261406,3 8.3}
{0 CHEMBL261407,1 0.016,2 1,3 8.27}
{0 CHEMBL261514,3 8.81}
{0 CHEMBL261643,3 9}
{0 CHEMBL261866,3 9.05}
{0 CHEMBL265178,1 0.045,2 3,3 4.96}
{0 CHEMBL265925,3 9.31}
{0 CHEMBL265926,3 9.32}
{0 CHEMBL265939,1 0.091,2 3,3 5.66}
{0 CHEMBL265940,1 0.034,2 1,3 6.08}
{0 CHEMBL265942,3 8.57}
{0 CHEMBL273453,1 0.053,2 3,3 5.32}
{0 CHEMBL274826,3 6.46}
{0 CHEMBL27769,3 8.58}
{0 CHEMBL282575,1 0.05,2 3,3 5.94}
{0 CHEMBL299613,1 0.02,2 1,3 9.08}
{0 CHEMBL309821,3 6.82}
{0 CHEMBL323533,3 8.51}
{0 CHEMBL326669,3 5.15}
{0 CHEMBL335062,3 9.11}
{0 CHEMBL359619,3 8.71}
{0 CHEMBL367448,1 0.118,2 6,3 5.585}
{0 CHEMBL386630,3 7.854}
{0 CHEMBL386857,3 6.022}
{0 CHEMBL389621,1 0.034,2 2,3 5.2}
{0 CHEMBL405043,1 0.118,2 6,3 6.51}
{0 CHEMBL406406,3 8.23}
{0 CHEMBL406776,1 0.089,2 4,3 6.39}
{0 CHEMBL408649,1 0.091,2 5,3 4.54}
{0 CHEMBL408706,1 0.017,2 1,3 5.36}
{0 CHEMBL408707,3 9.05}
{0 CHEMBL408778,1 0.094,2 5,3 5.61}
{0 CHEMBL408973,1 0.018,2 1,3 8.801}
{0 CHEMBL409022,3 5.94}
{0 CHEMBL409084,1 0.017,2 1,3 7.88}
{0 CHEMBL409895,3 8.36}
{0 CHEMBL410336,3 6.44}
{0 CHEMBL410519,3 8.91}
{0 CHEMBL411053,3 9.38}
{0 CHEMBL411316,3 7.92}
{0 CHEMBL411730,3 8.36}
{0 CHEMBL411731,3 8.46}
{0 CHEMBL41708,3 6.15}
{0 CHEMBL425148,1 0.12,2 6,3 4.284}
{0 CHEMBL430043,3 8.46}
{0 CHEMBL44,1 0.031,2 1,3 4.4}
{0 CHEMBL440283,3 9.17}
{0 CHEMBL566118,1 0.113,2 11,3 7.764}
{0 CHEMBL691,3 6.81}
{0 CHEMBL717,1 0.046,2 3,3 6.2}
{0 CHEMBL75225,1 0.034,2 2,3 4.32}
{0 CHEMBL757,3 6.3}
{0 CHEMBL77135,3 8.18}
{0 CHEMBL77987,3 8.11}
{0 CHEMBL85799,3 6.15}
{0 CHEMBL87285,3 7.15}
{0 CHEMBL90593,3 7.84}
{0 CHEMBL9352,1 0.029,2 1,3 4.55}
