{
  "data_set_description": {
    "citation": "https://archive.ics.uci.edu/ml/citation_policy.html",
    "collection_date": "1993-02-13",
    "creator": "Ashwin Srinivasan",
    "default_target_attribute": "class",
    "description": "**Author**:   \n**Source**: Unknown - 1993  \n**Please cite**:   \n\nSource:\nAshwin Srinivasan\nDepartment of Statistics and Data Modeling\nUniversity of Strathclyde\nGlasgow\nScotland\nUK\nross '@' uk.ac.turing\n\nThe original Landsat data for this database was generated from data purchased from NASA by the Australian Centre for Remote Sensing, and used for research at: \nThe Centre for Remote Sensing\nUniversity of New South Wales\nKensington, PO Box 1\nNSW 2033\nAustralia.\n\nThe sample database was generated taking a small section (82 rows and 100 columns) from the original data. The binary values were converted to their present ASCII form by Ashwin Srinivasan. The classification for each pixel was performed on the basis of an actual site visit by Ms. Karen Hall, when working for Professor John A. Richards, at the Centre for Remote Sensing at the University of New South Wales, Australia. Conversion to 3x3 neighbourhoods and splitting into test and training sets was done by Alistair Sutherland.\n\nData Set Information:\nThe database consists of the multi-spectral values of pixels in 3x3 neighbourhoods in a satellite image, and the classification associated with the central pixel in each neighbourhood. The aim is to predict this classification, given the multi-spectral values. In the sample database, the class of a pixel is coded as a number. The Landsat satellite data is one of the many sources of information available for a scene. The interpretation of a scene by  integrating spatial data of diverse types and resolutions including multispectral and radar data, maps indicating topography, land use etc. is expected to assume significant importance with the onset of an era characterised by integrative approaches to remote sensing (for example, NASA's Earth Observing System commencing this decade). Existing statistical methods are ill-equipped for handling such diverse data types. Note that this is not true for Landsat MSS data considered in isolation (as in this sample database). This data satisfies the important requirements of being numerical and at a single resolution, and standard maximum-likelihood classification performs very well. Consequently, for this data, it should be interesting to compare the performance of other methods against the statistical approach. One frame of Landsat MSS imagery consists of four digital images of the same scene in different spectral bands. Two of these are in the visible region (corresponding approximately to green and red regions of the visible spectrum) and two are in the (near) infra-red. Each pixel is a 8-bit binary word, with 0 corresponding to black and 255 to white. The spatial resolution of a pixel is about 80m x 80m. Each image contains 2340 x 3380 such pixels. The database is a (tiny) sub-area of a scene, consisting of 82 x 100 pixels. Each line of data corresponds to a 3x3 square neighbourhood of pixels completely contained within the 82x100 sub-area. Each line contains the pixel values in the four spectral bands (converted to ASCII) of each of the 9 pixels in the 3x3 neighbourhood and a number indicating the classification label of the central pixel. The number is a code for the following classes:\n\nNumber Class\n1 red soil\n2 cotton crop\n3 grey soil\n4 damp grey soil\n5 soil with vegetation stubble\n6 mixture class (all types present)\n7 very damp grey soil\nNB. There are no examples with class 6 in this dataset.\n \nThe data is given in random order and certain lines of data have been removed so you cannot reconstruct the original image from this dataset. In each line of data the four spectral values for the top-left pixel are given first followed by the four spectral values for the top-middle pixel and then those for the top-right pixel, and so on with the pixels read out in sequence left-to-right and top-to-bottom. Thus, the four spectral values for the central pixel are given by attributes 17,18,19 and 20. If you like you can use only these four attributes, while ignoring the others. This avoids the problem which arises when a 3x3 neighbourhood straddles a boundary.\n\nAttribute Information:\nThe attributes are numerical, in the range 0 to 255.\n\nUCI: http://archive.ics.uci.edu/ml/datasets/Statlog+(Landsat+Satellite)",
    "description_version": "1",
    "file_id": "50720",
    "format": "ARFF",
    "id": "294",
    "language": "English",
    "licence": "Public",
    "md5_checksum": "b82e0199bc9b46ccf855351adc34f301",
    "minio_url": "https://data.openml.org/datasets/0000/0294/dataset_294.pq",
    "name": "satellite_image",
    "original_data_url": "https://archive.ics.uci.edu/ml/datasets/Statlog+(Landsat+Satellite)",
    "parquet_url": "https://data.openml.org/datasets/0000/0294/dataset_294.pq",
    "processing_date": "2020-11-20 19:20:35",
    "status": "active",
    "tag": [
      "Environment",
      "Science",
      "study_52",
      "Technology"
    ],
    "upload_date": "2014-08-17T10:09:50",
    "url": "https://api.openml.org/data/v1/download/50720/satellite_image.arff",
    "version": "1",
    "visibility": "public"
  }
}