"molecule_id","N.","O.","nO","nDB","AMW","C.","pXC50"
{1 3.2,2 12.9,3 4,4 3,5 9.333,6 45.2,7 4.4}
{0 CHEMBL1232381,1 6.1,2 9.1,3 3,4 2,5 6.494,6 30.3,7 6.826}
{0 CHEMBL1242180,1 4.7,4 1,5 6.731,6 46.5,7 4.716}
{0 CHEMBL1300912,1 7.4,2 7.4,3 4,4 2,5 8.344,6 42.6,7 4.634}
{0 CHEMBL1302552,1 6.8,2 8.5,3 5,4 4,5 8.314,6 44.1,7 5.837}
{0 CHEMBL1303031,1 5,2 5,3 3,4 1,5 8.06,6 46.7,7 5.228}
{0 CHEMBL1303255,1 20,4 3,5 9.477,6 53.3,7 5.075}
{0 CHEMBL1304585,1 8.5,2 4.3,3 2,4 1,5 8.991,6 44.7,7 5.679}
{0 CHEMBL1304667,1 10,2 5,3 2,4 2,5 9.012,6 40,7 5.401}
{0 CHEMBL1304837,1 7.3,2 7.3,3 4,4 3,5 8.637,6 40,7 4.931}
{0 CHEMBL1306166,1 7.5,2 5,3 2,4 1,5 10.085,6 47.5,7 4.4}
{0 CHEMBL1306480,1 6.5,5 9.175,6 48.4,7 4.4}
{0 CHEMBL1306565,1 2.9,2 10.1,3 7,4 8,5 8.112,6 39.1,7 4.4}
{0 CHEMBL1306635,1 5.1,2 12.8,3 5,4 2,5 9.558,6 46.2,7 4.4}
{0 CHEMBL1307313,1 6.3,2 4.8,3 3,4 3,5 8.106,6 46,7 4.4}
{0 CHEMBL1307433,1 6.3,2 3.1,3 1,5 8.074,6 43.8,7 5.831}
{0 CHEMBL1308652,1 7,2 4.7,3 2,4 2,5 8.453,6 46.5,7 4.872}
{0 CHEMBL1312189,1 2.1,2 8.5,3 4,4 2,5 7.945,6 48.9,7 5.831}
{0 CHEMBL1312689,1 11.3,2 3.8,3 2,4 4,5 8.615,6 45.3,7 4.884}
{0 CHEMBL1313195,1 6,2 6,3 3,4 4,5 8.189,6 50,7 4.4}
{0 CHEMBL1314687,1 7,2 7,3 3,4 3,5 9.347,6 44.2,7 4.808}
{0 CHEMBL1318849,1 6.1,2 2,3 1,5 6.153,6 36.7,7 5.216}
{0 CHEMBL1319204,1 6.1,2 6.1,3 3,4 2,5 9.272,6 44.9,7 4.4}
{0 CHEMBL1320035,1 8.1,2 5.4,3 2,4 1,5 9.387,6 45.9,7 4.729}
{0 CHEMBL1324779,1 9.8,2 2.4,3 1,5 8.01,6 48.8,7 6.657}
{0 CHEMBL1326814,1 2.1,2 8.5,3 4,4 2,5 7.945,6 48.9,7 6.732}
{0 CHEMBL1327081,1 5.9,2 5.9,3 2,4 1,5 10.682,6 47.1,7 4.399}
{0 CHEMBL1327274,1 4.1,2 10.2,3 5,4 3,5 10.068,6 49,7 4.4}
{0 CHEMBL1329575,1 2.3,2 6.8,3 3,4 2,5 7.577,6 47.7,7 4.4}
{0 CHEMBL1329797,1 5.7,2 2.9,3 1,5 7.783,6 42.9,7 4.4}
{0 CHEMBL1329826,2 22.9,3 11,4 1,5 8.799,6 39.6,7 4.4}
{0 CHEMBL1330042,1 3.3,2 10,3 3,4 1,5 11.072,6 50,7 4.4}
{0 CHEMBL1330383,2 12.5,3 3,4 1,5 10.277,6 54.2,7 4.4}
{0 CHEMBL1332512,1 9.1,2 2.3,3 1,4 1,5 8.238,6 45.5,7 4.841}
{0 CHEMBL1334062,1 16.1,2 6.5,3 2,4 5,5 9.798,6 41.9,7 4.4}
{0 CHEMBL1336910,1 6.5,2 6.5,3 2,4 2,5 10.075,6 51.6,7 5.679}
{0 CHEMBL1337717,1 5,2 7.5,3 3,4 3,5 9.42,6 52.5,7 4.4}
{0 CHEMBL1339297,1 5.4,2 10.8,3 4,4 3,5 8.929,6 43.2,7 5.151}
{0 CHEMBL1341012,1 4.3,2 10.9,3 5,4 3,5 9.453,6 50,7 4.4}
{0 CHEMBL1341089,1 8,2 2,3 1,4 1,5 7.811,6 44,7 5.354}
{0 CHEMBL1341806,1 4.9,2 7.3,3 3,4 3,5 9.085,6 43.9,7 4.4}
{0 CHEMBL1342389,1 12.1,2 3,3 1,4 1,5 9.417,6 48.5,7 5.281}
{0 CHEMBL1343308,1 5.7,2 2.9,3 1,5 7.783,6 42.9,7 5.238}
{0 CHEMBL1343936,1 2.9,2 2.9,3 1,4 1,5 8.613,6 45.7,7 4.4}
{0 CHEMBL1344739,1 13.2,2 2.6,3 1,4 1,5 10.778,6 47.4,7 5.408}
{0 CHEMBL1344787,1 7,2 5.3,3 3,5 8.115,6 49.1,7 5.114}
{0 CHEMBL1345305,1 4.1,2 6.1,3 3,4 1,5 8.256,6 46.9,7 5.235}
{0 CHEMBL1346015,1 3.4,2 13.8,3 8,4 3,5 8.457,6 44.8,7 4.4}
{0 CHEMBL1347130,1 6.3,2 6.3,3 2,4 1,5 10.201,6 50,7 4.4}
{0 CHEMBL1347701,1 4,2 12,3 6,4 3,5 8.609,6 48,7 4.4}
{0 CHEMBL1348596,1 7.8,2 7.8,3 4,4 3,5 7.697,6 35.3,7 4.4}
{0 CHEMBL1349484,1 5.5,2 9.6,3 7,4 4,5 7.982,6 43.8,7 4.4}
{0 CHEMBL1352306,1 3.6,2 8.9,3 5,4 3,5 8.045,6 44.6,7 4.4}
{0 CHEMBL1352348,1 6.1,2 4.1,3 2,4 1,5 7.541,6 40.8,7 4.931}
{0 CHEMBL1353381,1 6.3,2 3.1,3 1,4 1,5 9.761,6 43.8,7 4.895}
{0 CHEMBL1353643,1 4.3,2 10.9,3 5,4 3,5 10.42,6 50,7 4.4}
{0 CHEMBL1354460,1 6.3,2 4.7,3 3,4 2,5 7.166,6 42.2,7 5.436}
{0 CHEMBL1356442,1 3,2 9.1,3 6,4 3,5 7.404,6 37.9,7 4.899}
{0 CHEMBL1357156,1 5.4,2 5.4,3 2,4 1,5 9.2,6 48.6,7 4.4}
{0 CHEMBL1358081,1 7.8,2 5.9,3 3,4 1,5 9.007,6 43.1,7 5.846}
{0 CHEMBL1358911,1 6.5,2 8.7,3 4,4 2,5 8.858,6 45.7,7 5.452}
{0 CHEMBL1359865,1 10.5,2 2.6,3 1,4 1,5 10.021,6 44.7,7 5.001}
{0 CHEMBL1363571,1 8.3,2 6.3,3 3,4 3,5 9.436,6 45.8,7 5.354}
{0 CHEMBL1364102,1 5.1,2 5.1,3 2,4 3,5 10.085,6 46.2,7 5.301}
{0 CHEMBL1366522,1 10,2 5,3 2,4 1,5 9.432,6 40,7 4.996}
{0 CHEMBL1367087,1 4.5,2 4.5,3 2,4 1,5 9.531,6 43.2,7 5.176}
{0 CHEMBL1367791,1 9.4,5 8.295,6 37.5,7 4.599}
{0 CHEMBL1368667,1 7,2 9.3,3 4,4 1,5 8.683,6 48.8,7 5.792}
{0 CHEMBL1369512,1 6,2 4,3 2,4 2,5 6.35,6 36,7 5.414}
{0 CHEMBL1369869,1 6.5,2 6.5,3 3,4 3,5 8.251,6 37,7 5.462}
{0 CHEMBL1370199,1 7.3,2 4.9,3 2,4 4,5 10.203,6 43.9,7 5.13}
{0 CHEMBL1370669,2 10.7,3 3,4 1,5 10.541,6 46.4,7 4.4}
{0 CHEMBL1373811,1 6.9,2 6.9,3 2,4 1,5 11.35,6 51.7,7 5.786}
{0 CHEMBL1375116,1 8.5,2 2.1,3 1,4 1,5 9.263,6 46.8,7 5.524}
{0 CHEMBL1376894,1 5.3,2 7.9,3 3,4 1,5 8.906,6 47.4,7 4.971}
{0 CHEMBL1379684,1 8.1,2 2.7,3 1,4 1,5 7.768,6 40.5,7 5.691}
{0 CHEMBL1380313,1 7.3,2 7.3,3 3,4 3,5 8.377,6 41.5,7 5.148}
{0 CHEMBL1380975,1 3.7,2 13,3 7,4 3,5 8.527,6 46.3,7 4.4}
{0 CHEMBL1381980,1 3.6,2 8.9,3 5,4 3,5 8.045,6 44.6,7 4.4}
{0 CHEMBL1382928,1 12.1,2 6.1,3 2,4 1,5 12.326,6 42.4,7 4.4}
{0 CHEMBL1384281,1 10,5 8.26,6 50,7 6.75}
{0 CHEMBL1385074,1 4.3,2 10.9,3 5,4 3,5 8.705,6 50,7 4.4}
{0 CHEMBL1385747,1 7.9,2 4.8,3 3,4 3,5 8.281,6 41.3,7 4.4}
{0 CHEMBL1386595,1 11.1,5 9.026,6 48.1,7 4.482}
{0 CHEMBL1388002,1 4.1,2 6.1,3 3,4 2,5 8.558,6 40.8,7 4.4}
{0 CHEMBL1391254,1 7.9,2 2.6,3 1,4 1,5 8.408,6 39.5,7 5.579}
{0 CHEMBL1391310,1 5.6,2 11.1,3 4,4 2,5 7.622,6 30.6,7 6.857}
{0 CHEMBL1391385,1 6,2 4,3 2,4 2,5 6.35,6 36,7 5.976}
{0 CHEMBL1391748,1 3.4,2 8.5,3 5,4 3,5 7.568,6 44.1,7 4.4}
{0 CHEMBL1392806,1 8.1,2 5.4,3 2,4 1,5 9.607,6 45.9,7 6.065}
{0 CHEMBL1393131,1 3.7,2 11.1,3 3,4 1,5 11.783,6 51.9,7 4.4}
{0 CHEMBL1394096,1 5.3,2 8.8,3 5,4 3,5 7.641,6 42.1,7 4.4}
{0 CHEMBL1397291,1 2.4,2 9.5,3 4,4 3,5 9.817,6 40.5,7 5.052}
{0 CHEMBL1398736,1 2.6,2 5.3,3 2,4 2,5 6.773,6 42.1,7 5.123}
{0 CHEMBL1401891,1 13.6,2 4.5,3 1,4 1,5 9.876,6 45.5,7 5.504}
{0 CHEMBL1402172,1 2.2,2 8.9,3 4,4 3,5 7.722,6 40,7 4.856}
{0 CHEMBL1402650,1 3.8,2 13.5,3 7,4 4,5 8.816,6 48.1,7 4.4}
{0 CHEMBL1402874,1 5.1,2 6.8,3 4,4 3,5 7.348,6 42.4,7 4.4}
{0 CHEMBL1404362,1 11.9,2 4.8,3 2,4 2,5 8.282,6 38.1,7 4.834}
{0 CHEMBL1405306,1 9.8,2 2.4,3 1,4 1,5 8.938,6 46.3,7 5.931}
{0 CHEMBL1406915,1 5.6,2 5.6,3 3,4 3,5 8.029,6 44.4,7 5.222}
{0 CHEMBL1407014,1 4.1,2 10.2,3 5,4 3,5 8.825,6 49,7 4.4}
{0 CHEMBL1407788,1 3,2 6.1,3 2,4 1,5 10.37,6 51.5,7 6}
{0 CHEMBL1407986,1 8.8,2 2.9,3 2,4 1,5 7.127,6 41.2,7 5.697}
{0 CHEMBL1409901,1 6.5,2 9.7,3 3,4 2,5 12.012,6 45.2,7 4.4}
{0 CHEMBL1410870,1 5.5,2 7.3,3 4,4 3,5 8.609,6 52.7,7 5.632}
{0 CHEMBL1413474,1 6.8,2 4.5,3 2,4 1,5 9.371,6 45.5,7 4.4}
{0 CHEMBL1414306,1 2.1,2 10.6,3 5,4 3,5 9.241,6 42.6,7 4.4}
{0 CHEMBL1415156,1 11.9,2 4.8,3 2,4 1,5 10.912,6 52.4,7 4.4}
{0 CHEMBL1417231,1 7.7,2 7.7,3 3,4 1,5 9.833,6 46.2,7 6.09}
{0 CHEMBL1418370,1 4.3,2 8.7,3 4,4 3,5 9.855,6 47.8,7 4.4}
{0 CHEMBL1423531,1 3.8,2 7.7,3 4,4 3,5 8.163,6 50,7 4.4}
{0 CHEMBL1424665,1 8.5,2 6.4,3 3,4 2,5 7.754,6 42.6,7 4.858}
{0 CHEMBL1425600,1 3.6,2 10.7,3 6,4 3,5 8.187,6 46.4,7 4.4}
{0 CHEMBL1425823,1 8.8,2 2.9,3 1,5 8.098,6 50,7 4.4}
{0 CHEMBL1427088,1 3.3,2 11.7,3 7,4 3,5 7.775,6 41.7,7 4.4}
{0 CHEMBL1430235,1 8.5,2 4.3,3 2,4 1,5 10.09,6 36.2,7 4.4}
{0 CHEMBL1431253,1 5.6,2 2.8,3 1,4 1,5 8.857,6 44.4,7 5.036}
{0 CHEMBL1431571,1 7.5,2 5,3 2,4 1,5 8.736,6 47.5,7 4.4}
{0 CHEMBL1431688,1 6.3,2 3.1,3 1,4 1,5 9.838,6 50,7 5.054}
{0 CHEMBL1431953,1 11.1,5 12.337,6 50,7 4.725}
{0 CHEMBL1432707,1 5.1,2 12.8,3 5,4 4,5 8.111,6 41,7 4.4}
{0 CHEMBL1433074,1 5.7,2 3.8,3 2,4 1,5 7.879,6 45.3,7 6.481}
{0 CHEMBL1442635,1 8.8,2 8.8,3 3,4 1,5 11.3,6 50,7 5.456}
{0 CHEMBL1446248,1 7.1,2 4.8,3 2,4 2,5 7.32,6 35.7,7 4.4}
{0 CHEMBL1447283,1 15.6,2 6.7,3 3,4 3,5 9.323,6 35.6,7 4.4}
{0 CHEMBL1452125,1 3.8,2 9.4,3 5,4 3,5 8.274,6 43.4,7 4.4}
{0 CHEMBL1453623,1 6.8,2 4.5,3 2,4 3,5 8.86,6 50,7 5.404}
{0 CHEMBL1454198,1 5.6,2 11.1,3 4,4 2,5 7.622,6 30.6,7 6.41}
{0 CHEMBL1454614,1 3.2,2 9.7,3 3,4 3,5 7.848,6 45.2,7 4.4}
{0 CHEMBL1455509,1 3.6,2 10.7,3 6,4 3,5 8.41,6 42.9,7 4.908}
{0 CHEMBL1456706,1 8.7,2 4.3,3 2,4 1,5 9.29,6 43.5,7 5.167}
{0 CHEMBL1456984,1 6.5,2 6.5,3 2,4 1,5 9.896,6 45.2,7 4.895}
{0 CHEMBL1457096,1 9.1,2 4.5,3 1,4 1,5 10.197,6 40.9,7 4.399}
{0 CHEMBL1457535,1 3.4,2 8.5,3 5,4 3,5 8.152,6 44.1,7 4.4}
{0 CHEMBL1459124,1 6.1,2 6.1,3 3,4 1,5 8.072,6 42.9,7 5.271}
{0 CHEMBL1461732,1 4.5,2 9.1,3 4,4 2,5 10.539,6 45.5,7 4.4}
{0 CHEMBL1462380,1 4,2 8,3 2,4 1,5 10.725,6 44,7 5.193}
{0 CHEMBL1462503,1 7.5,2 7.5,3 3,4 2,5 8.836,6 45,7 5.144}
{0 CHEMBL1462838,1 3.6,2 7.1,3 4,4 2,5 7.652,6 46.4,7 5.324}
{0 CHEMBL1462884,1 11.1,2 2.8,3 1,4 1,5 10.19,6 50,7 5.413}
{0 CHEMBL1463659,1 20,2 6.7,3 2,4 5,5 9.009,6 40,7 4.4}
{0 CHEMBL1464502,1 4.5,2 9.1,3 4,4 1,5 8.464,6 50,7 5.541}
{0 CHEMBL1464805,1 12.2,2 4.9,3 2,4 1,5 9.264,6 46.3,7 5.543}
{0 CHEMBL1464821,1 8.3,2 12.5,3 3,4 1,5 13.132,6 41.7,7 4.4}
{0 CHEMBL1465171,1 3.6,2 8.9,3 5,4 3,5 8.338,6 44.6,7 4.4}
{0 CHEMBL1467089,1 9.5,2 7.1,3 3,4 1,5 9.25,6 40.5,7 5.152}
{0 CHEMBL1468336,1 3.7,2 1.9,3 1,4 2,5 6.826,6 40.7,7 4.4}
{0 CHEMBL1469003,1 5.5,2 7.3,3 4,4 2,5 7.809,6 45.5,7 4.875}
{0 CHEMBL1470378,1 4.3,2 12.8,3 6,4 3,5 9.287,6 46.8,7 4.4}
{0 CHEMBL1470676,1 10.8,2 2.7,3 1,5 8.714,6 45.9,7 4.447}
{0 CHEMBL1471296,1 11.1,2 2.8,3 1,4 1,5 10.19,6 50,7 5.472}
{0 CHEMBL1471788,1 8.9,4 1,5 8.455,6 40,7 4.399}
{0 CHEMBL1475400,1 3.8,2 7.7,3 2,5 7.74,6 46.2,7 4.4}
{0 CHEMBL1476478,1 8.3,2 6.3,3 3,4 2,5 9.137,6 43.8,7 5.31}
{0 CHEMBL1477452,1 5.7,5 7.04,6 40,7 4.4}
{0 CHEMBL1479469,1 6,2 8,3 4,4 2,5 7.829,6 44,7 4.4}
{0 CHEMBL1480178,1 5.7,2 8.6,3 3,4 2,5 9.268,6 48.6,7 5.635}
{0 CHEMBL1482670,1 8.6,2 1.7,3 1,4 2,5 8.581,6 46.6,7 6.111}
{0 CHEMBL1482795,1 9.7,2 6.5,3 2,4 1,5 10.562,6 48.4,7 5.613}
{0 CHEMBL1485768,1 14.7,5 8.627,6 47.1,7 5.569}
{0 CHEMBL1486010,1 4,2 12,3 6,4 3,5 8.609,6 48,7 4.4}
{0 CHEMBL1488092,1 3,2 12.1,3 4,4 1,5 11.278,6 51.5,7 4.4}
{0 CHEMBL1488651,1 8.5,2 4.3,3 2,4 3,5 8.096,6 42.6,7 5.599}
{0 CHEMBL1488696,1 4.7,2 11.6,3 5,4 3,5 9.452,6 48.8,7 4.4}
{0 CHEMBL1494994,1 4.4,2 4.4,3 2,4 3,5 7.833,6 44.4,7 4.809}
{0 CHEMBL1497617,1 8.3,2 5,3 3,4 3,5 8.461,6 41.7,7 4.4}
{0 CHEMBL1499411,1 2.8,2 5.6,3 2,4 1,5 9.284,6 44.4,7 5.861}
{0 CHEMBL1499421,1 8.6,2 11.4,3 4,4 1,5 8.552,6 42.9,7 4.4}
{0 CHEMBL1501734,1 5.9,2 5.9,3 2,4 2,5 9.07,6 50,7 5.324}
{0 CHEMBL1503060,1 3.7,2 7.4,3 4,4 3,5 7.491,6 44.4,7 4.4}
{0 CHEMBL1505221,1 17.1,5 11.031,6 41.5,7 4.4}
{0 CHEMBL1505334,1 14.7,2 5.9,3 2,4 1,5 11.3,6 47.1,7 5.441}
{0 CHEMBL1508525,1 6.7,2 3.3,3 1,4 1,5 10.616,6 46.7,7 5.047}
{0 CHEMBL1508847,1 2.9,2 17.6,3 6,4 6,5 10.394,6 41.2,7 4.4}
{0 CHEMBL1510454,1 7.9,2 2.6,3 1,5 7.88,6 42.1,7 4.681}
{0 CHEMBL1511291,1 9.1,2 4.5,3 2,4 1,5 10.459,6 36.4,7 4.4}
{0 CHEMBL1511447,1 10.9,2 2.2,3 1,4 1,5 7.292,6 41.3,7 4.4}
{0 CHEMBL1513384,1 7.3,2 7.3,3 3,4 3,5 8.667,6 39,7 5.068}
{0 CHEMBL1513785,1 6.8,2 13.6,3 6,4 4,5 8.94,6 45.5,7 5.351}
{0 CHEMBL1514625,1 5.8,2 7.7,3 4,4 3,5 7.567,6 42.3,7 4.4}
{0 CHEMBL1517409,1 8.3,2 12.5,3 3,4 4,5 13.132,6 41.7,7 4.4}
{0 CHEMBL1519514,1 3.4,2 11.9,3 7,4 5,5 8.044,6 39,7 5.629}
{0 CHEMBL1520797,1 11.5,2 3.8,3 1,5 9.358,6 46.2,7 4.4}
{0 CHEMBL1521729,1 7,2 9.3,3 4,4 1,5 8.638,6 41.9,7 4.4}
{0 CHEMBL1522312,1 4.8,2 4.8,3 2,4 1,5 8.582,6 50,7 4.898}
{0 CHEMBL1523808,1 8.6,2 8.6,3 3,4 1,5 10.692,6 45.7,7 5.471}
{0 CHEMBL1529161,1 5.5,2 3.6,3 2,4 1,5 7.629,6 43.6,7 5.054}
{0 CHEMBL1531523,1 7.5,2 5,3 2,4 1,5 9.095,6 50,7 5.367}
{0 CHEMBL1534931,1 4.3,2 6.5,3 3,4 3,5 7.445,6 34.8,7 4.4}
{0 CHEMBL1535636,1 4.3,2 10.9,3 5,4 3,5 10.42,6 50,7 4.4}
{0 CHEMBL1536665,1 5.4,2 5.4,3 2,4 2,5 8.714,6 48.6,7 5.386}
{0 CHEMBL1536779,1 6.1,2 12.1,3 4,4 3,5 10.266,6 42.4,7 5.826}
{0 CHEMBL1539438,1 6.9,2 6.9,3 2,4 1,5 12.734,6 44.8,7 5.468}
{0 CHEMBL1539768,1 10,2 6.7,3 2,4 1,5 10.513,6 46.7,7 5.369}
{0 CHEMBL1539954,1 13.5,2 5.4,3 2,4 1,5 8.631,6 45.9,7 5.073}
{0 CHEMBL1541024,1 14.7,2 5.9,3 2,4 1,5 8.98,6 47.1,7 5.184}
{0 CHEMBL1541029,1 3.7,2 11.1,3 6,4 4,5 8.453,6 48.1,7 4.4}
{0 CHEMBL1542646,1 11.1,2 6.7,3 3,4 1,5 8.788,6 42.2,7 4.4}
{0 CHEMBL1542847,1 4.3,2 8.7,3 4,4 3,5 8.097,6 41.3,7 5.391}
{0 CHEMBL1543331,1 9.7,5 11.971,6 41.9,7 5.847}
{0 CHEMBL1543662,1 7.5,2 5,3 2,4 1,5 8.234,6 50,7 5.2}
{0 CHEMBL1544051,1 6.6,2 9.8,3 6,4 4,5 8.174,6 39.3,7 5.435}
{0 CHEMBL1544403,1 2.1,2 8.5,3 4,4 2,5 8.678,6 48.9,7 6.518}
{0 CHEMBL1549101,1 6.5,2 6.5,3 2,4 2,5 9.495,6 51.6,7 5.515}
{0 CHEMBL1550435,1 8.8,5 8.346,6 47.1,7 5.416}
{0 CHEMBL1560169,1 8.2,2 4.1,3 2,4 1,5 7.358,6 36.7,7 5.177}
{0 CHEMBL1562444,1 2.4,2 9.8,3 4,4 3,5 8.424,6 51.2,7 5.642}
{0 CHEMBL1563863,1 4.3,2 10.9,3 5,4 3,5 9.453,6 50,7 4.4}
{0 CHEMBL1564075,1 7.3,2 7.3,3 4,4 4,5 7.646,6 41.8,7 4.4}
{0 CHEMBL1565040,1 11.9,2 1.7,3 1,4 1,5 8.299,6 42.4,7 6.324}
{0 CHEMBL1565261,1 5.4,2 7.1,3 4,4 3,5 7.491,6 42.9,7 4.4}
{0 CHEMBL1566010,1 6.1,2 3,3 1,5 8.193,6 45.5,7 5.963}
{0 CHEMBL1569119,1 5.7,2 2.9,3 1,4 3,5 7.783,6 42.9,7 4.4}
{0 CHEMBL1571111,1 7.7,2 7.7,3 3,4 5,5 9.637,6 43.6,7 4.4}
{0 CHEMBL1573867,1 3.9,2 7.8,3 4,4 3,5 9.203,6 45.1,7 4.4}
{0 CHEMBL1575283,1 5,2 7.5,3 3,4 2,5 8.822,6 40,7 5.348}
{0 CHEMBL1575389,1 10,5 7.81,6 50,7 6.75}
{0 CHEMBL1576064,1 3.7,2 11.1,3 3,4 1,5 11.783,6 51.9,7 4.4}
{0 CHEMBL1576907,1 4.8,2 4.8,3 3,4 3,5 6.503,6 33.3,7 5.354}
{0 CHEMBL1577090,1 10.6,2 4.3,3 2,4 1,5 8.626,6 40.4,7 4.4}
{0 CHEMBL1577894,1 12.5,2 5,3 2,4 1,5 8.836,6 42.5,7 4.4}
{0 CHEMBL1579576,1 3.6,2 8.9,3 5,4 3,5 9.132,6 44.6,7 4.4}
{0 CHEMBL1579942,1 9.3,2 2.3,3 1,4 1,5 9.129,6 46.5,7 5.258}
{0 CHEMBL1580310,1 7.3,2 2.4,3 1,4 1,5 8.135,6 39,7 5.325}
{0 CHEMBL1580962,1 7.7,2 2.6,3 1,4 2,5 8.5,6 41,7 5.721}
{0 CHEMBL1581437,1 4,2 12,3 6,4 3,5 8.609,6 48,7 4.4}
{0 CHEMBL1582191,1 4.2,2 8.3,3 4,4 3,5 8.217,6 45.8,7 5.214}
{0 CHEMBL1584932,1 6.3,2 2.1,3 1,4 1,5 8.282,6 50,7 5.418}
{0 CHEMBL1589959,1 4.8,2 9.5,3 4,4 3,5 8.772,6 45.2,7 5.096}
{0 CHEMBL1592326,1 3.5,2 8.8,3 5,4 3,5 8.185,6 49.1,7 5.242}
{0 CHEMBL1598762,1 2.2,2 11.1,3 5,4 1,5 9.606,6 44.4,7 4.4}
{0 CHEMBL1600566,1 4.1,2 10.2,3 5,4 3,5 8.458,6 49,7 4.4}
{0 CHEMBL1600749,1 6.1,2 6.1,3 2,4 3,5 8.981,6 48.5,7 4.4}
{0 CHEMBL1601179,1 4.3,2 8.7,3 4,4 3,5 9.637,6 47.8,7 4.4}
{0 CHEMBL1601194,1 5.5,2 9.1,3 5,4 4,5 7.847,6 38.2,7 5.977}
{0 CHEMBL1601448,1 2.2,2 11.1,3 5,4 3,5 9.384,6 44.4,7 4.4}
{0 CHEMBL1601538,1 7.5,2 7.5,3 3,4 3,5 9.697,6 45,7 5.314}
{0 CHEMBL1602811,1 9.5,2 4.8,3 2,4 1,5 10.556,6 45.2,7 6.777}
{0 CHEMBL1605363,1 10,2 2.5,3 1,4 1,5 9.463,6 47.5,7 5.227}
{0 CHEMBL1607639,1 9.5,2 4.8,3 2,4 1,5 9.106,6 45.2,7 5.584}
{0 CHEMBL1608748,1 3.5,2 10.5,3 6,4 3,5 8.221,6 42.1,7 4.4}
{0 CHEMBL1609827,1 5.9,2 5.9,3 2,4 2,5 9.07,6 50,7 5.292}
{0 CHEMBL1610242,1 5.9,2 9.8,3 5,4 3,5 8.383,6 41.2,7 4.4}
{0 CHEMBL1610464,1 11.8,2 2.9,3 1,5 9.599,6 47.1,7 4.4}
{0 CHEMBL1613080,1 5.4,2 5.4,3 2,5 9.578,6 43.2,7 4.4}
{0 CHEMBL1713127,1 2.3,2 4.7,3 2,4 1,5 7.893,6 53.5,7 4.443}
{0 CHEMBL1736358,2 14.1,3 9,4 1,5 7.759,6 42.2,7 4.896}
{0 CHEMBL1880945,1 4,2 8,3 4,4 3,5 9.05,6 42,7 4.857}
{0 CHEMBL2003651,1 4.3,2 10.6,3 5,4 6,5 9.584,6 48.9,7 4.912}
{0 CHEMBL212336,1 8,2 4,3 2,4 2,5 8.978,6 48,7 6.364}
{0 CHEMBL2132700,1 2.6,2 7.7,3 6,4 5,5 8.529,6 43.6,7 4.4}
{0 CHEMBL213426,1 7.7,2 3.8,3 2,4 2,5 8.326,6 46.2,7 6.667}
{0 CHEMBL213665,1 7.1,2 3.6,3 2,4 2,5 8.589,6 50,7 6.533}
{0 CHEMBL2140561,1 14,2 7,3 3,4 3,5 7.963,6 37.2,7 4.738}
{0 CHEMBL214374,1 7.3,2 3.6,3 2,4 2,5 8.127,6 45.5,7 5.393}
{0 CHEMBL214445,1 7.5,2 3.8,3 2,4 2,5 8.395,6 47.2,7 5.877}
{0 CHEMBL214457,1 8,2 4,3 2,4 2,5 9.338,6 48,7 5.601}
{0 CHEMBL214562,1 6.7,2 3.3,3 2,4 2,5 8.45,6 50,7 4.602}
{0 CHEMBL215363,1 7.1,2 7.1,3 3,4 1,5 9.329,6 50,7 4.602}
{0 CHEMBL215498,1 9.8,2 3.9,3 2,4 2,5 8.94,6 49,7 4.77}
{0 CHEMBL215539,1 7.5,2 3.8,3 2,4 2,5 8.81,6 50.9,7 6.392}
{0 CHEMBL233149,1 8.8,2 11.8,3 4,4 5,5 10.277,6 41.2,7 4.847}
{0 CHEMBL235504,1 9.1,2 9.1,3 2,4 2,5 9.555,6 54.5,7 4.918}
{0 CHEMBL312032,1 7.1,2 7.1,3 3,4 3,5 7.939,6 38.1,7 6.126}
{0 CHEMBL384066,1 10.9,2 2.2,3 1,4 1,5 9.389,6 50,7 4.602}
{0 CHEMBL384232,1 9.6,2 3.8,3 2,4 2,5 9.661,6 50,7 5.489}
{0 CHEMBL384623,1 7.5,2 3.8,3 2,4 2,5 9.15,6 50.9,7 6.67}
{0 CHEMBL385936,1 7.5,2 3.8,3 2,4 2,5 8.395,6 47.2,7 5.57}
{0 CHEMBL386087,1 7.5,2 3.8,3 2,4 2,5 9.46,6 50.9,7 5.194}
{0 CHEMBL386138,1 8,2 4,3 2,4 2,5 8.618,6 48,7 6.851}
{0 CHEMBL386447,1 7.5,2 5,3 2,4 1,5 10.817,6 50,7 4.602}
{0 CHEMBL388590,2 8.8,3 3,4 1,5 12.473,6 50,7 4.4}
{0 CHEMBL424715,1 7.1,2 3.6,3 2,4 2,5 8.196,6 46.4,7 5.69}
{0 CHEMBL450135,1 3.7,2 7.4,3 2,4 1,5 12.378,6 51.9,7 4.4}
{0 CHEMBL51931,2 8.3,3 2,4 2,5 8.676,6 58.3,7 4.4}
{0 CHEMBL578512,1 23.8,2 9.5,3 2,4 5,5 9.2,6 33.3,7 4.4}
{0 CHEMBL600336,1 8.5,2 4.3,3 2,4 2,5 9.459,6 48.9,7 5.029}
{0 CHEMBL601757,1 20.8,2 8.3,3 2,4 5,5 8.634,6 33.3,7 4.4}
