"molecule_id","Eig01_AEA.dm.","SpDiam_AEA.dm.","SpMax_AEA.dm.","IVDE","Eig01_EA.bo.","Eig03_AEA.bo.","Eig03_AEA.dm.","Eig03_AEA.ed.","Eig03_AEA.ri.","Eig03_EA","Eig03_EA.bo.","Eig03_EA.ed.","Eig03_EA.ri.","Eig07_AEA.ed.","GGI3","JGI3","SM11_AEA.bo.","SM11_AEA.ri.","SM11_EA.bo.","SM12_AEA.dm.","SM12_EA.bo.","SM13_AEA.ri.","SM13_EA.bo.","SM14_EA.bo.","SM15_EA.bo.","SpDiam_EA.bo.","SpDiam_EA.ed.","SpMax_EA.bo.","BIC4","BIC5","CIC4","CIC5","SIC4","SIC5","IC3","IC4","IC5","SpMax3_Bh.e.","SpMax3_Bh.p.","SpMax3_Bh.v.","SpMin3_Bh.i.","MATS1m","BIC3","BIC2","CIC2","CIC3","SIC2","SIC3","Eta_beta_A","Eta_betaP_A","AAC","AECC","ALOGP","ALOGP2","AMR","AMW","ARR","ATS1e","ATS1i","ATS1m","ATS1p","ATS1s","ATS1v","ATS2e","ATS2i","ATS2m","ATS2p","ATS2s","ATS2v","ATS3e","ATS3i","ATS3m","ATS3p","ATS3s","ATS3v","ATS4e","ATS4i","ATS4m","ATS4p","ATS4s","ATS4v","ATS5e","ATS5i","ATS5m","ATS5p","ATS5s","ATS5v","ATS6e","ATS6i","ATS6m","ATS6p","ATS6s","ATS6v","ATS7e","ATS7i","ATS7m","ATS7p","ATS7s","ATS7v","ATS8e","ATS8i","ATS8m","ATS8p","ATS8s","ATS8v","ATSC1e","ATSC1i","ATSC1m","ATSC1p","ATSC1s","ATSC1v","ATSC2e","ATSC2i","ATSC2m","ATSC2p","ATSC2s","ATSC2v","ATSC3e","ATSC3i","ATSC3m","ATSC3p","ATSC3s","ATSC3v","ATSC4e","ATSC4i","ATSC4m","ATSC4p","ATSC4s","ATSC4v","ATSC5e","ATSC5i","ATSC5m","ATSC5p","ATSC5s","ATSC5v","ATSC6e","ATSC6i","ATSC6m","ATSC6p","ATSC6s","ATSC6v","ATSC7e","ATSC7i","ATSC7m","ATSC7p","ATSC7s","ATSC7v","ATSC8e","ATSC8i","ATSC8m","ATSC8p","ATSC8s","ATSC8v","BAC","BBI","BIC0","BIC1","BID","BLI","pXC50"
{1 3.576,2 5.576,3 3.576,4 1.571,5 3.743,6 2.755,7 1.949,8 3.737,9 2.197,10 1.235,11 1.751,12 2.868,13 1.05,14 1.49,15 0.5,16 0.045,17 1.235,18 3.743,19 14.508,20 2.868,21 15.968,22 1.751,23 17.152,24 18.562,25 19.794,26 6.743,27 13.679,28 3.743,29 0.794,30 0.794,31 0.533,32 0.533,33 0.863,34 0.863,35 3.374,36 3.374,37 3.374,38 2.854,39 2.746,40 2.715,41 0.821,42 -0.005,43 0.794,44 0.731,45 0.8,46 0.533,47 0.795,48 0.863,49 1.3,50 0.75,51 1.689,52 4.6,53 2.013,54 4.051,55 45.225,56 16.535,57 0.6,58 2.814,59 2.87,60 3.076,61 2.613,62 4.164,63 2.506,64 3.174,65 3.243,66 3.565,67 2.977,68 4.766,69 2.802,70 3.354,71 3.484,72 3.564,73 3.038,74 4.717,75 2.777,76 3.2,77 3.347,78 3.035,79 2.58,80 4.672,81 2.329,82 2.715,83 2.914,84 2.7,85 1.943,86 4.098,87 1.717,88 1.856,89 1.997,90 3.376,91 1.489,92 3.473,93 1.298,94 0.669,95 0.752,96 0.636,97 0.769,98 1.138,99 0.348,106 0.053,107 0.153,108 6.495,109 1.036,110 11.11,111 1.143,112 0.131,113 0.23,114 12.478,115 1.68,116 27.891,117 1.989,118 0.098,119 0.311,120 40.214,121 4.432,122 18.715,123 3.383,124 0.165,125 0.27,126 34.896,127 4.407,128 30.597,129 2.639,130 0.148,131 0.165,132 11.384,133 2.237,134 31.773,135 1.509,136 0.024,137 0.076,138 4.647,139 2.278,140 4.328,141 0.671,142 0.001,143 0.019,144 11.879,145 1.039,146 0.106,147 0.406,154 11,155 13,156 0.398,157 0.669,158 2.441,159 1.13,160 4.12}
{0 CHEMBL116835,1 3.832,2 5.832,3 3.832,4 1.5,5 3.743,6 2.813,7 1.46,8 3.583,9 2.364,10 1.414,11 1.936,12 2.938,13 1.329,14 1,15 0.375,16 0.047,17 1.414,18 3.743,19 14.428,20 2.938,21 15.908,22 1.936,23 17.101,24 18.523,25 19.761,26 6.743,27 13.742,28 3.743,29 0.905,30 0.905,31 0.133,32 0.133,33 0.966,34 0.966,35 3.64,36 3.774,37 3.774,38 2.895,39 2.807,40 2.784,41 0.863,42 -0.168,43 0.873,44 0.745,45 0.8,46 0.267,47 0.795,48 0.932,49 1.406,50 0.875,51 1.563,52 3.5,53 1.443,54 2.083,55 38.866,56 8.347,57 0.75,58 2.785,59 2.905,60 2.45,61 2.476,62 3.983,63 2.371,64 3.123,65 3.264,66 2.748,67 2.765,68 4.251,69 2.629,70 3.32,71 3.513,72 2.792,73 2.785,74 4.492,75 2.58,76 3.195,77 3.456,78 1.932,79 2.4,80 4.169,81 2.051,82 2.633,83 3.016,84 0.494,85 1.461,86 3.145,87 1.074,88 1.298,89 1.682,90 0.021,91 0.361,92 1.386,93 0.189,106 0.026,107 0.211,108 3.832,109 1.487,110 5.562,111 1.777,112 0.015,113 0.283,114 4.473,115 2.154,116 3.367,117 2.808,118 0.048,119 0.367,120 7.926,121 2.912,122 11.669,123 3.459,124 0.06,125 0.321,126 10.167,127 3.217,128 14.448,129 3.287,130 0.033,131 0.152,132 5.413,133 1.732,134 7.767,135 2.018,136 0.007,137 0.028,138 1.12,139 0.364,140 1.486,141 0.454,154 5,155 10,156 0.375,157 0.649,158 2.265,159 1.045,160 5.602}
{0 CHEMBL118239,1 3.582,2 5.582,3 3.582,4 1.573,5 3.897,6 3.232,7 2.147,8 4.618,9 2.879,10 1.879,11 2.481,12 4.963,13 1.879,14 1.634,15 0.938,16 0.072,17 1.879,18 3.897,19 14.959,20 4.963,21 16.407,22 2.481,23 17.68,24 19.092,25 20.401,26 6.897,27 14.619,28 3.897,29 0.705,30 0.705,31 1.12,32 1.12,33 0.745,34 0.745,35 3.273,36 3.273,37 3.273,38 3.266,39 3.121,40 3.101,41 1.217,42 -0.033,43 0.705,44 0.677,45 1.251,46 1.12,47 0.715,48 0.745,49 1.227,50 0.682,51 1.357,52 4.364,53 2.407,54 5.793,55 42.899,56 7.152,57 0.545,58 3.108,59 3.209,60 2.605,61 2.675,62 4.332,63 2.638,64 3.555,65 3.722,66 2.922,67 2.992,68 4.908,69 2.933,70 3.691,71 3.839,72 2.865,73 3.068,74 4.926,75 2.977,76 3.842,77 4.096,78 2.661,79 2.899,80 4.915,81 2.781,82 3.478,83 3.662,84 2.393,85 2.547,86 4.82,87 2.441,88 3.545,89 3.849,90 1.074,91 1.908,92 4.727,93 1.699,94 1.975,95 2.417,96 0.048,97 0.7,98 2.079,99 0.396,106 0.024,107 0.252,108 4.307,109 2.125,110 6.839,111 2.609,112 0.133,113 0.384,114 7.361,115 3.295,116 30.654,117 4.327,118 0.03,119 0.442,120 8.213,121 3.775,122 9.629,123 4.848,124 0.145,125 0.458,126 11.12,127 3.934,128 35.617,129 5.364,130 0.019,131 0.323,132 7.069,133 2.735,134 7.814,135 3.585,136 0.337,137 0.263,138 9.818,139 2.155,140 69.531,141 2.802,142 0.027,143 0.055,144 1.831,145 0.52,146 5.531,147 0.901,154 18,155 15,156 0.292,157 0.648,158 2.523,159 0.93,160 4.48}
{0 CHEMBL118280,1 3.589,2 5.589,3 3.589,4 1.573,5 3.897,6 3.232,7 2.623,8 4.618,9 2.707,10 1.879,11 2.481,12 4.963,13 1.441,14 1.634,15 0.938,16 0.072,17 1.879,18 3.897,19 14.959,20 4.963,21 16.407,22 2.481,23 17.68,24 19.092,25 20.401,26 6.897,27 14.619,28 3.897,29 0.794,30 0.794,31 0.533,32 0.533,33 0.863,34 0.863,35 3.374,36 3.374,37 3.374,38 2.901,39 2.849,40 2.815,41 0.827,42 -0.029,43 0.794,44 0.751,45 0.717,46 0.533,47 0.816,48 0.863,49 1.273,50 0.682,51 1.797,52 4.364,53 2.763,54 7.635,55 42.426,56 12.734,57 0.545,58 2.848,59 2.879,60 2.829,61 2.542,62 4.265,63 2.533,64 3.222,65 3.256,66 3.252,67 2.876,68 4.914,69 2.842,70 3.43,71 3.507,72 3.219,73 2.905,74 4.916,75 2.829,76 3.271,77 3.368,78 3.358,79 2.591,80 4.888,81 2.541,82 2.854,83 2.907,84 3.004,85 1.877,86 5.005,87 1.953,88 1.921,89 2.068,90 0.59,91 0.982,92 3.187,93 0.795,94 0.635,95 0.899,96 0.007,97 0.135,98 0.693,99 0.067,106 0.143,107 0.15,108 0.728,109 1.016,110 20.712,111 0.889,112 0.241,113 0.214,114 1.004,115 1.557,116 38.834,117 1.506,118 0.339,119 0.245,120 8.72,121 2.5,122 41.892,123 2.287,124 0.375,125 0.207,126 8.318,127 2.386,128 57.795,129 1.976,130 0.349,131 0.106,132 7.865,133 1.708,134 42.806,135 1.301,136 0.121,137 0.043,138 4.282,139 0.733,140 17.769,141 0.501,142 0.015,143 0.011,144 0.953,145 0.171,146 2.328,147 0.264,154 18,155 15,156 0.423,157 0.708,158 2.523,159 0.966,160 4.55}
{0 CHEMBL118903,1 3.584,2 5.584,3 3.584,4 1.577,5 3.965,6 2.919,7 2.197,8 4.384,9 2.522,10 1.611,11 2.058,12 4.153,13 1.461,14 2.281,15 0.813,16 0.045,17 1.611,18 3.965,19 15.194,20 4.153,21 16.636,22 2.058,23 17.939,24 19.352,25 20.685,26 6.965,27 15.561,28 3.965,29 0.791,30 0.81,31 0.761,32 0.674,33 0.832,34 0.851,35 3.675,36 3.762,37 3.849,38 3.247,39 2.952,40 2.96,41 1.115,42 0.006,43 0.773,44 0.711,45 1.142,46 0.848,47 0.748,48 0.812,49 1.269,50 0.654,51 1.491,52 5.462,53 1.402,54 1.964,55 45.743,56 7.921,57 0.462,58 3.246,59 3.317,60 2.825,61 2.662,62 4.556,63 2.698,64 3.692,65 3.822,66 3.094,67 2.918,68 5.094,69 2.954,70 3.717,71 3.809,72 3.18,73 3.007,74 5.098,75 3.036,76 3.838,77 3.965,78 3.019,79 2.948,80 5.161,81 2.949,82 3.866,83 4.066,84 2.711,85 2.779,86 5.123,87 2.706,88 3.535,89 3.782,90 2.285,91 2.435,92 4.796,93 2.284,94 3.289,95 3.583,96 1.583,97 1.854,98 4.483,99 1.729,100 2.493,101 2.731,102 0.575,103 1.049,104 3.807,105 0.956,106 0.115,107 0.274,108 4.336,109 2.207,110 9.051,111 2.397,112 0.381,113 0.381,114 8.666,115 3.074,116 41.705,117 3.506,118 0.302,119 0.415,120 7.759,121 3.352,122 17.758,123 3.751,124 0.34,125 0.433,126 9.599,127 3.505,128 32.18,129 4.03,130 0.567,131 0.403,132 11.85,133 3.376,134 48.154,135 4.451,136 0.35,137 0.297,138 8.508,139 2.607,140 28.433,141 3.896,142 0.313,143 0.187,144 7.925,145 1.609,146 43.231,147 2.437,148 0.186,149 0.07,150 3.512,151 0.566,152 30.81,153 0.725,154 26,155 17,156 0.314,157 0.668,158 2.667,159 0.84,160 4}
{0 CHEMBL119359,1 3.763,2 5.763,3 3.763,4 1.5,5 3.589,6 2.5,7 1,8 3.414,9 2,10 1,11 1.5,12 2.275,13 1,14 0.764,15 0.25,16 0.036,17 1,18 3.589,19 13.944,20 2.275,21 15.469,22 1.5,23 16.531,24 17.983,25 19.11,26 6.589,27 11.898,28 3.589,29 0.754,30 0.754,31 0.797,32 0.797,33 0.801,34 0.801,35 3.203,36 3.203,37 3.203,38 2.854,39 2.735,40 2.715,41 0.821,42 -0.125,43 0.754,44 0.695,45 1.047,46 0.797,47 0.738,48 0.801,49 1.313,50 0.813,51 1.272,52 3.75,53 2.676,54 7.162,55 39.207,56 7.764,57 0.75,58 2.814,59 2.917,60 2.441,61 2.56,62 3.877,63 2.429,64 3.223,65 3.391,66 2.732,67 2.851,68 4.213,69 2.691,70 3.364,71 3.547,72 2.589,73 2.873,74 4.328,75 2.63,76 3.302,77 3.601,78 1.851,79 2.458,80 3.992,81 2.103,82 2.689,83 3.06,84 1.405,85 1.726,86 3.183,87 1.37,88 1.606,89 1.712,90 0.564,91 1.183,92 2.539,93 0.789,94 1.298,95 1.682,96 0.021,97 0.361,98 1.386,99 0.189,106 0.016,107 0.181,108 4.12,109 1.735,110 3.607,111 2.239,112 0.023,113 0.278,114 5.766,115 2.572,116 5.099,117 3.464,118 0.032,119 0.34,120 8.544,121 3.439,122 8.596,123 4.165,124 0.033,125 0.335,126 9.063,127 3.507,128 8.431,129 4.075,130 0.017,131 0.179,132 4.673,133 1.85,134 3.927,135 2.18,136 0.011,137 0.069,138 3.613,139 1.057,140 2.956,141 0.755,142 0.003,143 0.036,144 0.949,145 0.368,146 0.858,147 0.433,154 5,155 10,156 0.299,157 0.636,158 2.262,159 1.122,160 5.229}
{0 CHEMBL119405,1 3.761,2 5.761,3 3.761,4 1.149,5 3.399,6 2.5,7 1,8 3.247,9 2,10 1,11 1.5,12 2.136,13 1,14 0.198,15 0.188,16 0.038,17 1,18 3.399,19 13.168,20 2.136,21 14.886,22 1.5,23 15.686,24 17.29,25 18.185,26 6.399,27 10.912,28 3.399,29 0.771,30 0.771,31 0.615,32 0.615,33 0.834,34 0.834,35 2.873,36 3.085,37 3.085,38 2.854,39 2.735,40 2.715,41 0.821,42 -0.155,43 0.718,44 0.572,45 1.413,46 0.827,47 0.618,48 0.776,49 1.429,50 0.929,51 1.314,52 3.286,53 2.19,54 4.796,55 34.166,56 8.476,57 0.857,58 2.625,59 2.713,60 2.334,61 2.414,62 3.744,63 2.284,64 2.971,65 3.097,66 2.585,67 2.673,68 4.053,69 2.507,70 3.137,71 3.346,72 2.382,73 2.617,74 4.078,75 2.345,76 2.774,77 3.061,78 1.558,79 2.006,80 3.513,81 1.624,82 1.872,83 2.214,84 0.29,85 0.951,86 2.325,87 0.617,88 0.635,89 0.899,90 0.007,91 0.135,92 0.693,93 0.067,106 0.012,107 0.136,108 3.233,109 1.334,110 2.935,111 1.683,112 0.015,113 0.195,114 3.688,115 1.746,116 3.953,117 2.442,118 0.028,119 0.277,120 7.599,121 2.935,122 7.495,123 3.355,124 0.023,125 0.213,126 6.62,127 2.401,128 6.273,129 2.539,130 0.01,131 0.086,132 2.95,133 1.017,134 2.692,135 1.02,136 0.001,137 0.014,138 0.386,139 0.147,140 0.368,141 0.169,154 2,155 8,156 0.329,157 0.479,158 2.16,159 1.106,160 5.409}
{0 CHEMBL119636,1 3.764,2 5.764,3 3.764,4 1.436,5 3.612,6 2.5,7 1.32,8 3.414,9 2,10 1,11 1.5,12 2.275,13 1,14 0.907,15 0.25,16 0.028,17 1,18 3.612,19 14.029,20 2.275,21 15.542,22 1.5,23 16.624,24 18.067,25 19.212,26 6.612,27 12.326,28 3.612,29 0.772,30 0.772,31 0.75,32 0.75,33 0.816,34 0.816,35 3.337,36 3.337,37 3.337,38 2.854,39 2.761,40 2.715,41 0.821,42 -0.114,43 0.772,44 0.718,45 0.986,46 0.75,47 0.759,48 0.816,49 1.333,50 0.778,51 1.52,52 4.444,53 2.174,54 4.724,55 40.629,56 8.248,57 0.667,58 2.909,59 2.991,60 2.576,61 2.553,62 4.056,63 2.466,64 3.321,65 3.462,66 2.84,67 2.808,68 4.411,69 2.705,70 3.379,71 3.527,72 2.759,73 2.836,74 4.452,75 2.665,76 3.283,77 3.497,78 2.184,79 2.535,80 4.184,81 2.289,82 3.034,83 3.352,84 1.854,85 2.031,86 3.768,87 1.777,88 2.44,89 2.757,90 1.405,91 1.575,92 3.089,93 1.276,94 1.606,95 1.712,96 0.564,97 1.183,98 2.539,99 0.789,100 1.298,101 1.682,102 0.021,103 0.361,104 1.386,105 0.189,106 0.009,107 0.202,108 4.131,109 1.882,110 3.584,111 2.138,112 0.068,113 0.299,114 6.289,115 2.704,116 8.506,117 3.036,118 0.056,119 0.337,120 8.487,121 3.347,122 9.617,123 3.57,124 0.061,125 0.305,126 8.284,127 3.08,128 9.626,129 3.414,130 0.058,131 0.232,132 6.709,133 2.297,134 8.972,135 2.855,136 0.037,137 0.125,138 3.756,139 1.308,140 4.322,141 1.508,142 0.013,143 0.068,144 3.775,145 1.03,146 3.294,147 0.757,148 0.009,149 0.031,150 1.09,151 0.334,152 1.269,153 0.443,154 6,155 11,156 0.352,157 0.663,158 2.353,159 1.035,160 5.495}
{0 CHEMBL119888,1 3.899,2 5.899,3 3.899,4 1.571,5 3.906,6 2.861,7 1.882,8 3.665,9 2.381,10 1.414,11 2.015,12 3.032,13 1.352,14 1.476,15 0.875,16 0.073,17 1.414,18 3.906,19 14.939,20 3.032,21 16.398,22 2.015,23 17.683,24 19.102,25 20.419,26 6.906,27 15.683,28 3.906,29 0.926,30 0.926,33 1,34 1,35 3.875,36 4,37 4,38 2.897,39 2.915,40 2.807,41 0.871,42 -0.194,43 0.897,44 0.781,45 0.625,46 0.125,47 0.844,48 0.969,49 1.35,50 0.8,51 1.677,52 4,53 1.794,54 3.22,55 40.924,56 9.638,57 0.6,58 2.877,59 2.931,60 2.64,61 2.556,62 4.241,63 2.499,64 3.218,65 3.288,66 2.977,67 2.846,68 4.809,69 2.769,70 3.426,71 3.556,72 3.03,73 2.921,74 4.78,75 2.791,76 3.36,77 3.49,78 2.93,79 2.579,80 4.991,81 2.472,82 3.02,83 3.222,84 1.639,85 1.841,86 4.432,87 1.708,88 2.078,89 2.394,90 0.29,91 0.836,92 2.996,93 0.651,94 0.635,95 0.899,96 0.007,97 0.135,98 0.693,99 0.067,106 0.057,107 0.183,108 3.141,109 1.66,110 12.809,111 1.529,112 0.133,113 0.255,114 2.959,115 2.177,116 28.503,117 2.333,118 0.108,119 0.342,120 6.694,121 3.28,122 24.784,123 3.27,124 0.163,125 0.327,126 9.359,127 3.391,128 34.728,129 2.72,130 0.207,131 0.223,132 7.808,133 2.307,134 42.312,135 1.759,136 0.079,137 0.082,138 2.967,139 0.815,140 16.344,141 0.906,142 0.007,143 0.012,144 0.516,145 0.129,146 1.443,147 0.19,154 11,155 13,156 0.388,157 0.694,158 2.444,159 0.953,160 5.108}
{0 CHEMBL119957,1 3.874,2 5.874,3 3.874,4 1.5,5 3.743,6 2.813,7 1.564,8 3.583,9 2.308,10 1.414,11 1.936,12 2.938,13 1.175,14 1,15 0.375,16 0.047,17 1.414,18 3.743,19 14.428,20 2.938,21 15.908,22 1.936,23 17.101,24 18.523,25 19.761,26 6.743,27 13.742,28 3.743,29 0.925,30 0.925,33 1,34 1,35 3.547,36 3.7,37 3.7,38 2.869,39 2.853,40 2.773,41 0.83,42 -0.049,43 0.887,44 0.733,45 0.769,46 0.154,47 0.792,48 0.958,49 1.313,50 0.813,51 1.614,52 3.5,53 2.938,54 8.634,55 41.789,56 14.545,57 0.75,58 2.641,59 2.702,60 2.826,61 2.528,62 3.776,63 2.383,64 2.994,65 3.082,66 3.273,67 2.844,68 4.115,69 2.662,70 3.176,71 3.323,72 3.739,73 2.952,74 4.273,75 2.637,76 2.827,77 3.026,78 2.563,79 2.335,80 3.737,81 1.933,82 1.905,83 2.193,84 0.636,85 1.132,86 2.483,87 0.753,88 0.635,89 0.899,90 0.007,91 0.135,92 0.693,93 0.067,106 0.006,107 0.111,108 4.32,109 0.959,110 2.289,111 1.3,112 0.003,113 0.156,114 5.321,115 1.118,116 2.39,117 1.931,118 0.04,119 0.227,120 24.953,121 3.318,122 7.659,123 3.296,124 0.048,125 0.178,126 28.38,127 3.34,128 7.521,129 2.896,130 0.023,131 0.085,132 11.825,133 1.578,134 3.559,135 1.316,136 0.003,137 0.017,138 1.27,139 0.237,140 0.512,141 0.24,154 5,155 10,156 0.404,157 0.617,158 2.265,159 1.305,160 6.097}
{0 CHEMBL120606,1 3.803,2 5.803,3 3.803,4 1.571,5 3.947,6 2.914,7 2.08,8 3.737,9 2.217,10 1.235,11 2.012,12 2.868,13 1.206,14 1.49,15 0.5,16 0.045,17 1.235,18 3.947,19 15.143,20 2.868,21 16.583,22 2.012,23 17.879,24 19.289,25 20.616,26 6.947,27 13.679,28 3.947,29 0.75,30 0.75,31 0.667,32 0.667,33 0.829,34 0.829,35 3.24,36 3.24,37 3.24,38 2.854,39 2.735,40 2.715,41 0.821,42 -0.164,43 0.75,44 0.688,45 0.933,46 0.667,47 0.761,48 0.829,49 1.525,50 0.95,51 1.966,52 4.6,53 2.084,54 4.344,55 41.491,56 10.346,57 0.6,58 2.839,59 2.905,60 2.675,61 2.484,62 4.252,63 2.433,64 3.193,65 3.265,66 2.989,67 2.778,68 4.882,69 2.721,70 3.374,71 3.514,72 2.918,73 2.784,74 4.786,75 2.677,76 3.294,77 3.475,78 2.467,79 2.34,80 4.789,81 2.245,82 2.667,83 2.862,84 1.993,85 1.524,86 4.166,87 1.531,88 1.599,89 1.565,90 2.106,91 1.006,92 3.874,93 1.064,94 1.253,95 1.366,96 0.202,97 0.297,98 2.708,99 0.32,106 0.104,107 0.212,108 2.532,109 1.44,110 8.804,111 1.374,112 0.163,113 0.285,114 2.022,115 2.014,116 37.023,117 1.956,118 0.153,119 0.36,120 6.476,121 2.96,122 22.542,123 2.71,124 0.258,125 0.296,126 8.367,127 2.779,128 47.003,129 2.204,130 0.183,131 0.142,132 4.671,133 1.267,134 40.684,135 0.963,136 0.033,137 0.055,138 1.94,139 0.558,140 8.395,141 0.022,142 0.056,143 0.019,144 0.732,145 0.204,146 12.689,147 0.002,154 11,155 13,156 0.455,157 0.626,158 2.441,159 0.924,160 5.187}
{0 CHEMBL120794,1 3.764,2 5.764,3 3.764,4 1.539,5 3.627,6 3.23,7 2.475,8 4.373,9 2.801,10 1.805,11 2.419,12 4.438,13 1.764,14 1.704,15 0.5,16 0.045,17 1.805,18 3.627,19 14.125,20 4.438,21 15.618,22 2.419,23 16.711,24 18.142,25 19.297,26 6.627,27 12.642,28 3.627,29 0.804,30 0.804,31 0.638,32 0.638,33 0.852,34 0.852,35 3.684,36 3.684,37 3.684,38 2.942,39 2.917,40 2.821,41 0.88,42 -0.124,43 0.804,44 0.76,45 0.838,46 0.638,47 0.806,48 0.852,49 1.341,50 0.773,51 1.695,52 5.455,53 1.31,54 1.717,55 47.248,56 8.362,57 0.545,58 3.064,59 3.171,60 2.724,61 2.7,62 4.259,63 2.623,64 3.476,65 3.631,66 3.041,67 2.979,68 4.72,69 2.879,70 3.671,71 3.852,72 2.918,73 3.014,74 4.867,75 2.865,76 3.536,77 3.779,78 2.588,79 2.783,80 4.585,81 2.599,82 3.297,83 3.52,84 2.403,85 2.462,86 4.505,87 2.33,88 3.085,89 3.337,90 1.983,91 2.222,92 4.145,93 1.99,94 2.601,95 2.894,96 2.03,97 1.781,98 3.777,99 1.521,100 1.83,101 1.946,102 0.626,103 1.234,104 2.979,105 0.871,106 0.016,107 0.274,108 4.522,109 1.999,110 4.2,111 2.329,112 0.066,113 0.4,114 6.493,115 2.974,116 9.311,117 3.709,118 0.145,119 0.484,120 10.811,121 3.722,122 27.274,123 3.978,124 0.064,125 0.402,126 10.28,127 3.662,128 13.673,129 4.366,130 0.075,131 0.293,132 6.85,133 2.436,134 17.188,135 3.041,136 0.077,137 0.236,138 6.896,139 2.34,140 16.777,141 2.614,142 0.05,143 0.144,144 5.222,145 1.644,146 12.845,147 1.816,148 0.033,149 0.074,150 4.201,151 1.1,152 7.931,153 0.783,154 12,155 14,156 0.37,157 0.716,158 2.519,159 1.008,160 5.678}
{0 CHEMBL122066,1 3.772,2 5.772,3 3.772,4 1.436,5 3.645,6 2.671,7 1.455,8 3.481,9 2.188,10 1.206,11 1.75,12 2.601,13 1.178,14 1.079,15 0.5,16 0.056,17 1.206,18 3.645,19 14.12,20 2.601,21 15.626,22 1.75,23 16.739,24 18.177,25 19.349,26 6.645,27 12.843,28 3.645,29 0.881,30 0.881,31 0.28,32 0.28,33 0.932,34 0.932,35 3.808,36 3.808,37 3.808,38 2.896,39 2.882,40 2.799,41 0.87,42 -0.114,43 0.881,44 0.772,45 0.75,46 0.28,47 0.816,48 0.932,49 1.333,50 0.778,51 1.52,52 4.111,53 2.174,54 4.724,55 40.629,56 8.248,57 0.667,58 2.909,59 2.991,60 2.576,61 2.553,62 4.056,63 2.466,64 3.321,65 3.462,66 2.84,67 2.808,68 4.413,69 2.705,70 3.379,71 3.527,72 2.759,73 2.836,74 4.432,75 2.665,76 3.285,77 3.497,78 2.494,79 2.542,80 4.274,81 2.331,82 3.055,83 3.342,84 1.766,85 2.178,86 3.799,87 1.878,88 2.509,89 2.785,90 0.753,91 1.68,92 3.205,93 1.262,94 1.844,95 2.277,96 0.042,97 0.626,98 1.946,99 0.348,106 0.009,107 0.202,108 4.131,109 1.882,110 3.584,111 2.138,112 0.068,113 0.299,114 6.289,115 2.704,116 8.617,117 3.036,118 0.056,119 0.337,120 8.487,121 3.347,122 8.799,123 3.57,124 0.068,125 0.305,126 8.343,127 3.036,128 11.105,129 3.365,130 0.066,131 0.241,132 7.109,133 2.487,134 8.652,135 2.837,136 0.026,137 0.153,138 5.983,139 1.857,140 5.895,141 1.889,142 0.018,143 0.063,144 2.179,145 0.669,146 2.538,147 0.886,154 6,155 11,156 0.352,157 0.663,158 2.355,159 1.035,160 5.678}
{0 CHEMBL278240,1 3.765,2 5.765,3 3.765,4 1.5,5 3.589,6 2.5,7 1.075,8 3.414,9 2,10 1,11 1.5,12 2.275,13 1,14 0.764,15 0.25,16 0.036,17 1,18 3.589,19 13.944,20 2.275,21 15.469,22 1.5,23 16.531,24 17.983,25 19.11,26 6.589,27 11.898,28 3.589,29 0.771,30 0.771,31 0.615,32 0.615,33 0.834,34 0.834,35 3.085,36 3.085,37 3.085,38 2.854,39 2.735,40 2.715,41 0.821,42 -0.049,43 0.771,44 0.694,45 0.923,46 0.615,47 0.751,48 0.834,49 1.313,50 0.813,51 1.614,52 3.75,53 2.938,54 8.634,55 41.789,56 14.545,57 0.75,58 2.641,59 2.702,60 2.826,61 2.528,62 3.773,63 2.383,64 2.994,65 3.082,66 3.273,67 2.844,68 4.136,69 2.662,70 3.175,71 3.321,72 3.222,73 2.858,74 4.224,75 2.567,76 2.814,77 3.035,78 2.52,79 2.284,80 3.661,81 1.893,82 1.91,83 2.198,84 2.938,85 1.572,86 2.743,87 1.122,88 0.743,89 0.818,90 0.444,91 0.507,92 1.322,93 0.292,106 0.006,107 0.111,108 4.32,109 0.959,110 2.234,111 1.3,112 0.003,113 0.156,114 5.321,115 1.118,116 2.651,117 1.931,118 0.037,119 0.23,120 23.519,121 3.207,122 7.631,123 3.299,124 0.042,125 0.191,126 23.518,127 3.156,128 7.032,129 2.874,130 0.026,131 0.082,132 13.259,133 1.689,134 3.643,135 1.313,136 0.01,137 0.004,138 6.133,139 0.422,140 0.74,141 0.262,154 5,155 10,156 0.404,157 0.617,158 2.262,159 1.303,160 5.319}
{0 CHEMBL327180,1 3.601,2 5.601,3 3.601,4 1.549,5 4.113,6 3.232,7 2.442,8 4.879,9 2.762,10 1.879,11 2.481,12 5.225,13 1.588,14 2.228,15 1.25,16 0.066,17 1.879,18 4.113,19 15.595,20 5.225,21 17.048,22 2.481,23 18.411,24 19.845,25 21.231,26 7.113,27 16.688,28 4.113,29 0.891,30 0.891,31 0.238,32 0.238,33 0.945,34 0.945,35 4.084,36 4.084,37 4.084,38 3.131,39 2.838,40 2.84,41 0.976,42 -0.047,43 0.891,44 0.847,45 0.438,46 0.238,47 0.899,48 0.945,49 1.269,50 0.654,51 1.739,52 5.308,53 1.815,54 3.294,55 45.779,56 10.13,57 0.462,58 3.14,59 3.185,60 2.905,61 2.622,62 4.565,63 2.664,64 3.536,65 3.612,66 3.278,67 2.926,68 5.111,69 2.962,70 3.678,71 3.729,72 3.458,73 3.009,74 5.277,75 3.045,76 3.736,77 3.832,78 3.376,79 2.889,80 5.309,81 2.912,82 3.633,83 3.755,84 3.006,85 2.58,86 5.459,87 2.524,88 3.14,89 3.405,90 1.878,91 1.853,92 4.495,93 1.727,94 2.154,95 2.299,96 1.395,97 1.215,98 3.597,99 1.246,100 2.245,101 2.395,102 0.563,103 0.883,104 3.738,105 0.873,106 0.211,107 0.228,108 2.221,109 1.848,110 26.727,111 1.52,112 0.397,113 0.32,114 5.135,115 2.791,116 49.998,117 2.534,118 0.47,119 0.35,120 6.483,121 3.26,122 48.499,123 2.776,124 0.556,125 0.335,126 7.884,127 3.357,128 70.7,129 2.76,130 0.668,131 0.26,132 14.98,133 3.239,134 95.342,135 3.122,136 0.429,137 0.17,138 9.458,139 1.903,140 51.838,141 2.647,142 0.097,143 0.067,144 1.457,145 0.597,146 9.815,147 0.605,148 0.195,149 0.055,150 2.346,151 0.52,152 34.95,153 0.196,154 30,155 18,156 0.379,157 0.782,158 2.668,159 0.862,160 5.59}
{0 CHEMBL332620,1 3.774,2 5.774,3 3.774,4 1.5,5 3.621,6 2.658,7 1.382,8 3.471,9 2.16,10 1.183,11 1.732,12 2.57,13 1.134,14 1,15 0.5,16 0.071,17 1.183,18 3.621,19 14.036,20 2.57,21 15.552,22 1.732,23 16.646,24 18.09,25 19.245,26 6.621,27 12.407,28 3.621,29 0.925,30 0.925,33 1,34 1,35 3.7,36 3.7,37 3.7,38 2.873,39 2.786,40 2.755,41 0.824,42 -0.131,43 0.925,44 0.771,45 0.615,47 0.834,48 1,49 1.344,50 0.813,51 1.614,52 3.5,53 2.854,54 8.147,55 38.971,56 11.125,57 0.75,58 2.648,59 2.709,60 2.579,61 2.488,62 3.824,63 2.365,64 3.004,65 3.092,66 2.944,67 2.785,68 4.221,69 2.634,70 3.19,71 3.337,72 2.836,73 2.777,74 4.312,75 2.528,76 2.833,77 3.053,78 2.742,79 2.306,80 3.956,81 1.96,82 1.962,83 2.199,84 0.598,85 1.176,86 2.8,87 0.828,88 0.635,89 0.899,90 0.007,91 0.135,92 0.693,93 0.067,106 0.007,107 0.125,108 2.027,109 1.055,110 2.482,111 1.332,112 0.005,113 0.177,114 1.146,115 1.278,116 2.721,117 1.951,118 0.054,119 0.252,120 8.96,121 2.773,122 10.154,123 3.081,124 0.062,125 0.196,126 10.904,127 2.561,128 11.09,129 2.622,130 0.045,131 0.077,132 6.361,133 1.215,134 6.403,135 1.123,136 0.004,137 0.015,138 0.709,139 0.202,140 0.673,141 0.225,154 5,155 10,156 0.404,157 0.617,158 2.263,159 1.147,160 5.62}
{0 CHEMBL332901,1 3.765,2 5.765,3 3.765,4 1.5,5 3.589,6 2.5,7 1.089,8 3.414,9 2,10 1,11 1.5,12 2.275,13 1,14 0.764,15 0.25,16 0.036,17 1,18 3.589,19 13.944,20 2.275,21 15.469,22 1.5,23 16.531,24 17.983,25 19.11,26 6.589,27 11.898,28 3.589,29 0.771,30 0.771,31 0.615,32 0.615,33 0.834,34 0.834,35 3.085,36 3.085,37 3.085,38 2.854,39 2.735,40 2.715,41 0.821,42 -0.131,43 0.771,44 0.694,45 0.923,46 0.615,47 0.751,48 0.834,49 1.344,50 0.813,51 1.614,52 3.75,53 2.854,54 8.147,55 38.971,56 11.125,57 0.75,58 2.648,59 2.709,60 2.579,61 2.488,62 3.824,63 2.365,64 3.004,65 3.092,66 2.944,67 2.785,68 4.22,69 2.634,70 3.19,71 3.337,72 2.836,73 2.777,74 4.337,75 2.528,76 2.83,77 3.052,78 2.092,79 2.191,80 3.782,81 1.846,82 1.925,83 2.208,84 2.197,85 1.387,86 2.991,87 1.042,88 0.785,89 0.872,90 0.222,91 0.386,92 1.631,93 0.253,106 0.007,107 0.125,108 2.027,109 1.055,110 2.482,111 1.332,112 0.005,113 0.177,114 1.146,115 1.278,116 2.72,117 1.951,118 0.054,119 0.252,120 8.96,121 2.773,122 10.208,123 3.081,124 0.06,125 0.199,126 9.837,127 2.576,128 10.204,129 2.619,130 0.035,131 0.081,132 6.432,133 1.218,134 6.03,135 1.184,136 0.016,137 0.008,138 1.706,139 0.184,140 1.879,141 0.167,154 5,155 10,156 0.404,157 0.617,158 2.262,159 1.147,160 5.444}
{0 CHEMBL333626,1 3.765,2 5.765,3 3.765,4 1.5,5 3.589,6 2.5,7 1.08,8 3.414,9 2,10 1,11 1.5,12 2.275,13 1,14 0.764,15 0.25,16 0.036,17 1,18 3.589,19 13.944,20 2.275,21 15.469,22 1.5,23 16.531,24 17.983,25 19.11,26 6.589,27 11.898,28 3.589,29 0.771,30 0.771,31 0.615,32 0.615,33 0.834,34 0.834,35 3.085,36 3.085,37 3.085,38 2.854,39 2.735,40 2.715,41 0.821,42 -0.178,43 0.771,44 0.694,45 0.923,46 0.615,47 0.751,48 0.834,49 1.344,50 0.813,51 1.614,52 3.75,53 2.395,54 5.738,55 34.382,56 9.86,57 0.75,58 2.661,59 2.735,60 2.469,61 2.408,62 3.956,63 2.322,64 3.022,65 3.127,66 2.789,67 2.664,68 4.426,69 2.568,70 3.22,71 3.397,72 2.644,73 2.605,74 4.603,75 2.434,76 2.862,77 3.114,78 1.872,79 1.992,80 4.063,81 1.733,82 1.954,83 2.248,84 1.675,85 0.91,86 3.48,87 0.837,88 0.863,89 1.054,90 0.125,91 0.114,92 2.197,93 0.157,106 0.021,107 0.214,108 2.55,109 1.369,110 5.179,111 1.421,112 0.033,113 0.321,114 2.314,115 1.809,116 4.988,117 2.02,118 0.121,119 0.424,120 7.283,121 3.019,122 22.882,123 2.752,124 0.117,125 0.285,126 7.278,127 2.446,128 24.618,129 2.195,130 0.05,131 0.129,132 3.711,133 1.056,134 12.005,135 0.934,136 0.033,137 0.04,138 0.561,139 0.167,140 6.584,141 0.025,154 5,155 10,156 0.404,157 0.617,158 2.262,159 1.005,160 5.252}
{0 CHEMBL333973,1 3.859,2 5.859,3 3.859,4 1.436,5 3.771,6 2.845,7 1.61,8 3.598,9 2.377,10 1.414,11 1.978,12 2.972,13 1.341,14 1.061,15 0.5,16 0.05,17 1.414,18 3.771,19 14.517,20 2.972,21 15.992,22 1.978,23 17.203,24 18.623,25 19.877,26 6.771,27 14.358,28 3.771,29 0.881,30 0.881,31 0.28,32 0.28,33 0.932,34 0.932,35 3.69,36 3.808,37 3.808,38 2.899,39 2.918,40 2.81,41 0.874,42 -0.114,43 0.854,44 0.745,45 0.868,46 0.397,47 0.788,48 0.903,49 1.333,50 0.778,51 1.52,52 3.889,53 2.174,54 4.724,55 40.629,56 8.248,57 0.667,58 2.909,59 2.991,60 2.576,61 2.553,62 4.058,63 2.466,64 3.321,65 3.462,66 2.84,67 2.808,68 4.392,69 2.705,70 3.381,71 3.527,72 2.945,73 2.841,74 4.502,75 2.694,76 3.302,77 3.488,78 2.449,79 2.632,80 4.293,81 2.39,82 3.093,83 3.358,84 1.359,85 2.236,86 3.858,87 1.87,88 2.613,89 3.016,90 0.342,91 1.379,92 2.944,93 1.011,94 1.298,95 1.682,96 0.021,97 0.361,98 1.386,99 0.189,106 0.009,107 0.202,108 4.131,109 1.882,110 3.695,111 2.138,112 0.068,113 0.299,114 6.289,115 2.704,116 7.799,117 3.036,118 0.063,119 0.337,120 8.546,121 3.303,122 10.278,123 3.521,124 0.076,125 0.313,126 8.742,127 3.227,128 10.785,129 3.347,130 0.055,131 0.268,132 9.336,133 3.036,134 10.226,135 3.219,136 0.031,137 0.148,138 4.387,139 1.496,140 5.139,141 2.018,142 0.009,143 0.031,144 1.09,145 0.334,146 1.269,147 0.443,154 6,155 11,156 0.352,157 0.663,158 2.356,159 1.037,160 5.585}
{0 CHEMBL415511,1 3.602,2 5.602,3 3.602,4 1.483,5 4.098,6 3.232,7 2.461,8 4.879,9 2.639,10 1.879,11 2.481,12 5.225,13 1.135,14 1.734,15 1,16 0.059,17 1.879,18 4.098,19 15.55,20 5.225,21 17.002,22 2.481,23 18.36,24 19.791,25 21.172,26 7.098,27 16.3,28 4.098,29 0.794,30 0.794,31 0.533,32 0.533,33 0.863,34 0.863,35 3.374,36 3.374,37 3.374,38 2.863,39 3.449,40 2.92,41 0.857,42 -0.004,43 0.794,44 0.751,45 0.717,46 0.533,47 0.816,48 0.863,49 1.167,50 0.625,51 1.829,52 4.833,53 3.169,54 10.043,55 70.041,56 33.32,57 0.5,58 2.823,59 2.838,60 3.753,61 2.942,62 4.173,63 2.7,64 3.186,65 3.198,66 4.347,67 3.41,68 4.798,69 3.079,70 3.373,71 3.411,72 5.705,73 3.906,74 4.814,75 3.266,76 3.217,77 3.285,78 5.161,79 3.494,80 4.694,81 2.888,82 2.747,83 2.798,84 4.284,85 2.628,86 4.51,87 2.305,88 1.876,89 1.901,90 3.434,91 1.865,92 3.54,93 1.471,94 0.669,95 0.752,96 0.636,97 0.769,98 1.138,99 0.348,106 0.064,107 0.1,108 82.059,109 2.772,110 13.509,111 0.435,112 0.136,113 0.149,114 139.204,115 4.447,116 29.714,117 0.616,118 0.105,119 0.244,120 309.574,121 14.764,122 19.315,123 2.532,124 0.18,125 0.278,126 226.999,127 12.905,128 38.51,129 2.785,130 0.076,131 0.204,132 129.837,133 11.011,134 14.418,135 2.486,136 0.021,137 0.086,138 69.172,139 5.981,140 2.97,141 1.194,142 0.002,143 0.019,144 20.962,145 1.519,146 0.253,147 0.433,154 27,155 17,156 0.431,157 0.708,158 2.599,159 1.534,160 6.13}
{0 CHEMBL85234,1 3.596,2 5.596,3 3.596,4 1.577,5 4.126,6 3.295,7 2.422,8 5.042,9 2.897,10 1.976,11 2.544,12 5.666,13 1.81,14 2.403,15 1.25,16 0.06,17 1.976,18 4.126,19 15.63,20 5.666,21 17.084,22 2.544,23 18.452,24 19.887,25 21.277,26 7.126,27 16.98,28 4.126,29 0.819,30 0.871,31 0.646,32 0.396,33 0.859,34 0.914,35 3.772,36 3.939,37 4.189,38 3.253,39 2.953,40 2.968,41 1.116,42 -0.029,43 0.785,44 0.733,45 1.063,46 0.813,47 0.768,48 0.823,49 1.268,50 0.643,51 1.528,52 5.429,53 1.134,54 1.286,55 47.437,56 8.258,57 0.429,58 3.308,59 3.369,60 2.903,61 2.679,62 4.682,63 2.74,64 3.734,65 3.848,66 3.205,67 2.946,68 5.196,69 3.013,70 3.799,71 3.861,72 3.349,73 3.053,74 5.315,75 3.122,76 3.953,77 4.061,78 3.264,79 3.015,80 5.401,81 3.07,82 4.002,83 4.15,84 3.016,85 2.872,86 5.601,87 2.863,88 3.755,89 3.987,90 2.359,91 2.552,92 5.075,93 2.416,94 3.413,95 3.733,96 1.589,97 1.94,98 4.527,99 1.777,100 2.493,101 2.731,102 0.575,103 1.049,104 3.807,105 0.956,106 0.194,107 0.284,108 4.379,109 2.242,110 20.121,111 2.293,112 0.462,113 0.391,114 8.653,115 3.107,116 50.501,117 3.403,118 0.457,119 0.438,120 7.719,121 3.459,122 36.622,123 3.643,124 0.548,125 0.461,126 10.354,127 3.669,128 56.869,129 4.096,130 0.863,131 0.429,132 12.929,133 3.504,134 95.51,135 4.305,136 0.575,137 0.335,138 11.09,139 2.899,140 63.372,141 4.23,142 0.412,143 0.2,144 9.707,145 1.78,146 58.046,147 3.006,148 0.209,149 0.065,150 3.615,151 0.534,152 34.991,153 0.727,154 35,155 19,156 0.318,157 0.674,158 2.734,159 0.81,160 4.7}
{0 CHEMBL89826,1 3.599,2 5.599,3 3.599,4 1.549,5 4.113,6 3.232,7 2.415,8 4.879,9 2.75,10 1.879,11 2.481,12 5.225,13 1.54,14 2.228,15 1.25,16 0.066,17 1.879,18 4.113,19 15.595,20 5.225,21 17.048,22 2.481,23 18.411,24 19.845,25 21.231,26 7.113,27 16.688,28 4.113,29 0.891,30 0.891,31 0.238,32 0.238,33 0.945,34 0.945,35 4.084,36 4.084,37 4.084,38 3.13,39 2.888,40 2.846,41 0.977,42 -0.017,43 0.891,44 0.847,45 0.438,46 0.238,47 0.899,48 0.945,49 1.25,50 0.654,51 1.739,52 5.308,53 1.899,54 3.606,55 48.597,56 12.353,57 0.462,58 3.136,59 3.18,60 3.089,61 2.657,62 4.541,63 2.678,64 3.53,65 3.606,66 3.524,67 2.977,68 5.081,69 2.982,70 3.668,71 3.718,72 3.793,73 3.076,74 5.221,75 3.073,76 3.726,77 3.823,78 3.813,79 2.98,80 5.227,81 2.951,82 3.615,83 3.735,84 3.454,85 2.68,86 5.349,87 2.567,88 3.136,89 3.401,90 1.925,91 1.882,92 4.48,93 1.736,94 2.154,95 2.299,96 1.395,97 1.215,98 3.597,99 1.246,100 2.245,101 2.395,102 0.563,103 0.883,104 3.738,105 0.873,106 0.191,107 0.228,108 0.918,109 1.898,110 23.533,111 1.5,112 0.367,113 0.326,114 4.17,115 3.008,116 46.048,117 2.571,118 0.403,119 0.363,120 8.404,121 3.75,122 39.548,123 2.874,124 0.488,125 0.36,126 6.375,127 3.948,128 59.49,129 2.847,130 0.552,131 0.294,132 33.467,133 4.446,134 73.515,135 3.518,136 0.407,137 0.187,138 15.384,139 2.278,140 47.7,141 2.794,142 0.09,143 0.07,144 1.277,145 0.628,146 8.71,147 0.599,148 0.19,149 0.061,150 1.748,151 0.603,152 33.7,153 0.171,154 30,155 18,156 0.379,157 0.782,158 2.668,159 0.958,160 5.52}
{0 CHEMBL89875,1 3.597,2 5.597,3 3.597,4 1.549,5 4.113,6 3.232,7 2.353,8 4.879,9 2.728,10 1.879,11 2.481,12 5.225,13 1.436,14 2.228,15 1.25,16 0.066,17 1.879,18 4.113,19 15.595,20 5.225,21 17.048,22 2.481,23 18.411,24 19.845,25 21.231,26 7.113,27 16.688,28 4.113,29 0.891,30 0.891,31 0.238,32 0.238,33 0.945,34 0.945,35 4.084,36 4.084,37 4.084,38 3.129,39 3.04,40 2.87,41 0.978,42 -0.009,43 0.891,44 0.847,45 0.438,46 0.238,47 0.899,48 0.945,49 1.25,50 0.654,51 1.739,52 5.308,53 1.729,54 2.989,55 53.382,56 14.703,57 0.462,58 3.129,59 3.175,60 3.253,61 2.745,62 4.529,63 2.698,64 3.521,65 3.599,66 3.732,67 3.102,68 5.066,69 3.011,70 3.651,71 3.705,72 4.056,73 3.234,74 5.194,75 3.112,76 3.709,77 3.811,78 4.131,79 3.187,80 5.187,81 3.006,82 3.583,83 3.71,84 3.777,85 2.905,86 5.293,87 2.626,88 3.13,89 3.396,90 1.971,91 1.955,92 4.473,93 1.749,94 2.154,95 2.299,96 1.395,97 1.215,98 3.597,99 1.246,100 2.245,101 2.395,102 0.563,103 0.883,104 3.738,105 0.873,106 0.163,107 0.234,108 4.091,109 1.915,110 22.354,111 1.465,112 0.327,113 0.347,114 10.6,115 3.382,116 44.701,117 2.615,118 0.329,119 0.407,120 19.719,121 4.984,122 36.892,123 3.006,124 0.407,125 0.417,126 14.165,127 5.24,128 56.178,129 2.944,130 0.437,131 0.385,132 61.833,133 8.377,134 68.917,135 4.118,136 0.379,137 0.214,138 25.114,139 3.451,140 46.349,141 3.02,142 0.08,143 0.073,144 2.238,145 0.693,146 8.202,147 0.59,148 0.18,149 0.068,150 0.994,151 0.852,152 33.106,153 0.131,154 30,155 18,156 0.379,157 0.782,158 2.668,159 1.024,160 5.92}
{0 CHEMBL90106,1 3.827,2 5.827,3 3.827,4 1.522,5 4.272,6 3.714,7 3.075,8 5.449,9 3.189,10 2.241,11 3.098,12 6.558,13 2.115,14 2.619,15 1.375,16 0.06,17 2.241,18 4.272,19 16.064,20 6.558,21 17.528,22 3.098,23 18.937,24 20.392,25 21.82,26 7.272,27 17.582,28 4.272,29 0.864,30 0.864,31 0.307,32 0.307,33 0.931,34 0.931,35 4.152,36 4.152,37 4.152,38 3.337,39 2.981,40 3.05,41 1.132,42 -0.042,43 0.864,44 0.826,45 0.489,46 0.307,47 0.89,48 0.931,49 1.4,50 0.767,51 1.77,52 5.467,53 1.045,54 1.092,55 48.298,56 9.689,57 0.4,58 3.261,59 3.311,60 2.975,61 2.619,62 4.792,63 2.715,64 3.651,65 3.718,66 3.311,67 2.92,68 5.44,69 3.026,70 3.794,71 3.852,72 3.433,73 3.013,74 5.441,75 3.13,76 3.966,77 4.05,78 3.422,79 2.915,80 5.66,81 3.064,82 3.883,83 3.991,84 3.267,85 2.681,86 5.887,87 2.826,88 3.751,89 3.927,90 2.682,91 2.163,92 5.827,93 2.247,94 2.408,95 2.556,96 1.449,97 1.312,98 3.922,99 1.349,100 2.245,101 2.395,102 0.563,103 0.883,104 3.738,105 0.873,106 0.308,107 0.283,108 2.674,109 1.821,110 43.546,111 1.524,112 0.569,113 0.389,114 5.383,115 2.687,116 89.468,117 2.455,118 0.578,119 0.446,120 4.779,121 2.975,122 79.335,123 2.603,124 0.886,125 0.434,126 8.418,127 2.942,128 127.178,129 2.631,130 0.837,131 0.364,132 8.112,133 2.41,134 141.678,135 2.536,136 1.06,137 0.219,138 12.671,139 1.974,140 201.687,141 2.594,142 0.191,143 0.07,144 2.283,145 0.618,146 29.895,147 0.643,148 0.214,149 0.041,150 2.418,151 0.374,152 40.244,153 0.228,154 46,155 21,156 0.368,157 0.769,158 2.796,159 0.751,160 5.05}
