{
  "data_features": {
    "feature": [
      {
        "data_type": "nominal",
        "index": "0",
        "is_ignore": "false",
        "is_row_identifier": "true",
        "is_target": "false",
        "name": "molecule_id",
        "nominal_value": [
          "CHEMBL10",
          "CHEMBL101253",
          "CHEMBL103667",
          "CHEMBL105442",
          "CHEMBL1082152",
          "CHEMBL1173655",
          "CHEMBL119385",
          "CHEMBL1230020",
          "CHEMBL1236107",
          "CHEMBL1240703",
          "CHEMBL1241674",
          "CHEMBL124660",
          "CHEMBL1287853",
          "CHEMBL1289926",
          "CHEMBL1318637",
          "CHEMBL1329627",
          "CHEMBL1336",
          "CHEMBL1354134",
          "CHEMBL1357975",
          "CHEMBL1374544",
          "CHEMBL1396483",
          "CHEMBL1396654",
          "CHEMBL1397614",
          "CHEMBL1407164",
          "CHEMBL1421",
          "CHEMBL1435542",
          "CHEMBL1436585",
          "CHEMBL1437638",
          "CHEMBL1473127",
          "CHEMBL1474834",
          "CHEMBL14762",
          "CHEMBL1476499",
          "CHEMBL1476609",
          "CHEMBL1515144",
          "CHEMBL1515868",
          "CHEMBL1535925",
          "CHEMBL1551169",
          "CHEMBL1552755",
          "CHEMBL1591577",
          "CHEMBL1599314",
          "CHEMBL1604618",
          "CHEMBL1612677",
          "CHEMBL1614701",
          "CHEMBL162",
          "CHEMBL1704879",
          "CHEMBL1705549",
          "CHEMBL1721885",
          "CHEMBL1724489",
          "CHEMBL1725513",
          "CHEMBL1734733",
          "CHEMBL1770624",
          "CHEMBL1782168",
          "CHEMBL1782169",
          "CHEMBL1782170",
          "CHEMBL1789941",
          "CHEMBL180022",
          "CHEMBL1802358",
          "CHEMBL1802389",
          "CHEMBL1802390",
          "CHEMBL1802391",
          "CHEMBL1802392",
          "CHEMBL1802393",
          "CHEMBL1802394",
          "CHEMBL1802395",
          "CHEMBL1802396",
          "CHEMBL1802397",
          "CHEMBL1802398",
          "CHEMBL1802399",
          "CHEMBL1802400",
          "CHEMBL1802401",
          "CHEMBL1802402",
          "CHEMBL1802403",
          "CHEMBL1802404",
          "CHEMBL1802405",
          "CHEMBL1802406",
          "CHEMBL1802407",
          "CHEMBL1802408",
          "CHEMBL1802409",
          "CHEMBL1802410",
          "CHEMBL1802962",
          "CHEMBL1802963",
          "CHEMBL1802964",
          "CHEMBL1802965",
          "CHEMBL1802966",
          "CHEMBL1802967",
          "CHEMBL1802968",
          "CHEMBL1802969",
          "CHEMBL1802970",
          "CHEMBL1802971",
          "CHEMBL1802972",
          "CHEMBL1908391",
          "CHEMBL1908392",
          "CHEMBL1908393",
          "CHEMBL1908394",
          "CHEMBL1908395",
          "CHEMBL1908396",
          "CHEMBL1908397",
          "CHEMBL191003",
          "CHEMBL1933288",
          "CHEMBL2071342",
          "CHEMBL215152",
          "CHEMBL2153522",
          "CHEMBL2153523",
          "CHEMBL2153524",
          "CHEMBL2153525",
          "CHEMBL2153526",
          "CHEMBL2153527",
          "CHEMBL2153528",
          "CHEMBL2153529",
          "CHEMBL2153530",
          "CHEMBL2153531",
          "CHEMBL2153532",
          "CHEMBL2153533",
          "CHEMBL2153534",
          "CHEMBL2153535",
          "CHEMBL2153536",
          "CHEMBL2153537",
          "CHEMBL2153538",
          "CHEMBL2153539",
          "CHEMBL2153540",
          "CHEMBL2205766",
          "CHEMBL221959",
          "CHEMBL223360",
          "CHEMBL230011",
          "CHEMBL2309006",
          "CHEMBL2309609",
          "CHEMBL2312649",
          "CHEMBL2312652",
          "CHEMBL2312654",
          "CHEMBL2313884",
          "CHEMBL2313885",
          "CHEMBL2313886",
          "CHEMBL2313887",
          "CHEMBL2313888",
          "CHEMBL2313889",
          "CHEMBL2313890",
          "CHEMBL2313891",
          "CHEMBL2313892",
          "CHEMBL2313893",
          "CHEMBL2313894",
          "CHEMBL2313895",
          "CHEMBL2313896",
          "CHEMBL2313897",
          "CHEMBL2313898",
          "CHEMBL2313899",
          "CHEMBL2313900",
          "CHEMBL2313901",
          "CHEMBL2313902",
          "CHEMBL2313903",
          "CHEMBL2313904",
          "CHEMBL2313905",
          "CHEMBL2313906",
          "CHEMBL2313907",
          "CHEMBL2313908",
          "CHEMBL2313909",
          "CHEMBL2313910",
          "CHEMBL2313911",
          "CHEMBL2313912",
          "CHEMBL2313913",
          "CHEMBL2313914",
          "CHEMBL2313915",
          "CHEMBL2313916",
          "CHEMBL2313917",
          "CHEMBL2313918",
          "CHEMBL2313919",
          "CHEMBL2313920",
          "CHEMBL2313921",
          "CHEMBL2313922",
          "CHEMBL2313923",
          "CHEMBL2313924",
          "CHEMBL2313925",
          "CHEMBL2313926",
          "CHEMBL2313927",
          "CHEMBL2314163",
          "CHEMBL2314164",
          "CHEMBL2314165",
          "CHEMBL2314166",
          "CHEMBL2314167",
          "CHEMBL2314168",
          "CHEMBL2314169",
          "CHEMBL2314170",
          "CHEMBL24828",
          "CHEMBL249697",
          "CHEMBL255863",
          "CHEMBL257834",
          "CHEMBL259084",
          "CHEMBL261849",
          "CHEMBL269538",
          "CHEMBL278041",
          "CHEMBL288441",
          "CHEMBL296468",
          "CHEMBL296586",
          "CHEMBL300138",
          "CHEMBL31965",
          "CHEMBL37139",
          "CHEMBL377300",
          "CHEMBL379218",
          "CHEMBL384304",
          "CHEMBL386051",
          "CHEMBL408982",
          "CHEMBL428690",
          "CHEMBL430574",
          "CHEMBL440084",
          "CHEMBL44541",
          "CHEMBL445813",
          "CHEMBL450786",
          "CHEMBL457313",
          "CHEMBL46440",
          "CHEMBL464552",
          "CHEMBL465465",
          "CHEMBL475251",
          "CHEMBL477772",
          "CHEMBL48082",
          "CHEMBL481968",
          "CHEMBL481969",
          "CHEMBL483321",
          "CHEMBL491473",
          "CHEMBL493937",
          "CHEMBL494089",
          "CHEMBL501724",
          "CHEMBL509032",
          "CHEMBL513909",
          "CHEMBL517647",
          "CHEMBL521851",
          "CHEMBL522892",
          "CHEMBL525191",
          "CHEMBL535",
          "CHEMBL553",
          "CHEMBL554",
          "CHEMBL558752",
          "CHEMBL566900",
          "CHEMBL567331",
          "CHEMBL572878",
          "CHEMBL572881",
          "CHEMBL573339",
          "CHEMBL574738",
          "CHEMBL576982",
          "CHEMBL601719",
          "CHEMBL607707",
          "CHEMBL608154",
          "CHEMBL81714",
          "CHEMBL91829",
          "CHEMBL939",
          "CHEMBL941"
        ],
        "number_of_missing_values": "0"
      },
      {
        "data_type": "numeric",
        "index": "1",
        "is_ignore": "false",
        "is_row_identifier": "false",
        "is_target": "false",
        "name": "AMW",
        "number_of_missing_values": "0"
      },
      {
        "data_type": "numeric",
        "index": "2",
        "is_ignore": "false",
        "is_row_identifier": "false",
        "is_target": "false",
        "name": "C.",
        "number_of_missing_values": "0"
      },
      {
        "data_type": "numeric",
        "index": "3",
        "is_ignore": "false",
        "is_row_identifier": "false",
        "is_target": "false",
        "name": "H.",
        "number_of_missing_values": "0"
      },
      {
        "data_type": "numeric",
        "index": "4",
        "is_ignore": "false",
        "is_row_identifier": "false",
        "is_target": "false",
        "name": "Me",
        "number_of_missing_values": "0"
      },
      {
        "data_type": "numeric",
        "index": "5",
        "is_ignore": "false",
        "is_row_identifier": "false",
        "is_target": "false",
        "name": "Mi",
        "number_of_missing_values": "0"
      },
      {
        "data_type": "numeric",
        "index": "6",
        "is_ignore": "false",
        "is_row_identifier": "false",
        "is_target": "false",
        "name": "Mp",
        "number_of_missing_values": "0"
      },
      {
        "data_type": "numeric",
        "index": "7",
        "is_ignore": "false",
        "is_row_identifier": "false",
        "is_target": "false",
        "name": "Mv",
        "number_of_missing_values": "0"
      },
      {
        "data_type": "numeric",
        "index": "8",
        "is_ignore": "false",
        "is_row_identifier": "false",
        "is_target": "false",
        "name": "MW",
        "number_of_missing_values": "0"
      },
      {
        "data_type": "numeric",
        "index": "9",
        "is_ignore": "false",
        "is_row_identifier": "false",
        "is_target": "false",
        "name": "N.",
        "number_of_missing_values": "0"
      },
      {
        "data_type": "numeric",
        "index": "10",
        "is_ignore": "false",
        "is_row_identifier": "false",
        "is_target": "false",
        "name": "nAB",
        "number_of_missing_values": "0"
      },
      {
        "data_type": "numeric",
        "index": "11",
        "is_ignore": "false",
        "is_row_identifier": "false",
        "is_target": "false",
        "name": "nAT",
        "number_of_missing_values": "0"
      },
      {
        "data_type": "numeric",
        "index": "12",
        "is_ignore": "false",
        "is_row_identifier": "false",
        "is_target": "false",
        "name": "nB",
        "number_of_missing_values": "0"
      },
      {
        "data_type": "numeric",
        "index": "13",
        "is_ignore": "false",
        "is_row_identifier": "false",
        "is_target": "false",
        "name": "nBM",
        "number_of_missing_values": "0"
      },
      {
        "data_type": "numeric",
        "index": "14",
        "is_ignore": "false",
        "is_row_identifier": "false",
        "is_target": "false",
        "name": "nBO",
        "number_of_missing_values": "0"
      },
      {
        "data_type": "numeric",
        "index": "15",
        "is_ignore": "false",
        "is_row_identifier": "false",
        "is_target": "false",
        "name": "nBR",
        "number_of_missing_values": "0"
      },
      {
        "data_type": "numeric",
        "index": "16",
        "is_ignore": "false",
        "is_row_identifier": "false",
        "is_target": "false",
        "name": "nBT",
        "number_of_missing_values": "0"
      },
      {
        "data_type": "numeric",
        "index": "17",
        "is_ignore": "false",
        "is_row_identifier": "false",
        "is_target": "false",
        "name": "nC",
        "number_of_missing_values": "0"
      },
      {
        "data_type": "numeric",
        "index": "18",
        "is_ignore": "false",
        "is_row_identifier": "false",
        "is_target": "false",
        "name": "nCL",
        "number_of_missing_values": "0"
      },
      {
        "data_type": "numeric",
        "index": "19",
        "is_ignore": "false",
        "is_row_identifier": "false",
        "is_target": "false",
        "name": "nCsp",
        "number_of_missing_values": "0"
      },
      {
        "data_type": "numeric",
        "index": "20",
        "is_ignore": "false",
        "is_row_identifier": "false",
        "is_target": "false",
        "name": "nCsp2",
        "number_of_missing_values": "0"
      },
      {
        "data_type": "numeric",
        "index": "21",
        "is_ignore": "false",
        "is_row_identifier": "false",
        "is_target": "false",
        "name": "nCsp3",
        "number_of_missing_values": "0"
      },
      {
        "data_type": "numeric",
        "index": "22",
        "is_ignore": "false",
        "is_row_identifier": "false",
        "is_target": "false",
        "name": "nDB",
        "number_of_missing_values": "0"
      },
      {
        "data_type": "numeric",
        "index": "23",
        "is_ignore": "false",
        "is_row_identifier": "false",
        "is_target": "false",
        "name": "nF",
        "number_of_missing_values": "0"
      },
      {
        "data_type": "numeric",
        "index": "24",
        "is_ignore": "false",
        "is_row_identifier": "false",
        "is_target": "false",
        "name": "nH",
        "number_of_missing_values": "0"
      },
      {
        "data_type": "numeric",
        "index": "25",
        "is_ignore": "false",
        "is_row_identifier": "false",
        "is_target": "false",
        "name": "nHet",
        "number_of_missing_values": "0"
      },
      {
        "data_type": "numeric",
        "index": "26",
        "is_ignore": "false",
        "is_row_identifier": "false",
        "is_target": "false",
        "name": "nHM",
        "number_of_missing_values": "0"
      },
      {
        "data_type": "numeric",
        "index": "27",
        "is_ignore": "false",
        "is_row_identifier": "false",
        "is_target": "false",
        "name": "nI",
        "number_of_missing_values": "0"
      },
      {
        "data_type": "numeric",
        "index": "28",
        "is_ignore": "false",
        "is_row_identifier": "false",
        "is_target": "false",
        "name": "nN",
        "number_of_missing_values": "0"
      },
      {
        "data_type": "numeric",
        "index": "29",
        "is_ignore": "false",
        "is_row_identifier": "false",
        "is_target": "false",
        "name": "nO",
        "number_of_missing_values": "0"
      },
      {
        "data_type": "numeric",
        "index": "30",
        "is_ignore": "false",
        "is_row_identifier": "false",
        "is_target": "false",
        "name": "nP",
        "number_of_missing_values": "0"
      },
      {
        "data_type": "numeric",
        "index": "31",
        "is_ignore": "false",
        "is_row_identifier": "false",
        "is_target": "false",
        "name": "nS",
        "number_of_missing_values": "0"
      },
      {
        "data_type": "numeric",
        "index": "32",
        "is_ignore": "false",
        "is_row_identifier": "false",
        "is_target": "false",
        "name": "nSK",
        "number_of_missing_values": "0"
      },
      {
        "data_type": "numeric",
        "index": "33",
        "is_ignore": "false",
        "is_row_identifier": "false",
        "is_target": "false",
        "name": "nTB",
        "number_of_missing_values": "0"
      },
      {
        "data_type": "numeric",
        "index": "34",
        "is_ignore": "false",
        "is_row_identifier": "false",
        "is_target": "false",
        "name": "nX",
        "number_of_missing_values": "0"
      },
      {
        "data_type": "numeric",
        "index": "35",
        "is_ignore": "false",
        "is_row_identifier": "false",
        "is_target": "false",
        "name": "O.",
        "number_of_missing_values": "0"
      },
      {
        "data_type": "numeric",
        "index": "36",
        "is_ignore": "false",
        "is_row_identifier": "false",
        "is_target": "false",
        "name": "RBF",
        "number_of_missing_values": "0"
      },
      {
        "data_type": "numeric",
        "index": "37",
        "is_ignore": "false",
        "is_row_identifier": "false",
        "is_target": "false",
        "name": "RBN",
        "number_of_missing_values": "0"
      },
      {
        "data_type": "numeric",
        "index": "38",
        "is_ignore": "false",
        "is_row_identifier": "false",
        "is_target": "false",
        "name": "SCBO",
        "number_of_missing_values": "0"
      },
      {
        "data_type": "numeric",
        "index": "39",
        "is_ignore": "false",
        "is_row_identifier": "false",
        "is_target": "false",
        "name": "Se",
        "number_of_missing_values": "0"
      },
      {
        "data_type": "numeric",
        "index": "40",
        "is_ignore": "false",
        "is_row_identifier": "false",
        "is_target": "false",
        "name": "Si",
        "number_of_missing_values": "0"
      },
      {
        "data_type": "numeric",
        "index": "41",
        "is_ignore": "false",
        "is_row_identifier": "false",
        "is_target": "false",
        "name": "Sp",
        "number_of_missing_values": "0"
      },
      {
        "data_type": "numeric",
        "index": "42",
        "is_ignore": "false",
        "is_row_identifier": "false",
        "is_target": "false",
        "name": "Sv",
        "number_of_missing_values": "0"
      },
      {
        "data_type": "numeric",
        "index": "43",
        "is_ignore": "false",
        "is_row_identifier": "false",
        "is_target": "false",
        "name": "X.",
        "number_of_missing_values": "0"
      },
      {
        "data_type": "numeric",
        "index": "44",
        "is_ignore": "false",
        "is_row_identifier": "false",
        "is_target": "true",
        "name": "pXC50",
        "number_of_missing_values": "0"
      }
    ]
  }
}