{
  "data_set_description": {
    "collection_date": "November 2013",
    "creator": "Dr Jeremy Besnard, Dr Ivan Olier, Dr Noureddin Sadawi, Dr Larisa Soldatova, Dr Crina Grosan, Prof Ross King, Dr Richard Bickerton, Prof Andrew Hopkins and Dr Willem van Hoorn",
    "default_target_attribute": "pXC50",
    "description": "This dataset contains QSAR data (from ChEMBL version 17) showing activity values (unit is pseudo-pCI50) of several compounds on drug target ChEMBL_ID: CHEMBL2331065 (TID: 105661), and it has 16 rows and 1152 features (not including molecule IDs and class feature: molecule_id and pXC50). The features represent Molecular Descriptors which were generated from SMILES strings. Missing value imputation was applied to this dataset (By choosing the Median).",
    "description_version": "1",
    "file_id": "3388792",
    "format": "ARFF",
    "id": "29302",
    "licence": "Public",
    "md5_checksum": "3c9368dd1fe92408c0ffb86526e1cb5c",
    "minio_url": "https://data.openml.org/datasets/0002/29302/dataset_29302.pq",
    "name": "QSAR-DATASET-FOR-DRUG-TARGET-CHEMBL2331065",
    "original_data_url": "https://www.ebi.ac.uk/chembl/target/inspect/CHEMBL2331065",
    "parquet_url": "https://data.openml.org/datasets/0002/29302/dataset_29302.pq",
    "processing_date": "2018-10-04 01:31:25",
    "row_id_attribute": "molecule_id",
    "status": "deactivated",
    "tag": [
      "MetaQSAR",
      "study_13"
    ],
    "upload_date": "2016-07-15T02:09:51",
    "url": "https://api.openml.org/data/v1/download/3388792/QSAR-DATASET-FOR-DRUG-TARGET-CHEMBL2331065.arff",
    "version": "7",
    "visibility": "public"
  }
}