"molecule_id","FCFP4_1024b229","FCFP4_1024b393","FCFP4_1024b611","FCFP4_1024b824","FCFP4_1024b905","FCFP4_1024b903","FCFP4_1024b538","FCFP4_1024b587","FCFP4_1024b87","FCFP4_1024b943","FCFP4_1024b1","FCFP4_1024b10","FCFP4_1024b100","FCFP4_1024b1000","FCFP4_1024b1001","FCFP4_1024b1002","FCFP4_1024b1003","FCFP4_1024b1004","FCFP4_1024b1005","FCFP4_1024b1006","FCFP4_1024b1007","FCFP4_1024b1008","FCFP4_1024b1009","FCFP4_1024b101","FCFP4_1024b1010","FCFP4_1024b1011","FCFP4_1024b1012","FCFP4_1024b1013","FCFP4_1024b1014","FCFP4_1024b1015","FCFP4_1024b1016","FCFP4_1024b1017","FCFP4_1024b1018","FCFP4_1024b1019","FCFP4_1024b102","FCFP4_1024b1020","FCFP4_1024b1021","FCFP4_1024b1022","FCFP4_1024b1023","FCFP4_1024b1024","FCFP4_1024b103","FCFP4_1024b104","FCFP4_1024b105","FCFP4_1024b106","FCFP4_1024b107","FCFP4_1024b108","FCFP4_1024b109","FCFP4_1024b11","FCFP4_1024b110","FCFP4_1024b111","FCFP4_1024b112","pXC50"
{11 1,45 1,52 4.187}
{0 CHEMBL1085402,11 1,49 1,52 4}
{0 CHEMBL1085616,11 1,52 5.114}
{0 CHEMBL1086104,11 1,25 1,45 1,52 4.469}
{0 CHEMBL1086567,11 1,25 1,45 1,52 5.569}
{0 CHEMBL1086657,11 1,49 1,52 4}
{0 CHEMBL1089,11 1,52 4.265}
{0 CHEMBL1089501,11 1,52 4.398}
{0 CHEMBL1091356,11 1,12 1,16 1,45 1,52 4.523}
{0 CHEMBL1096182,11 1,14 1,16 1,21 1,40 1,52 4.959}
{0 CHEMBL120183,11 1,36 1,52 5.097}
{0 CHEMBL120426,11 1,45 1,52 5.155}
{0 CHEMBL120797,11 1,36 1,52 4.824}
{0 CHEMBL120825,11 1,36 1,52 4.658}
{0 CHEMBL121040,11 1,52 4.824}
{0 CHEMBL121323,11 1,36 1,52 4.523}
{0 CHEMBL121503,11 1,36 1,52 4.886}
{0 CHEMBL1235,11 1,21 1,41 1,52 4.699}
{0 CHEMBL1258517,11 1,45 1,52 5.523}
{0 CHEMBL1277677,9 1,11 1,52 5.444}
{0 CHEMBL1289313,11 1,12 1,13 1,52 4.523}
{0 CHEMBL146826,11 1,21 1,41 1,52 4.638}
{0 CHEMBL147587,5 1,11 1,12 1,21 1,52 4.886}
{0 CHEMBL147806,11 1,21 1,52 4.638}
{0 CHEMBL1504335,11 1,12 1,52 4.699}
{0 CHEMBL1644183,11 1,52 4.721}
{0 CHEMBL1682904,11 1,52 4.553}
{0 CHEMBL1762808,6 1,11 1,12 1,19 1,20 1,52 5.481}
{0 CHEMBL1774933,11 1,36 1,52 4.523}
{0 CHEMBL1819090,7 1,11 1,12 1,47 1,52 4.301}
{0 CHEMBL1921976,11 1,30 1,46 1,52 4.523}
{0 CHEMBL1933349,11 1,52 5.569}
{0 CHEMBL1947144,11 1,34 1,48 1,52 5}
{0 CHEMBL197,11 1,12 1,52 4.757}
{0 CHEMBL2001019,11 1,33 1,48 1,52 4.523}
{0 CHEMBL2013012,11 1,52 5.086}
{0 CHEMBL2018903,11 1,41 1,52 4.472}
{0 CHEMBL2018904,11 1,41 1,52 5.016}
{0 CHEMBL2018905,11 1,41 1,52 5.506}
{0 CHEMBL2018906,11 1,41 1,52 5.157}
{0 CHEMBL2018907,11 1,41 1,52 5.616}
{0 CHEMBL2018908,11 1,41 1,52 4.301}
{0 CHEMBL2018909,11 1,41 1,52 4.496}
{0 CHEMBL2018910,11 1,41 1,52 4.301}
{0 CHEMBL2018911,11 1,41 1,52 4.301}
{0 CHEMBL2018912,11 1,41 1,52 5.292}
{0 CHEMBL2018913,11 1,41 1,52 5.248}
{0 CHEMBL2018914,11 1,41 1,52 4.301}
{0 CHEMBL2018915,11 1,41 1,52 4.301}
{0 CHEMBL2018916,11 1,41 1,52 5.479}
{0 CHEMBL2018917,11 1,41 1,52 4.301}
{0 CHEMBL2018918,11 1,13 1,41 1,52 6.013}
{0 CHEMBL2018919,11 1,41 1,52 5.842}
{0 CHEMBL2018920,11 1,41 1,52 5.728}
{0 CHEMBL2018921,11 1,41 1,52 5.412}
{0 CHEMBL2018922,11 1,25 1,41 1,52 4.301}
{0 CHEMBL2018923,11 1,16 1,41 1,52 6.602}
{0 CHEMBL2018924,11 1,41 1,52 5.457}
{0 CHEMBL2018925,11 1,41 1,52 4.301}
{0 CHEMBL2018926,11 1,41 1,52 6.167}
{0 CHEMBL2019022,11 1,41 1,52 4.301}
{0 CHEMBL2019023,11 1,41 1,52 4.301}
{0 CHEMBL2019024,11 1,41 1,52 4.301}
{0 CHEMBL2019025,11 1,41 1,52 4.301}
{0 CHEMBL2019026,11 1,36 1,41 1,52 6.004}
{0 CHEMBL2030386,11 1,12 1,36 1,52 4.699}
{0 CHEMBL2036017,1 1,2 1,3 1,4 1,5 1,6 1,7 1,8 1,9 1,10 1,11 1,33 1,52 6.495}
{0 CHEMBL2036030,1 1,2 1,3 1,4 1,5 1,6 1,7 1,8 1,9 1,10 1,11 1,52 6.328}
{0 CHEMBL2036203,1 1,2 1,3 1,4 1,5 1,6 1,7 1,8 1,9 1,10 1,11 1,18 1,33 1,52 6.244}
{0 CHEMBL2036210,1 1,2 1,3 1,4 1,5 1,6 1,7 1,8 1,9 1,10 1,11 1,52 7.066}
{0 CHEMBL2036213,1 1,2 1,3 1,4 1,5 1,6 1,7 1,8 1,9 1,10 1,11 1,52 7.367}
{0 CHEMBL2036217,1 1,2 1,3 1,4 1,5 1,6 1,7 1,8 1,9 1,10 1,11 1,52 6.013}
{0 CHEMBL2036220,1 1,2 1,3 1,4 1,5 1,6 1,7 1,8 1,9 1,10 1,11 1,52 7.268}
{0 CHEMBL2036222,1 1,2 1,3 1,4 1,5 1,6 1,7 1,8 1,9 1,10 1,11 1,52 7.102}
{0 CHEMBL2036223,1 1,2 1,3 1,4 1,5 1,6 1,7 1,8 1,9 1,10 1,11 1,52 6.658}
{0 CHEMBL2036225,1 1,2 1,3 1,4 1,5 1,6 1,7 1,8 1,9 1,10 1,11 1,15 1,52 7.301}
{0 CHEMBL2042239,11 1,48 1,52 5}
{0 CHEMBL2043144,8 1,11 1,52 4.187}
{0 CHEMBL2043437,11 1,12 1,41 1,45 1,52 4.523}
{0 CHEMBL2069799,11 1,26 1,52 4.699}
{0 CHEMBL2069800,11 1,26 1,52 4.699}
{0 CHEMBL2069801,11 1,52 4.699}
{0 CHEMBL2069802,11 1,52 4.699}
{0 CHEMBL2069803,11 1,26 1,52 4.699}
{0 CHEMBL2069804,11 1,26 1,52 4.699}
{0 CHEMBL2069805,11 1,52 4.699}
{0 CHEMBL2069806,11 1,52 4.699}
{0 CHEMBL2069921,11 1,12 1,52 4.699}
{0 CHEMBL207831,11 1,12 1,52 4}
{0 CHEMBL208528,11 1,12 1,52 4}
{0 CHEMBL2113263,11 1,16 1,52 5}
{0 CHEMBL2147070,11 1,25 1,52 4.301}
{0 CHEMBL2152252,11 1,16 1,36 1,37 1,45 1,46 1,48 1,52 5.632}
{0 CHEMBL2170062,11 1,12 1,52 5}
{0 CHEMBL2177818,11 1,36 1,45 1,48 1,52 5}
{0 CHEMBL2177819,11 1,36 1,48 1,52 5}
{0 CHEMBL2177831,11 1,36 1,48 1,52 5}
{0 CHEMBL2177836,11 1,36 1,45 1,48 1,52 6}
{0 CHEMBL2181817,11 1,52 4.626}
{0 CHEMBL218583,11 1,25 1,52 5.319}
{0 CHEMBL2204469,11 1,17 1,52 4.796}
{0 CHEMBL221044,11 1,34 1,52 5}
{0 CHEMBL2337981,11 1,12 1,52 5}
{0 CHEMBL235256,11 1,25 1,45 1,52 6.398}
{0 CHEMBL235952,11 1,25 1,45 1,52 5.051}
{0 CHEMBL236162,6 1,11 1,25 1,45 1,52 5.921}
{0 CHEMBL236163,11 1,25 1,45 1,52 4.637}
{0 CHEMBL237037,6 1,11 1,25 1,45 1,52 4.693}
{0 CHEMBL237247,11 1,25 1,45 1,52 5.032}
{0 CHEMBL237248,11 1,25 1,45 1,52 4}
{0 CHEMBL242983,9 1,11 1,12 1,45 1,52 5.967}
{0 CHEMBL244239,11 1,12 1,45 1,52 5.235}
{0 CHEMBL264241,10 1,11 1,52 4.839}
{0 CHEMBL266212,9 1,11 1,12 1,45 1,52 4.876}
{0 CHEMBL267210,11 1,25 1,52 5.046}
{0 CHEMBL296580,11 1,41 1,52 5.321}
{0 CHEMBL330871,11 1,35 1,36 1,52 4.886}
{0 CHEMBL331485,11 1,36 1,52 5.398}
{0 CHEMBL332690,11 1,52 4.523}
{0 CHEMBL332994,11 1,45 1,52 5}
{0 CHEMBL333108,11 1,36 1,45 1,52 5.097}
{0 CHEMBL333210,11 1,52 4.456}
{0 CHEMBL333704,11 1,52 4.699}
{0 CHEMBL348475,11 1,12 1,45 1,52 4.344}
{0 CHEMBL375812,11 1,52 5}
{0 CHEMBL414238,11 1,20 1,36 1,52 5.523}
{0 CHEMBL443542,11 1,36 1,52 4.301}
{0 CHEMBL445,11 1,32 1,46 1,52 4.302}
{0 CHEMBL447955,11 1,34 1,52 4.237}
{0 CHEMBL453384,11 1,21 1,52 5.009}
{0 CHEMBL457,11 1,52 4.022}
{0 CHEMBL482480,6 1,11 1,25 1,45 1,52 5.553}
{0 CHEMBL482768,11 1,25 1,27 1,45 1,52 4.959}
{0 CHEMBL482980,11 1,25 1,45 1,52 4.699}
{0 CHEMBL483352,11 1,14 1,25 1,45 1,52 5.237}
{0 CHEMBL483353,11 1,25 1,45 1,52 5.229}
{0 CHEMBL483934,11 1,49 1,52 4}
{0 CHEMBL485196,11 1,43 1,49 1,52 4.357}
{0 CHEMBL485326,11 1,43 1,49 1,52 4.328}
{0 CHEMBL488400,11 1,41 1,52 5.475}
{0 CHEMBL490672,9 1,11 1,52 4.523}
{0 CHEMBL502335,11 1,41 1,52 6.292}
{0 CHEMBL504492,6 1,10 1,11 1,12 1,16 1,48 1,52 4.149}
{0 CHEMBL520136,11 1,14 1,25 1,45 1,52 4.638}
{0 CHEMBL529213,11 1,12 1,14 1,16 1,28 1,34 1,52 4.824}
{0 CHEMBL529220,11 1,52 4.187}
{0 CHEMBL551964,11 1,12 1,52 4.538}
{0 CHEMBL551991,11 1,12 1,45 1,52 4.398}
{0 CHEMBL564840,11 1,12 1,15 1,36 1,52 4}
{0 CHEMBL633,11 1,12 1,19 1,52 4.291}
{0 CHEMBL682,5 1,11 1,12 1,21 1,52 5.569}
