{
  "data_features": {
    "feature": [
      {
        "data_type": "nominal",
        "index": "0",
        "is_ignore": "false",
        "is_row_identifier": "true",
        "is_target": "false",
        "name": "molecule_id",
        "nominal_value": [
          "CHEMBL10",
          "CHEMBL101253",
          "CHEMBL101311",
          "CHEMBL103667",
          "CHEMBL105442",
          "CHEMBL1076721",
          "CHEMBL1077670",
          "CHEMBL1078155",
          "CHEMBL1078245",
          "CHEMBL1078426",
          "CHEMBL1078427",
          "CHEMBL1078537",
          "CHEMBL1078538",
          "CHEMBL1078539",
          "CHEMBL1078717",
          "CHEMBL1078820",
          "CHEMBL1078929",
          "CHEMBL1078930",
          "CHEMBL1079032",
          "CHEMBL1079040",
          "CHEMBL1079135",
          "CHEMBL1079208",
          "CHEMBL1079243",
          "CHEMBL1079293",
          "CHEMBL1079294",
          "CHEMBL1079295",
          "CHEMBL1079921",
          "CHEMBL1080071",
          "CHEMBL1080072",
          "CHEMBL1080073",
          "CHEMBL1080245",
          "CHEMBL1080279",
          "CHEMBL1080902",
          "CHEMBL1080970",
          "CHEMBL1080994",
          "CHEMBL1080995",
          "CHEMBL1081196",
          "CHEMBL1081312",
          "CHEMBL1082061",
          "CHEMBL1082439",
          "CHEMBL1082440",
          "CHEMBL1082757",
          "CHEMBL1082758",
          "CHEMBL1083072",
          "CHEMBL1083073",
          "CHEMBL1083074",
          "CHEMBL1083134",
          "CHEMBL1083140",
          "CHEMBL1083141",
          "CHEMBL1083142",
          "CHEMBL1083143",
          "CHEMBL1083351",
          "CHEMBL1083352",
          "CHEMBL1083455",
          "CHEMBL1083965",
          "CHEMBL1083966",
          "CHEMBL1083967",
          "CHEMBL1084106",
          "CHEMBL1084107",
          "CHEMBL1084546",
          "CHEMBL1084791",
          "CHEMBL1084792",
          "CHEMBL1084795",
          "CHEMBL1084890",
          "CHEMBL1084892",
          "CHEMBL1084900",
          "CHEMBL1084947",
          "CHEMBL1085035",
          "CHEMBL1085141",
          "CHEMBL1085214",
          "CHEMBL1085468",
          "CHEMBL1085700",
          "CHEMBL1085706",
          "CHEMBL1085935",
          "CHEMBL1086078",
          "CHEMBL1086321",
          "CHEMBL1086322",
          "CHEMBL1086543",
          "CHEMBL1086544",
          "CHEMBL1086545",
          "CHEMBL1086736",
          "CHEMBL1087421",
          "CHEMBL1087650",
          "CHEMBL1088633",
          "CHEMBL1089082",
          "CHEMBL1089116",
          "CHEMBL1090090",
          "CHEMBL1090356",
          "CHEMBL1090360",
          "CHEMBL1091356",
          "CHEMBL1092754",
          "CHEMBL1095626",
          "CHEMBL1095627",
          "CHEMBL116070",
          "CHEMBL1164180",
          "CHEMBL1164265",
          "CHEMBL1173055",
          "CHEMBL1173655",
          "CHEMBL117697",
          "CHEMBL1190711",
          "CHEMBL119385",
          "CHEMBL1215171",
          "CHEMBL1215304",
          "CHEMBL1215524",
          "CHEMBL1215526",
          "CHEMBL1230020",
          "CHEMBL1230122",
          "CHEMBL1233300",
          "CHEMBL1236107",
          "CHEMBL1236126",
          "CHEMBL1240703",
          "CHEMBL1241473",
          "CHEMBL1241674",
          "CHEMBL1242373",
          "CHEMBL124660",
          "CHEMBL127898",
          "CHEMBL1287853",
          "CHEMBL1289926",
          "CHEMBL1336",
          "CHEMBL1375418",
          "CHEMBL1375640",
          "CHEMBL1381197",
          "CHEMBL1419458",
          "CHEMBL1421",
          "CHEMBL1421720",
          "CHEMBL1461728",
          "CHEMBL1516890",
          "CHEMBL1614701",
          "CHEMBL1614705",
          "CHEMBL1614771",
          "CHEMBL1614772",
          "CHEMBL1614773",
          "CHEMBL1614774",
          "CHEMBL1614775",
          "CHEMBL1614776",
          "CHEMBL1614777",
          "CHEMBL162",
          "CHEMBL1624529",
          "CHEMBL1643355",
          "CHEMBL1643356",
          "CHEMBL1643357",
          "CHEMBL1643358",
          "CHEMBL1643359",
          "CHEMBL1643360",
          "CHEMBL1643361",
          "CHEMBL1643362",
          "CHEMBL1643363",
          "CHEMBL1643364",
          "CHEMBL1643365",
          "CHEMBL1643366",
          "CHEMBL1643367",
          "CHEMBL1643368",
          "CHEMBL1643571",
          "CHEMBL1643572",
          "CHEMBL1643573",
          "CHEMBL1643574",
          "CHEMBL1643575",
          "CHEMBL1643576",
          "CHEMBL1667963",
          "CHEMBL1667964",
          "CHEMBL1667965",
          "CHEMBL1667966",
          "CHEMBL1667967",
          "CHEMBL1667968",
          "CHEMBL1667969",
          "CHEMBL1667970",
          "CHEMBL1667971",
          "CHEMBL1667972",
          "CHEMBL1667973",
          "CHEMBL1667974",
          "CHEMBL1667975",
          "CHEMBL1667976",
          "CHEMBL1667977",
          "CHEMBL1667978",
          "CHEMBL1667979",
          "CHEMBL1667980",
          "CHEMBL1682341",
          "CHEMBL1682345",
          "CHEMBL1682346",
          "CHEMBL1682357",
          "CHEMBL1682359",
          "CHEMBL1682360",
          "CHEMBL1682540",
          "CHEMBL1682545",
          "CHEMBL1682546",
          "CHEMBL1682552",
          "CHEMBL1682553",
          "CHEMBL1682558",
          "CHEMBL1688215",
          "CHEMBL1721885",
          "CHEMBL1727312",
          "CHEMBL17370",
          "CHEMBL1765727",
          "CHEMBL1765728",
          "CHEMBL1765729",
          "CHEMBL1765730",
          "CHEMBL1765731",
          "CHEMBL1765732",
          "CHEMBL1765733",
          "CHEMBL1765734",
          "CHEMBL1765735",
          "CHEMBL1765736",
          "CHEMBL1765737",
          "CHEMBL1765738",
          "CHEMBL1765739",
          "CHEMBL1765740",
          "CHEMBL1765741",
          "CHEMBL1765742",
          "CHEMBL1765743",
          "CHEMBL1765744",
          "CHEMBL1765745",
          "CHEMBL1765746",
          "CHEMBL1765747",
          "CHEMBL1765748",
          "CHEMBL1765749",
          "CHEMBL1765750",
          "CHEMBL1765751",
          "CHEMBL1765756",
          "CHEMBL1765757",
          "CHEMBL1765758",
          "CHEMBL1765759",
          "CHEMBL1765760",
          "CHEMBL1765761",
          "CHEMBL1765762",
          "CHEMBL1765876",
          "CHEMBL1765877",
          "CHEMBL1765878",
          "CHEMBL1765879",
          "CHEMBL178737",
          "CHEMBL1789941",
          "CHEMBL1794064",
          "CHEMBL1794065",
          "CHEMBL1794066",
          "CHEMBL180022",
          "CHEMBL1825138",
          "CHEMBL183844",
          "CHEMBL184847",
          "CHEMBL185569",
          "CHEMBL1870106",
          "CHEMBL1879463",
          "CHEMBL188434",
          "CHEMBL1890036",
          "CHEMBL189657",
          "CHEMBL189963",
          "CHEMBL1908391",
          "CHEMBL1908392",
          "CHEMBL1908393",
          "CHEMBL1908394",
          "CHEMBL1908395",
          "CHEMBL1908396",
          "CHEMBL1908397",
          "CHEMBL191003",
          "CHEMBL1922026",
          "CHEMBL1922034",
          "CHEMBL1922045",
          "CHEMBL1922132",
          "CHEMBL1923052",
          "CHEMBL1923053",
          "CHEMBL1923161",
          "CHEMBL1923162",
          "CHEMBL1923163",
          "CHEMBL1923164",
          "CHEMBL1923165",
          "CHEMBL1923166",
          "CHEMBL1923167",
          "CHEMBL1923168",
          "CHEMBL1923169",
          "CHEMBL1923170",
          "CHEMBL1923171",
          "CHEMBL1923172",
          "CHEMBL1923173",
          "CHEMBL1923174",
          "CHEMBL1923175",
          "CHEMBL1923176",
          "CHEMBL1923177",
          "CHEMBL1923178",
          "CHEMBL1923179",
          "CHEMBL1923180",
          "CHEMBL1923181",
          "CHEMBL1923182",
          "CHEMBL1923183",
          "CHEMBL1929238",
          "CHEMBL1956071",
          "CHEMBL1956072",
          "CHEMBL1957085",
          "CHEMBL1958401",
          "CHEMBL196363",
          "CHEMBL1964290",
          "CHEMBL1964307",
          "CHEMBL1964382",
          "CHEMBL1964399",
          "CHEMBL1964413",
          "CHEMBL1964441",
          "CHEMBL1964444",
          "CHEMBL1964644",
          "CHEMBL1964687",
          "CHEMBL1964692",
          "CHEMBL1964777",
          "CHEMBL1964804",
          "CHEMBL1964902",
          "CHEMBL1964937",
          "CHEMBL1965033",
          "CHEMBL1965131",
          "CHEMBL1965169",
          "CHEMBL1965170",
          "CHEMBL1965387",
          "CHEMBL1965423",
          "CHEMBL1965495",
          "CHEMBL1965507",
          "CHEMBL1965570",
          "CHEMBL1965589",
          "CHEMBL1965631",
          "CHEMBL1965660",
          "CHEMBL1965683",
          "CHEMBL1965702",
          "CHEMBL1965836",
          "CHEMBL1965845",
          "CHEMBL1965910",
          "CHEMBL1965988",
          "CHEMBL1966035",
          "CHEMBL1966069",
          "CHEMBL1966087",
          "CHEMBL1966175",
          "CHEMBL1966204",
          "CHEMBL1966279",
          "CHEMBL1966343",
          "CHEMBL1966425",
          "CHEMBL1966514",
          "CHEMBL1966524",
          "CHEMBL1966703",
          "CHEMBL1966722",
          "CHEMBL1966808",
          "CHEMBL1966816",
          "CHEMBL1966842",
          "CHEMBL1967094",
          "CHEMBL1967116",
          "CHEMBL1967252",
          "CHEMBL1967302",
          "CHEMBL1967336",
          "CHEMBL1967513",
          "CHEMBL1967531",
          "CHEMBL1967544",
          "CHEMBL1967560",
          "CHEMBL1967564",
          "CHEMBL1967719",
          "CHEMBL1967720",
          "CHEMBL1967878",
          "CHEMBL1967887",
          "CHEMBL1967992",
          "CHEMBL1967998",
          "CHEMBL1968070",
          "CHEMBL1968127",
          "CHEMBL1968151",
          "CHEMBL1968245",
          "CHEMBL1968380",
          "CHEMBL1968406",
          "CHEMBL1968590",
          "CHEMBL1968606",
          "CHEMBL1968705",
          "CHEMBL1968791",
          "CHEMBL1968850",
          "CHEMBL1968868",
          "CHEMBL1968926",
          "CHEMBL1968930",
          "CHEMBL1969042",
          "CHEMBL1969049",
          "CHEMBL1969102",
          "CHEMBL1969126",
          "CHEMBL1969151",
          "CHEMBL1969156",
          "CHEMBL1969190",
          "CHEMBL1969264",
          "CHEMBL1969301",
          "CHEMBL1969372",
          "CHEMBL1969483",
          "CHEMBL1969502",
          "CHEMBL1969506",
          "CHEMBL1969523",
          "CHEMBL1969537",
          "CHEMBL1969561",
          "CHEMBL1969588",
          "CHEMBL1969664",
          "CHEMBL1969735",
          "CHEMBL1969755",
          "CHEMBL1969843",
          "CHEMBL1969879",
          "CHEMBL1969942",
          "CHEMBL1970006",
          "CHEMBL1970074",
          "CHEMBL1970083",
          "CHEMBL1970104",
          "CHEMBL1970142",
          "CHEMBL1970189",
          "CHEMBL1970203",
          "CHEMBL1970217",
          "CHEMBL1970314",
          "CHEMBL1970317",
          "CHEMBL1970340",
          "CHEMBL1970352",
          "CHEMBL1970369",
          "CHEMBL1970522",
          "CHEMBL1970709",
          "CHEMBL1970735",
          "CHEMBL1970806",
          "CHEMBL1970873",
          "CHEMBL1970879",
          "CHEMBL1970903",
          "CHEMBL1970913",
          "CHEMBL1971017",
          "CHEMBL1971021",
          "CHEMBL1971029",
          "CHEMBL1971141",
          "CHEMBL1971149",
          "CHEMBL1971186",
          "CHEMBL1971245",
          "CHEMBL1971289",
          "CHEMBL1971430",
          "CHEMBL1971519",
          "CHEMBL1971534",
          "CHEMBL1971606",
          "CHEMBL1971649",
          "CHEMBL1971694",
          "CHEMBL1971801",
          "CHEMBL1971947",
          "CHEMBL1972119",
          "CHEMBL1972125",
          "CHEMBL1972142",
          "CHEMBL1972152",
          "CHEMBL1972158",
          "CHEMBL1972183",
          "CHEMBL1972220",
          "CHEMBL1972221",
          "CHEMBL1972250",
          "CHEMBL1972258",
          "CHEMBL1972276",
          "CHEMBL1972290",
          "CHEMBL1972346",
          "CHEMBL1972355",
          "CHEMBL1972362",
          "CHEMBL1972462",
          "CHEMBL1972489",
          "CHEMBL1972568",
          "CHEMBL1972576",
          "CHEMBL1972584",
          "CHEMBL1972659",
          "CHEMBL1972820",
          "CHEMBL1972840",
          "CHEMBL1972849",
          "CHEMBL1972934",
          "CHEMBL1972937",
          "CHEMBL1973013",
          "CHEMBL1973016",
          "CHEMBL1973098",
          "CHEMBL1973138",
          "CHEMBL1973142",
          "CHEMBL1973145",
          "CHEMBL1973211",
          "CHEMBL1973348",
          "CHEMBL1973359",
          "CHEMBL1973363",
          "CHEMBL1973395",
          "CHEMBL1973483",
          "CHEMBL1973516",
          "CHEMBL1973540",
          "CHEMBL1973711",
          "CHEMBL1973720",
          "CHEMBL1973793",
          "CHEMBL1973808",
          "CHEMBL1973860",
          "CHEMBL1973868",
          "CHEMBL1973893",
          "CHEMBL1973937",
          "CHEMBL1973961",
          "CHEMBL1974157",
          "CHEMBL1974254",
          "CHEMBL1974288",
          "CHEMBL1974310",
          "CHEMBL1974328",
          "CHEMBL1974363",
          "CHEMBL1974416",
          "CHEMBL1974457",
          "CHEMBL1974617",
          "CHEMBL1974664",
          "CHEMBL1974702",
          "CHEMBL1974803",
          "CHEMBL1974875",
          "CHEMBL1974935",
          "CHEMBL1975121",
          "CHEMBL1975128",
          "CHEMBL1975138",
          "CHEMBL1975208",
          "CHEMBL1975212",
          "CHEMBL1975233",
          "CHEMBL1975256",
          "CHEMBL1975357",
          "CHEMBL1975418",
          "CHEMBL1975490",
          "CHEMBL1975500",
          "CHEMBL1975503",
          "CHEMBL1975534",
          "CHEMBL1975647",
          "CHEMBL1975787",
          "CHEMBL1975900",
          "CHEMBL1975903",
          "CHEMBL1975921",
          "CHEMBL1975923",
          "CHEMBL1976040",
          "CHEMBL1976090",
          "CHEMBL1976093",
          "CHEMBL1976134",
          "CHEMBL1976196",
          "CHEMBL1976220",
          "CHEMBL1976240",
          "CHEMBL1976290",
          "CHEMBL1976328",
          "CHEMBL1976376",
          "CHEMBL1976420",
          "CHEMBL1976455",
          "CHEMBL1976732",
          "CHEMBL1976936",
          "CHEMBL1977041",
          "CHEMBL1977128",
          "CHEMBL1977134",
          "CHEMBL1977135",
          "CHEMBL1977138",
          "CHEMBL1977148",
          "CHEMBL1977223",
          "CHEMBL1977346",
          "CHEMBL1977374",
          "CHEMBL1977604",
          "CHEMBL1977634",
          "CHEMBL1977681",
          "CHEMBL1977713",
          "CHEMBL1977749",
          "CHEMBL1977814",
          "CHEMBL1978014",
          "CHEMBL1978099",
          "CHEMBL1978166",
          "CHEMBL1978167",
          "CHEMBL1978195",
          "CHEMBL1978200",
          "CHEMBL1978267",
          "CHEMBL1978371",
          "CHEMBL1978448",
          "CHEMBL1978562",
          "CHEMBL1978567",
          "CHEMBL1978656",
          "CHEMBL1979057",
          "CHEMBL1979093",
          "CHEMBL1979176",
          "CHEMBL1979252",
          "CHEMBL1979318",
          "CHEMBL1979357",
          "CHEMBL1979516",
          "CHEMBL1979554",
          "CHEMBL1979577",
          "CHEMBL1979690",
          "CHEMBL1979718",
          "CHEMBL1979855",
          "CHEMBL1979883",
          "CHEMBL1979933",
          "CHEMBL1979970",
          "CHEMBL1980003",
          "CHEMBL1980142",
          "CHEMBL1980144",
          "CHEMBL1980163",
          "CHEMBL1980167",
          "CHEMBL1980246",
          "CHEMBL1980297",
          "CHEMBL1980329",
          "CHEMBL1980376",
          "CHEMBL1980391",
          "CHEMBL1980407",
          "CHEMBL1980489",
          "CHEMBL1980540",
          "CHEMBL1980562",
          "CHEMBL1980671",
          "CHEMBL1980704",
          "CHEMBL1980715",
          "CHEMBL1980763",
          "CHEMBL1980802",
          "CHEMBL1980896",
          "CHEMBL1980995",
          "CHEMBL1981045",
          "CHEMBL1981047",
          "CHEMBL1981079",
          "CHEMBL1981215",
          "CHEMBL1981410",
          "CHEMBL1981492",
          "CHEMBL1981720",
          "CHEMBL1981725",
          "CHEMBL1981744",
          "CHEMBL1981782",
          "CHEMBL1981792",
          "CHEMBL1982122",
          "CHEMBL1982135",
          "CHEMBL1982167",
          "CHEMBL1982271",
          "CHEMBL1982361",
          "CHEMBL1982383",
          "CHEMBL1982413",
          "CHEMBL1982465",
          "CHEMBL1982466",
          "CHEMBL1982476",
          "CHEMBL1982506",
          "CHEMBL1982563",
          "CHEMBL1982610",
          "CHEMBL1982660",
          "CHEMBL1982700",
          "CHEMBL1982711",
          "CHEMBL1982753",
          "CHEMBL1982866",
          "CHEMBL1982874",
          "CHEMBL1982880",
          "CHEMBL1982924",
          "CHEMBL1982957",
          "CHEMBL1982980",
          "CHEMBL1982992",
          "CHEMBL1983006",
          "CHEMBL1983025",
          "CHEMBL1983111",
          "CHEMBL1983195",
          "CHEMBL1983268",
          "CHEMBL1983309",
          "CHEMBL1983348",
          "CHEMBL1983393",
          "CHEMBL1983449",
          "CHEMBL1983534",
          "CHEMBL1983575",
          "CHEMBL1983589",
          "CHEMBL1983595",
          "CHEMBL1983640",
          "CHEMBL1983715",
          "CHEMBL1983923",
          "CHEMBL1983932",
          "CHEMBL1983945",
          "CHEMBL1983963",
          "CHEMBL1983980",
          "CHEMBL1984038",
          "CHEMBL1984039",
          "CHEMBL1984044",
          "CHEMBL1984162",
          "CHEMBL1984191",
          "CHEMBL1984206",
          "CHEMBL1984236",
          "CHEMBL1984274",
          "CHEMBL1984296",
          "CHEMBL1984363",
          "CHEMBL1984367",
          "CHEMBL1984432",
          "CHEMBL1984500",
          "CHEMBL1984541",
          "CHEMBL1984586",
          "CHEMBL1984633",
          "CHEMBL1984686",
          "CHEMBL1984700",
          "CHEMBL1984711",
          "CHEMBL1984760",
          "CHEMBL1984788",
          "CHEMBL1984842",
          "CHEMBL1985074",
          "CHEMBL1985092",
          "CHEMBL1985095",
          "CHEMBL1985206",
          "CHEMBL1985311",
          "CHEMBL1985367",
          "CHEMBL1985406",
          "CHEMBL1985566",
          "CHEMBL1985580",
          "CHEMBL1985681",
          "CHEMBL1985723",
          "CHEMBL1986139",
          "CHEMBL1986143",
          "CHEMBL1986177",
          "CHEMBL1986186",
          "CHEMBL1986263",
          "CHEMBL1986265",
          "CHEMBL1986328",
          "CHEMBL1986499",
          "CHEMBL1986503",
          "CHEMBL1986530",
          "CHEMBL1986590",
          "CHEMBL1986597",
          "CHEMBL1986603",
          "CHEMBL1986756",
          "CHEMBL1986781",
          "CHEMBL1986869",
          "CHEMBL1986899",
          "CHEMBL1986943",
          "CHEMBL1986970",
          "CHEMBL1987007",
          "CHEMBL1987009",
          "CHEMBL1987034",
          "CHEMBL1987054",
          "CHEMBL1987073",
          "CHEMBL1987359",
          "CHEMBL1987430",
          "CHEMBL1987448",
          "CHEMBL1987533",
          "CHEMBL1987535",
          "CHEMBL1987648",
          "CHEMBL1987679",
          "CHEMBL1987756",
          "CHEMBL1987793",
          "CHEMBL1987910",
          "CHEMBL1987948",
          "CHEMBL1987982",
          "CHEMBL1987998",
          "CHEMBL1988075",
          "CHEMBL1988076",
          "CHEMBL1988141",
          "CHEMBL1988153",
          "CHEMBL1988163",
          "CHEMBL1988173",
          "CHEMBL1988300",
          "CHEMBL1988370",
          "CHEMBL1988387",
          "CHEMBL1988437",
          "CHEMBL1988537",
          "CHEMBL1988581",
          "CHEMBL1988594",
          "CHEMBL1988608",
          "CHEMBL1988692",
          "CHEMBL1988717",
          "CHEMBL1988805",
          "CHEMBL1988838",
          "CHEMBL1988872",
          "CHEMBL1988995",
          "CHEMBL1989029",
          "CHEMBL1989043",
          "CHEMBL1989265",
          "CHEMBL1989267",
          "CHEMBL1989423",
          "CHEMBL1989471",
          "CHEMBL1989474",
          "CHEMBL1989518",
          "CHEMBL1989646",
          "CHEMBL1989708",
          "CHEMBL1989805",
          "CHEMBL1989834",
          "CHEMBL1989856",
          "CHEMBL1989957",
          "CHEMBL1990162",
          "CHEMBL1990212",
          "CHEMBL1990223",
          "CHEMBL1990254",
          "CHEMBL1990288",
          "CHEMBL1990346",
          "CHEMBL1990415",
          "CHEMBL1990482",
          "CHEMBL1990496",
          "CHEMBL1990583",
          "CHEMBL1990821",
          "CHEMBL1990884",
          "CHEMBL1990885",
          "CHEMBL1990904",
          "CHEMBL1990912",
          "CHEMBL1991078",
          "CHEMBL1991138",
          "CHEMBL1991143",
          "CHEMBL1991180",
          "CHEMBL1991188",
          "CHEMBL1991251",
          "CHEMBL1991285",
          "CHEMBL1991356",
          "CHEMBL1991395",
          "CHEMBL1991410",
          "CHEMBL1991429",
          "CHEMBL1991434",
          "CHEMBL1991577",
          "CHEMBL1991640",
          "CHEMBL1991674",
          "CHEMBL1991678",
          "CHEMBL1991725",
          "CHEMBL1991728",
          "CHEMBL1991734",
          "CHEMBL1991782",
          "CHEMBL1991800",
          "CHEMBL1991846",
          "CHEMBL1991867",
          "CHEMBL1992042",
          "CHEMBL1992073",
          "CHEMBL1992125",
          "CHEMBL1992231",
          "CHEMBL1992242",
          "CHEMBL1992306",
          "CHEMBL1992323",
          "CHEMBL1992342",
          "CHEMBL1992363",
          "CHEMBL1992371",
          "CHEMBL1992536",
          "CHEMBL1992555",
          "CHEMBL1992581",
          "CHEMBL1992634",
          "CHEMBL1992645",
          "CHEMBL1992723",
          "CHEMBL1992732",
          "CHEMBL1992740",
          "CHEMBL1992796",
          "CHEMBL1992922",
          "CHEMBL1992937",
          "CHEMBL1993166",
          "CHEMBL1993243",
          "CHEMBL1993335",
          "CHEMBL1993374",
          "CHEMBL1993413",
          "CHEMBL1993424",
          "CHEMBL1993548",
          "CHEMBL1993584",
          "CHEMBL1993661",
          "CHEMBL1993722",
          "CHEMBL1993781",
          "CHEMBL1993877",
          "CHEMBL1993904",
          "CHEMBL1993941",
          "CHEMBL1994040",
          "CHEMBL1994074",
          "CHEMBL1994159",
          "CHEMBL1994241",
          "CHEMBL1994308",
          "CHEMBL1994318",
          "CHEMBL1994321",
          "CHEMBL1994361",
          "CHEMBL1994438",
          "CHEMBL1994526",
          "CHEMBL1994538",
          "CHEMBL1994555",
          "CHEMBL1994693",
          "CHEMBL1994724",
          "CHEMBL1994830",
          "CHEMBL1994864",
          "CHEMBL1994938",
          "CHEMBL1995172",
          "CHEMBL1995211",
          "CHEMBL1995448",
          "CHEMBL1995592",
          "CHEMBL1995712",
          "CHEMBL1995736",
          "CHEMBL1995740",
          "CHEMBL1995765",
          "CHEMBL1995811",
          "CHEMBL1995813",
          "CHEMBL1995832",
          "CHEMBL1995927",
          "CHEMBL1996048",
          "CHEMBL1996066",
          "CHEMBL1996111",
          "CHEMBL1996155",
          "CHEMBL1996176",
          "CHEMBL1996208",
          "CHEMBL1996234",
          "CHEMBL1996345",
          "CHEMBL1996390",
          "CHEMBL1996500",
          "CHEMBL1996510",
          "CHEMBL1996543",
          "CHEMBL1996576",
          "CHEMBL1996587",
          "CHEMBL1996604",
          "CHEMBL1996646",
          "CHEMBL1996649",
          "CHEMBL1996702",
          "CHEMBL1996780",
          "CHEMBL1996791",
          "CHEMBL1996817",
          "CHEMBL1996831",
          "CHEMBL1996837",
          "CHEMBL1996923",
          "CHEMBL1996931",
          "CHEMBL1996979",
          "CHEMBL1996980",
          "CHEMBL1997007",
          "CHEMBL1997023",
          "CHEMBL1997025",
          "CHEMBL1997041",
          "CHEMBL1997051",
          "CHEMBL1997119",
          "CHEMBL1997129",
          "CHEMBL1997193",
          "CHEMBL1997197",
          "CHEMBL1997275",
          "CHEMBL1997335",
          "CHEMBL1997340",
          "CHEMBL1997349",
          "CHEMBL1997503",
          "CHEMBL1997534",
          "CHEMBL1997597",
          "CHEMBL1997611",
          "CHEMBL1997617",
          "CHEMBL1997623",
          "CHEMBL1997759",
          "CHEMBL1997764",
          "CHEMBL1997822",
          "CHEMBL1997846",
          "CHEMBL1997872",
          "CHEMBL1997892",
          "CHEMBL1997909",
          "CHEMBL1997924",
          "CHEMBL1998110",
          "CHEMBL1998112",
          "CHEMBL1998121",
          "CHEMBL1998159",
          "CHEMBL1998193",
          "CHEMBL1998253",
          "CHEMBL1998414",
          "CHEMBL1998435",
          "CHEMBL1998470",
          "CHEMBL1998545",
          "CHEMBL1998551",
          "CHEMBL1998585",
          "CHEMBL1998611",
          "CHEMBL1998680",
          "CHEMBL1998829",
          "CHEMBL1998953",
          "CHEMBL1999112",
          "CHEMBL1999126",
          "CHEMBL1999321",
          "CHEMBL1999414",
          "CHEMBL1999428",
          "CHEMBL1999484",
          "CHEMBL1999496",
          "CHEMBL1999556",
          "CHEMBL1999590",
          "CHEMBL1999714",
          "CHEMBL1999718",
          "CHEMBL1999749",
          "CHEMBL1999774",
          "CHEMBL1999811",
          "CHEMBL1999918",
          "CHEMBL1999931",
          "CHEMBL2000029",
          "CHEMBL2000071",
          "CHEMBL2000078",
          "CHEMBL2000104",
          "CHEMBL2000114",
          "CHEMBL2000271",
          "CHEMBL2000335",
          "CHEMBL2000345",
          "CHEMBL2000354",
          "CHEMBL2000393",
          "CHEMBL2000408",
          "CHEMBL2000429",
          "CHEMBL2000433",
          "CHEMBL2000481",
          "CHEMBL2000508",
          "CHEMBL2000568",
          "CHEMBL2000685",
          "CHEMBL2000801",
          "CHEMBL2000832",
          "CHEMBL2000879",
          "CHEMBL2000894",
          "CHEMBL2000934",
          "CHEMBL2001019",
          "CHEMBL2001149",
          "CHEMBL2001224",
          "CHEMBL2001228",
          "CHEMBL2001239",
          "CHEMBL2001257",
          "CHEMBL2001288",
          "CHEMBL2001398",
          "CHEMBL2001451",
          "CHEMBL2001485",
          "CHEMBL2001539",
          "CHEMBL2001547",
          "CHEMBL2001584",
          "CHEMBL2001613",
          "CHEMBL2001641",
          "CHEMBL2001668",
          "CHEMBL2001751",
          "CHEMBL2001920",
          "CHEMBL2001923",
          "CHEMBL2001957",
          "CHEMBL2001987",
          "CHEMBL2001998",
          "CHEMBL2002099",
          "CHEMBL2002105",
          "CHEMBL2002165",
          "CHEMBL2002240",
          "CHEMBL2002322",
          "CHEMBL2002323",
          "CHEMBL2002373",
          "CHEMBL2002407",
          "CHEMBL2002446",
          "CHEMBL2002470",
          "CHEMBL2002479",
          "CHEMBL2002553",
          "CHEMBL2002586",
          "CHEMBL2002599",
          "CHEMBL2002649",
          "CHEMBL2002682",
          "CHEMBL2002690",
          "CHEMBL2002702",
          "CHEMBL2002726",
          "CHEMBL2002736",
          "CHEMBL2002802",
          "CHEMBL2002992",
          "CHEMBL2003271",
          "CHEMBL2003286",
          "CHEMBL2003341",
          "CHEMBL2003420",
          "CHEMBL2003456",
          "CHEMBL2003482",
          "CHEMBL2003514",
          "CHEMBL2003524",
          "CHEMBL2003638",
          "CHEMBL2003657",
          "CHEMBL2003689",
          "CHEMBL2003768",
          "CHEMBL2003785",
          "CHEMBL2003817",
          "CHEMBL2004025",
          "CHEMBL2004072",
          "CHEMBL2004118",
          "CHEMBL2004159",
          "CHEMBL2004290",
          "CHEMBL2004311",
          "CHEMBL2004355",
          "CHEMBL2004365",
          "CHEMBL2004419",
          "CHEMBL2004438",
          "CHEMBL2004447",
          "CHEMBL2004513",
          "CHEMBL2004515",
          "CHEMBL2004544",
          "CHEMBL2004615",
          "CHEMBL2004647",
          "CHEMBL2004692",
          "CHEMBL2004716",
          "CHEMBL2004771",
          "CHEMBL2004871",
          "CHEMBL2004872",
          "CHEMBL2004892",
          "CHEMBL2004934",
          "CHEMBL2005112",
          "CHEMBL2005186",
          "CHEMBL2005216",
          "CHEMBL2005375",
          "CHEMBL2005449",
          "CHEMBL2005475",
          "CHEMBL2005478",
          "CHEMBL2005482",
          "CHEMBL2005528",
          "CHEMBL2005548",
          "CHEMBL2005631",
          "CHEMBL2005699",
          "CHEMBL2005718",
          "CHEMBL2005792",
          "CHEMBL2005828",
          "CHEMBL2005886",
          "CHEMBL2005899",
          "CHEMBL2005936",
          "CHEMBL2006010",
          "CHEMBL2006156",
          "CHEMBL2006188",
          "CHEMBL2006237",
          "CHEMBL2006263",
          "CHEMBL2006276",
          "CHEMBL2006299",
          "CHEMBL2006439",
          "CHEMBL2006450",
          "CHEMBL2006481",
          "CHEMBL2006493",
          "CHEMBL2006564",
          "CHEMBL2006567",
          "CHEMBL2006580",
          "CHEMBL2006581",
          "CHEMBL2006631",
          "CHEMBL2006674",
          "CHEMBL2006715",
          "CHEMBL2006765",
          "CHEMBL2006778",
          "CHEMBL2006785",
          "CHEMBL2006836",
          "CHEMBL2006933",
          "CHEMBL2007002",
          "CHEMBL2007044",
          "CHEMBL2007064",
          "CHEMBL2007124",
          "CHEMBL2007151",
          "CHEMBL2007266",
          "CHEMBL2007296",
          "CHEMBL2007372",
          "CHEMBL2007375",
          "CHEMBL2007421",
          "CHEMBL2007479",
          "CHEMBL2007559",
          "CHEMBL2007574",
          "CHEMBL2007592",
          "CHEMBL2007603",
          "CHEMBL2017214",
          "CHEMBL2022282",
          "CHEMBL2023147",
          "CHEMBL2023149",
          "CHEMBL2023150",
          "CHEMBL2023151",
          "CHEMBL2023152",
          "CHEMBL2023153",
          "CHEMBL2023154",
          "CHEMBL2023155",
          "CHEMBL2023156",
          "CHEMBL2023157",
          "CHEMBL2023158",
          "CHEMBL2023159",
          "CHEMBL2023160",
          "CHEMBL2023161",
          "CHEMBL2023841",
          "CHEMBL202635",
          "CHEMBL202721",
          "CHEMBL2046643",
          "CHEMBL2063926",
          "CHEMBL207253",
          "CHEMBL207400",
          "CHEMBL207995",
          "CHEMBL208637",
          "CHEMBL209534",
          "CHEMBL210032",
          "CHEMBL210618",
          "CHEMBL210887",
          "CHEMBL210928",
          "CHEMBL210963",
          "CHEMBL211378",
          "CHEMBL21156",
          "CHEMBL213505",
          "CHEMBL215152",
          "CHEMBL216574",
          "CHEMBL217910",
          "CHEMBL218257",
          "CHEMBL218654",
          "CHEMBL218719",
          "CHEMBL218720",
          "CHEMBL218868",
          "CHEMBL218869",
          "CHEMBL218870",
          "CHEMBL219722",
          "CHEMBL220057",
          "CHEMBL220080",
          "CHEMBL220241",
          "CHEMBL220408",
          "CHEMBL220465",
          "CHEMBL2205426",
          "CHEMBL221959",
          "CHEMBL223257",
          "CHEMBL223360",
          "CHEMBL223367",
          "CHEMBL223460",
          "CHEMBL225282",
          "CHEMBL225519",
          "CHEMBL226403",
          "CHEMBL226471",
          "CHEMBL230011",
          "CHEMBL2309006",
          "CHEMBL2309609",
          "CHEMBL231209",
          "CHEMBL2325741",
          "CHEMBL2331562",
          "CHEMBL2332056",
          "CHEMBL2332059",
          "CHEMBL2332060",
          "CHEMBL2332063",
          "CHEMBL2332065",
          "CHEMBL2332068",
          "CHEMBL2332069",
          "CHEMBL2332071",
          "CHEMBL2332073",
          "CHEMBL2332076",
          "CHEMBL2332097",
          "CHEMBL2333365",
          "CHEMBL2333882",
          "CHEMBL2333884",
          "CHEMBL2333887",
          "CHEMBL2333894",
          "CHEMBL2333896",
          "CHEMBL2333898",
          "CHEMBL2333905",
          "CHEMBL2333906",
          "CHEMBL2333908",
          "CHEMBL2333909",
          "CHEMBL2334288",
          "CHEMBL2334292",
          "CHEMBL234085",
          "CHEMBL242865",
          "CHEMBL243088",
          "CHEMBL244378",
          "CHEMBL246970",
          "CHEMBL24828",
          "CHEMBL248757",
          "CHEMBL249089",
          "CHEMBL249282",
          "CHEMBL249697",
          "CHEMBL253969",
          "CHEMBL255863",
          "CHEMBL256835",
          "CHEMBL259084",
          "CHEMBL259850",
          "CHEMBL259922",
          "CHEMBL260092",
          "CHEMBL260135",
          "CHEMBL261849",
          "CHEMBL262433",
          "CHEMBL262623",
          "CHEMBL271271",
          "CHEMBL271381",
          "CHEMBL272453",
          "CHEMBL274064",
          "CHEMBL278041",
          "CHEMBL288441",
          "CHEMBL289959",
          "CHEMBL296468",
          "CHEMBL296586",
          "CHEMBL300138",
          "CHEMBL302449",
          "CHEMBL306380",
          "CHEMBL316264",
          "CHEMBL31965",
          "CHEMBL326282",
          "CHEMBL336961",
          "CHEMBL340384",
          "CHEMBL340921",
          "CHEMBL360847",
          "CHEMBL362558",
          "CHEMBL363648",
          "CHEMBL365286",
          "CHEMBL365617",
          "CHEMBL371206",
          "CHEMBL373419",
          "CHEMBL373598",
          "CHEMBL374453",
          "CHEMBL375284",
          "CHEMBL375312",
          "CHEMBL375877",
          "CHEMBL376321",
          "CHEMBL377300",
          "CHEMBL377383",
          "CHEMBL377408",
          "CHEMBL378627",
          "CHEMBL379218",
          "CHEMBL379835",
          "CHEMBL379975",
          "CHEMBL38380",
          "CHEMBL384073",
          "CHEMBL384304",
          "CHEMBL386051",
          "CHEMBL387338",
          "CHEMBL387971",
          "CHEMBL392642",
          "CHEMBL394619",
          "CHEMBL394790",
          "CHEMBL396523",
          "CHEMBL398951",
          "CHEMBL402846",
          "CHEMBL404367",
          "CHEMBL406821",
          "CHEMBL406845",
          "CHEMBL411903",
          "CHEMBL412142",
          "CHEMBL413779",
          "CHEMBL415049",
          "CHEMBL41783",
          "CHEMBL422897",
          "CHEMBL424872",
          "CHEMBL426526",
          "CHEMBL427058",
          "CHEMBL428690",
          "CHEMBL429700",
          "CHEMBL437747",
          "CHEMBL440084",
          "CHEMBL441702",
          "CHEMBL443962",
          "CHEMBL445180",
          "CHEMBL445813",
          "CHEMBL450487",
          "CHEMBL450786",
          "CHEMBL451401",
          "CHEMBL451964",
          "CHEMBL453510",
          "CHEMBL458997",
          "CHEMBL461876",
          "CHEMBL462120",
          "CHEMBL464552",
          "CHEMBL466496",
          "CHEMBL467069",
          "CHEMBL468125",
          "CHEMBL468280",
          "CHEMBL473080",
          "CHEMBL474432",
          "CHEMBL475251",
          "CHEMBL477772",
          "CHEMBL477817",
          "CHEMBL481248",
          "CHEMBL481491",
          "CHEMBL482538",
          "CHEMBL482747",
          "CHEMBL482767",
          "CHEMBL482967",
          "CHEMBL483158",
          "CHEMBL483387",
          "CHEMBL483394",
          "CHEMBL483395",
          "CHEMBL483396",
          "CHEMBL483401",
          "CHEMBL483402",
          "CHEMBL483568",
          "CHEMBL483574",
          "CHEMBL483575",
          "CHEMBL484390",
          "CHEMBL484967",
          "CHEMBL484968",
          "CHEMBL485440",
          "CHEMBL485556",
          "CHEMBL485585",
          "CHEMBL485586",
          "CHEMBL485592",
          "CHEMBL485598",
          "CHEMBL485611",
          "CHEMBL485612",
          "CHEMBL49120",
          "CHEMBL491473",
          "CHEMBL491758",
          "CHEMBL493066",
          "CHEMBL493067",
          "CHEMBL493251",
          "CHEMBL493269",
          "CHEMBL493874",
          "CHEMBL493875",
          "CHEMBL493911",
          "CHEMBL494060",
          "CHEMBL494088",
          "CHEMBL494089",
          "CHEMBL494882",
          "CHEMBL497151",
          "CHEMBL503641",
          "CHEMBL504574",
          "CHEMBL504950",
          "CHEMBL506153",
          "CHEMBL507936",
          "CHEMBL508928",
          "CHEMBL50894",
          "CHEMBL509032",
          "CHEMBL511410",
          "CHEMBL513846",
          "CHEMBL513909",
          "CHEMBL514499",
          "CHEMBL519008",
          "CHEMBL519113",
          "CHEMBL519680",
          "CHEMBL519693",
          "CHEMBL519697",
          "CHEMBL519965",
          "CHEMBL520308",
          "CHEMBL520640",
          "CHEMBL520808",
          "CHEMBL520828",
          "CHEMBL520848",
          "CHEMBL521144",
          "CHEMBL521179",
          "CHEMBL521347",
          "CHEMBL521642",
          "CHEMBL521823",
          "CHEMBL521851",
          "CHEMBL522351",
          "CHEMBL522892",
          "CHEMBL523057",
          "CHEMBL523523",
          "CHEMBL523586",
          "CHEMBL523695",
          "CHEMBL523823",
          "CHEMBL523859",
          "CHEMBL52387",
          "CHEMBL525191",
          "CHEMBL526133",
          "CHEMBL535",
          "CHEMBL535331",
          "CHEMBL536151",
          "CHEMBL539099",
          "CHEMBL539474",
          "CHEMBL546797",
          "CHEMBL550418",
          "CHEMBL551140",
          "CHEMBL553",
          "CHEMBL554",
          "CHEMBL558752",
          "CHEMBL559147",
          "CHEMBL560813",
          "CHEMBL561708",
          "CHEMBL565452",
          "CHEMBL565612",
          "CHEMBL566298",
          "CHEMBL567124",
          "CHEMBL567603",
          "CHEMBL570116",
          "CHEMBL570126",
          "CHEMBL570820",
          "CHEMBL570865",
          "CHEMBL571581",
          "CHEMBL571948",
          "CHEMBL572878",
          "CHEMBL572881",
          "CHEMBL572911",
          "CHEMBL573151",
          "CHEMBL573152",
          "CHEMBL573339",
          "CHEMBL574507",
          "CHEMBL574738",
          "CHEMBL575340",
          "CHEMBL575555",
          "CHEMBL575562",
          "CHEMBL575575",
          "CHEMBL575741",
          "CHEMBL575759",
          "CHEMBL575761",
          "CHEMBL575765",
          "CHEMBL575798",
          "CHEMBL575940",
          "CHEMBL575962",
          "CHEMBL575973",
          "CHEMBL575974",
          "CHEMBL576982",
          "CHEMBL577177",
          "CHEMBL578643",
          "CHEMBL583042",
          "CHEMBL583144",
          "CHEMBL584291",
          "CHEMBL589336",
          "CHEMBL589337",
          "CHEMBL589577",
          "CHEMBL589578",
          "CHEMBL589655",
          "CHEMBL589656",
          "CHEMBL590109",
          "CHEMBL590238",
          "CHEMBL590313",
          "CHEMBL591047",
          "CHEMBL591271",
          "CHEMBL591272",
          "CHEMBL591285",
          "CHEMBL591287",
          "CHEMBL591754",
          "CHEMBL591986",
          "CHEMBL592030",
          "CHEMBL592701",
          "CHEMBL592702",
          "CHEMBL592898",
          "CHEMBL593490",
          "CHEMBL594517",
          "CHEMBL594748",
          "CHEMBL594749",
          "CHEMBL594750",
          "CHEMBL595476",
          "CHEMBL595684",
          "CHEMBL595685",
          "CHEMBL595708",
          "CHEMBL595709",
          "CHEMBL596379",
          "CHEMBL598336",
          "CHEMBL598963",
          "CHEMBL599162",
          "CHEMBL599163",
          "CHEMBL600236",
          "CHEMBL600849",
          "CHEMBL601719",
          "CHEMBL601834",
          "CHEMBL602041",
          "CHEMBL602326",
          "CHEMBL602706",
          "CHEMBL602753",
          "CHEMBL604060",
          "CHEMBL604684",
          "CHEMBL604934",
          "CHEMBL605732",
          "CHEMBL605733",
          "CHEMBL606245",
          "CHEMBL608154",
          "CHEMBL610785",
          "CHEMBL611386",
          "CHEMBL67352",
          "CHEMBL7064",
          "CHEMBL91829",
          "CHEMBL939",
          "CHEMBL941",
          "CHEMBL95692"
        ],
        "number_of_missing_values": "0"
      },
      {
        "data_type": "numeric",
        "index": "1",
        "is_ignore": "false",
        "is_row_identifier": "false",
        "is_target": "false",
        "name": "nH",
        "number_of_missing_values": "0"
      },
      {
        "data_type": "numeric",
        "index": "2",
        "is_ignore": "false",
        "is_row_identifier": "false",
        "is_target": "false",
        "name": "RBN",
        "number_of_missing_values": "0"
      },
      {
        "data_type": "numeric",
        "index": "3",
        "is_ignore": "false",
        "is_row_identifier": "false",
        "is_target": "false",
        "name": "Si",
        "number_of_missing_values": "0"
      },
      {
        "data_type": "numeric",
        "index": "4",
        "is_ignore": "false",
        "is_row_identifier": "false",
        "is_target": "false",
        "name": "nBT",
        "number_of_missing_values": "0"
      },
      {
        "data_type": "numeric",
        "index": "5",
        "is_ignore": "false",
        "is_row_identifier": "false",
        "is_target": "false",
        "name": "Se",
        "number_of_missing_values": "0"
      },
      {
        "data_type": "numeric",
        "index": "6",
        "is_ignore": "false",
        "is_row_identifier": "false",
        "is_target": "false",
        "name": "nAT",
        "number_of_missing_values": "0"
      },
      {
        "data_type": "numeric",
        "index": "7",
        "is_ignore": "false",
        "is_row_identifier": "false",
        "is_target": "false",
        "name": "Sp",
        "number_of_missing_values": "0"
      },
      {
        "data_type": "numeric",
        "index": "8",
        "is_ignore": "false",
        "is_row_identifier": "false",
        "is_target": "false",
        "name": "Sv",
        "number_of_missing_values": "0"
      },
      {
        "data_type": "numeric",
        "index": "9",
        "is_ignore": "false",
        "is_row_identifier": "false",
        "is_target": "false",
        "name": "AMW",
        "number_of_missing_values": "0"
      },
      {
        "data_type": "numeric",
        "index": "10",
        "is_ignore": "false",
        "is_row_identifier": "false",
        "is_target": "true",
        "name": "pXC50",
        "number_of_missing_values": "0"
      }
    ]
  }
}