{
  "data_features": {
    "feature": [
      {
        "data_type": "nominal",
        "index": "0",
        "is_ignore": "false",
        "is_row_identifier": "true",
        "is_target": "false",
        "name": "molecule_id",
        "nominal_value": [
          "CHEMBL102301",
          "CHEMBL102346",
          "CHEMBL103055",
          "CHEMBL103870",
          "CHEMBL104011",
          "CHEMBL104067",
          "CHEMBL104074",
          "CHEMBL104087",
          "CHEMBL104202",
          "CHEMBL104266",
          "CHEMBL104325",
          "CHEMBL104466",
          "CHEMBL104473",
          "CHEMBL104477",
          "CHEMBL104581",
          "CHEMBL104616",
          "CHEMBL104798",
          "CHEMBL105066",
          "CHEMBL105280",
          "CHEMBL105305",
          "CHEMBL105322",
          "CHEMBL105364",
          "CHEMBL106614",
          "CHEMBL106772",
          "CHEMBL106878",
          "CHEMBL107402",
          "CHEMBL107677",
          "CHEMBL108007",
          "CHEMBL108216",
          "CHEMBL115220",
          "CHEMBL118130",
          "CHEMBL118904",
          "CHEMBL119977",
          "CHEMBL119982",
          "CHEMBL120069",
          "CHEMBL120319",
          "CHEMBL120703",
          "CHEMBL120979",
          "CHEMBL121190",
          "CHEMBL121260",
          "CHEMBL121796",
          "CHEMBL121954",
          "CHEMBL122068",
          "CHEMBL122182",
          "CHEMBL122243",
          "CHEMBL122245",
          "CHEMBL122411",
          "CHEMBL123189",
          "CHEMBL137865",
          "CHEMBL137962",
          "CHEMBL138312",
          "CHEMBL138376",
          "CHEMBL138425",
          "CHEMBL138523",
          "CHEMBL138558",
          "CHEMBL138566",
          "CHEMBL138980",
          "CHEMBL138982",
          "CHEMBL139729",
          "CHEMBL140342",
          "CHEMBL140457",
          "CHEMBL140603",
          "CHEMBL140702",
          "CHEMBL140715",
          "CHEMBL140802",
          "CHEMBL140964",
          "CHEMBL140967",
          "CHEMBL140972",
          "CHEMBL141229",
          "CHEMBL141257",
          "CHEMBL141453",
          "CHEMBL141460",
          "CHEMBL141461",
          "CHEMBL141745",
          "CHEMBL141762",
          "CHEMBL141852",
          "CHEMBL141920",
          "CHEMBL142090",
          "CHEMBL162",
          "CHEMBL1744060",
          "CHEMBL175862",
          "CHEMBL176019",
          "CHEMBL176078",
          "CHEMBL177298",
          "CHEMBL177688",
          "CHEMBL1788249",
          "CHEMBL190094",
          "CHEMBL190651",
          "CHEMBL191336",
          "CHEMBL196363",
          "CHEMBL20252",
          "CHEMBL203599",
          "CHEMBL20426",
          "CHEMBL20867",
          "CHEMBL20926",
          "CHEMBL21078",
          "CHEMBL21079",
          "CHEMBL21086",
          "CHEMBL2111666",
          "CHEMBL2111669",
          "CHEMBL2112462",
          "CHEMBL2112463",
          "CHEMBL21156",
          "CHEMBL21162",
          "CHEMBL212084",
          "CHEMBL21215",
          "CHEMBL213743",
          "CHEMBL214253",
          "CHEMBL214329",
          "CHEMBL223971",
          "CHEMBL264641",
          "CHEMBL266325",
          "CHEMBL266499",
          "CHEMBL266995",
          "CHEMBL267288",
          "CHEMBL267721",
          "CHEMBL267927",
          "CHEMBL269110",
          "CHEMBL269510",
          "CHEMBL269586",
          "CHEMBL275762",
          "CHEMBL277430",
          "CHEMBL277931",
          "CHEMBL278103",
          "CHEMBL278287",
          "CHEMBL278630",
          "CHEMBL280069",
          "CHEMBL291963",
          "CHEMBL29197",
          "CHEMBL292866",
          "CHEMBL293991",
          "CHEMBL299707",
          "CHEMBL299763",
          "CHEMBL300171",
          "CHEMBL300817",
          "CHEMBL302491",
          "CHEMBL302545",
          "CHEMBL302745",
          "CHEMBL303037",
          "CHEMBL303184",
          "CHEMBL303391",
          "CHEMBL303704",
          "CHEMBL303872",
          "CHEMBL304310",
          "CHEMBL304333",
          "CHEMBL304336",
          "CHEMBL304668",
          "CHEMBL305056",
          "CHEMBL306234",
          "CHEMBL307093",
          "CHEMBL308210",
          "CHEMBL308466",
          "CHEMBL308879",
          "CHEMBL309116",
          "CHEMBL309470",
          "CHEMBL312048",
          "CHEMBL312055",
          "CHEMBL312148",
          "CHEMBL312454",
          "CHEMBL313235",
          "CHEMBL314811",
          "CHEMBL319435",
          "CHEMBL319894",
          "CHEMBL321276",
          "CHEMBL322028",
          "CHEMBL322428",
          "CHEMBL323336",
          "CHEMBL327127",
          "CHEMBL327300",
          "CHEMBL327958",
          "CHEMBL329622",
          "CHEMBL331906",
          "CHEMBL332333",
          "CHEMBL332612",
          "CHEMBL332765",
          "CHEMBL332882",
          "CHEMBL332906",
          "CHEMBL332971",
          "CHEMBL333038",
          "CHEMBL333231",
          "CHEMBL334026",
          "CHEMBL335364",
          "CHEMBL336005",
          "CHEMBL336491",
          "CHEMBL337363",
          "CHEMBL337823",
          "CHEMBL337826",
          "CHEMBL341602",
          "CHEMBL341973",
          "CHEMBL342227",
          "CHEMBL342247",
          "CHEMBL342255",
          "CHEMBL342636",
          "CHEMBL343115",
          "CHEMBL343133",
          "CHEMBL343164",
          "CHEMBL343499",
          "CHEMBL343521",
          "CHEMBL343758",
          "CHEMBL344834",
          "CHEMBL345107",
          "CHEMBL352308",
          "CHEMBL365847",
          "CHEMBL381207",
          "CHEMBL384304",
          "CHEMBL386051",
          "CHEMBL386637",
          "CHEMBL389745",
          "CHEMBL390156",
          "CHEMBL412898",
          "CHEMBL414210",
          "CHEMBL414402",
          "CHEMBL417740",
          "CHEMBL418010",
          "CHEMBL418270",
          "CHEMBL418279",
          "CHEMBL419248",
          "CHEMBL420885",
          "CHEMBL421145",
          "CHEMBL422293",
          "CHEMBL423288",
          "CHEMBL424104",
          "CHEMBL430605",
          "CHEMBL434260",
          "CHEMBL435627",
          "CHEMBL440268",
          "CHEMBL440453",
          "CHEMBL445893",
          "CHEMBL451241",
          "CHEMBL47203",
          "CHEMBL48809",
          "CHEMBL49658",
          "CHEMBL50371",
          "CHEMBL542494",
          "CHEMBL543669",
          "CHEMBL543904",
          "CHEMBL545315",
          "CHEMBL55379",
          "CHEMBL553824",
          "CHEMBL55592",
          "CHEMBL55662",
          "CHEMBL55683",
          "CHEMBL55742",
          "CHEMBL56081",
          "CHEMBL56236",
          "CHEMBL56359",
          "CHEMBL56669",
          "CHEMBL56671",
          "CHEMBL56904",
          "CHEMBL57323",
          "CHEMBL57366",
          "CHEMBL573820",
          "CHEMBL574058",
          "CHEMBL574059",
          "CHEMBL57443",
          "CHEMBL57553",
          "CHEMBL57556",
          "CHEMBL57581",
          "CHEMBL57690",
          "CHEMBL578006",
          "CHEMBL58142",
          "CHEMBL58436",
          "CHEMBL58580",
          "CHEMBL59036",
          "CHEMBL59099",
          "CHEMBL606964",
          "CHEMBL60816",
          "CHEMBL63356",
          "CHEMBL63575",
          "CHEMBL65850",
          "CHEMBL65858",
          "CHEMBL66008",
          "CHEMBL66063",
          "CHEMBL66071",
          "CHEMBL66100",
          "CHEMBL66101",
          "CHEMBL66107",
          "CHEMBL66329",
          "CHEMBL66502",
          "CHEMBL66612",
          "CHEMBL66618",
          "CHEMBL66643",
          "CHEMBL66705",
          "CHEMBL66718",
          "CHEMBL66785",
          "CHEMBL66786",
          "CHEMBL66787",
          "CHEMBL66868",
          "CHEMBL66924",
          "CHEMBL66925",
          "CHEMBL66932",
          "CHEMBL66981",
          "CHEMBL67027",
          "CHEMBL67059",
          "CHEMBL67169",
          "CHEMBL67170",
          "CHEMBL67219",
          "CHEMBL67424",
          "CHEMBL67436",
          "CHEMBL67702",
          "CHEMBL67991",
          "CHEMBL68184",
          "CHEMBL68185",
          "CHEMBL68401",
          "CHEMBL68423",
          "CHEMBL6867",
          "CHEMBL6884",
          "CHEMBL6912",
          "CHEMBL6926",
          "CHEMBL69378",
          "CHEMBL69585",
          "CHEMBL6969",
          "CHEMBL69820",
          "CHEMBL70130",
          "CHEMBL70149",
          "CHEMBL7027",
          "CHEMBL7039",
          "CHEMBL7114",
          "CHEMBL7157",
          "CHEMBL7276",
          "CHEMBL7296",
          "CHEMBL7317",
          "CHEMBL7338",
          "CHEMBL7339",
          "CHEMBL7356",
          "CHEMBL7367",
          "CHEMBL7398",
          "CHEMBL7409",
          "CHEMBL7411",
          "CHEMBL7432",
          "CHEMBL7495",
          "CHEMBL7496",
          "CHEMBL7510",
          "CHEMBL7540",
          "CHEMBL7572",
          "CHEMBL7593",
          "CHEMBL7600",
          "CHEMBL7602",
          "CHEMBL7653",
          "CHEMBL76599",
          "CHEMBL7666",
          "CHEMBL7697",
          "CHEMBL7735",
          "CHEMBL7757",
          "CHEMBL77781",
          "CHEMBL7810",
          "CHEMBL7819",
          "CHEMBL7827",
          "CHEMBL78393",
          "CHEMBL78485",
          "CHEMBL78555",
          "CHEMBL7866",
          "CHEMBL78802",
          "CHEMBL7917",
          "CHEMBL79241",
          "CHEMBL79274",
          "CHEMBL7981",
          "CHEMBL81146",
          "CHEMBL81474",
          "CHEMBL81615",
          "CHEMBL8164",
          "CHEMBL81975",
          "CHEMBL82431",
          "CHEMBL86664",
          "CHEMBL86717",
          "CHEMBL86943",
          "CHEMBL87083",
          "CHEMBL87084",
          "CHEMBL89115",
          "CHEMBL89550",
          "CHEMBL90780",
          "CHEMBL941",
          "CHEMBL99743"
        ],
        "number_of_missing_values": "0"
      },
      {
        "data_type": "numeric",
        "index": "1",
        "is_ignore": "false",
        "is_row_identifier": "false",
        "is_target": "false",
        "name": "FCFP4_1024b1000",
        "number_of_missing_values": "0"
      },
      {
        "data_type": "numeric",
        "index": "2",
        "is_ignore": "false",
        "is_row_identifier": "false",
        "is_target": "false",
        "name": "FCFP4_1024b616",
        "number_of_missing_values": "0"
      },
      {
        "data_type": "numeric",
        "index": "3",
        "is_ignore": "false",
        "is_row_identifier": "false",
        "is_target": "false",
        "name": "FCFP4_1024b111",
        "number_of_missing_values": "0"
      },
      {
        "data_type": "numeric",
        "index": "4",
        "is_ignore": "false",
        "is_row_identifier": "false",
        "is_target": "false",
        "name": "FCFP4_1024b434",
        "number_of_missing_values": "0"
      },
      {
        "data_type": "numeric",
        "index": "5",
        "is_ignore": "false",
        "is_row_identifier": "false",
        "is_target": "false",
        "name": "FCFP4_1024b649",
        "number_of_missing_values": "0"
      },
      {
        "data_type": "numeric",
        "index": "6",
        "is_ignore": "false",
        "is_row_identifier": "false",
        "is_target": "false",
        "name": "FCFP4_1024b270",
        "number_of_missing_values": "0"
      },
      {
        "data_type": "numeric",
        "index": "7",
        "is_ignore": "false",
        "is_row_identifier": "false",
        "is_target": "false",
        "name": "FCFP4_1024b143",
        "number_of_missing_values": "0"
      },
      {
        "data_type": "numeric",
        "index": "8",
        "is_ignore": "false",
        "is_row_identifier": "false",
        "is_target": "false",
        "name": "FCFP4_1024b615",
        "number_of_missing_values": "0"
      },
      {
        "data_type": "numeric",
        "index": "9",
        "is_ignore": "false",
        "is_row_identifier": "false",
        "is_target": "false",
        "name": "FCFP4_1024b933",
        "number_of_missing_values": "0"
      },
      {
        "data_type": "numeric",
        "index": "10",
        "is_ignore": "false",
        "is_row_identifier": "false",
        "is_target": "false",
        "name": "FCFP4_1024b604",
        "number_of_missing_values": "0"
      },
      {
        "data_type": "numeric",
        "index": "11",
        "is_ignore": "false",
        "is_row_identifier": "false",
        "is_target": "false",
        "name": "FCFP4_1024b632",
        "number_of_missing_values": "0"
      },
      {
        "data_type": "numeric",
        "index": "12",
        "is_ignore": "false",
        "is_row_identifier": "false",
        "is_target": "false",
        "name": "FCFP4_1024b635",
        "number_of_missing_values": "0"
      },
      {
        "data_type": "numeric",
        "index": "13",
        "is_ignore": "false",
        "is_row_identifier": "false",
        "is_target": "false",
        "name": "FCFP4_1024b495",
        "number_of_missing_values": "0"
      },
      {
        "data_type": "numeric",
        "index": "14",
        "is_ignore": "false",
        "is_row_identifier": "false",
        "is_target": "false",
        "name": "FCFP4_1024b149",
        "number_of_missing_values": "0"
      },
      {
        "data_type": "numeric",
        "index": "15",
        "is_ignore": "false",
        "is_row_identifier": "false",
        "is_target": "false",
        "name": "FCFP4_1024b666",
        "number_of_missing_values": "0"
      },
      {
        "data_type": "numeric",
        "index": "16",
        "is_ignore": "false",
        "is_row_identifier": "false",
        "is_target": "false",
        "name": "FCFP4_1024b858",
        "number_of_missing_values": "0"
      },
      {
        "data_type": "numeric",
        "index": "17",
        "is_ignore": "false",
        "is_row_identifier": "false",
        "is_target": "false",
        "name": "FCFP4_1024b2",
        "number_of_missing_values": "0"
      },
      {
        "data_type": "numeric",
        "index": "18",
        "is_ignore": "false",
        "is_row_identifier": "false",
        "is_target": "false",
        "name": "FCFP4_1024b833",
        "number_of_missing_values": "0"
      },
      {
        "data_type": "numeric",
        "index": "19",
        "is_ignore": "false",
        "is_row_identifier": "false",
        "is_target": "false",
        "name": "FCFP4_1024b33",
        "number_of_missing_values": "0"
      },
      {
        "data_type": "numeric",
        "index": "20",
        "is_ignore": "false",
        "is_row_identifier": "false",
        "is_target": "false",
        "name": "FCFP4_1024b57",
        "number_of_missing_values": "0"
      },
      {
        "data_type": "numeric",
        "index": "21",
        "is_ignore": "false",
        "is_row_identifier": "false",
        "is_target": "false",
        "name": "FCFP4_1024b823",
        "number_of_missing_values": "0"
      },
      {
        "data_type": "numeric",
        "index": "22",
        "is_ignore": "false",
        "is_row_identifier": "false",
        "is_target": "false",
        "name": "FCFP4_1024b319",
        "number_of_missing_values": "0"
      },
      {
        "data_type": "numeric",
        "index": "23",
        "is_ignore": "false",
        "is_row_identifier": "false",
        "is_target": "false",
        "name": "FCFP4_1024b1",
        "number_of_missing_values": "0"
      },
      {
        "data_type": "numeric",
        "index": "24",
        "is_ignore": "false",
        "is_row_identifier": "false",
        "is_target": "false",
        "name": "FCFP4_1024b942",
        "number_of_missing_values": "0"
      },
      {
        "data_type": "numeric",
        "index": "25",
        "is_ignore": "false",
        "is_row_identifier": "false",
        "is_target": "false",
        "name": "FCFP4_1024b453",
        "number_of_missing_values": "0"
      },
      {
        "data_type": "numeric",
        "index": "26",
        "is_ignore": "false",
        "is_row_identifier": "false",
        "is_target": "false",
        "name": "FCFP4_1024b461",
        "number_of_missing_values": "0"
      },
      {
        "data_type": "numeric",
        "index": "27",
        "is_ignore": "false",
        "is_row_identifier": "false",
        "is_target": "false",
        "name": "FCFP4_1024b128",
        "number_of_missing_values": "0"
      },
      {
        "data_type": "numeric",
        "index": "28",
        "is_ignore": "false",
        "is_row_identifier": "false",
        "is_target": "false",
        "name": "FCFP4_1024b139",
        "number_of_missing_values": "0"
      },
      {
        "data_type": "numeric",
        "index": "29",
        "is_ignore": "false",
        "is_row_identifier": "false",
        "is_target": "false",
        "name": "FCFP4_1024b20",
        "number_of_missing_values": "0"
      },
      {
        "data_type": "numeric",
        "index": "30",
        "is_ignore": "false",
        "is_row_identifier": "false",
        "is_target": "false",
        "name": "FCFP4_1024b432",
        "number_of_missing_values": "0"
      },
      {
        "data_type": "numeric",
        "index": "31",
        "is_ignore": "false",
        "is_row_identifier": "false",
        "is_target": "false",
        "name": "FCFP4_1024b674",
        "number_of_missing_values": "0"
      },
      {
        "data_type": "numeric",
        "index": "32",
        "is_ignore": "false",
        "is_row_identifier": "false",
        "is_target": "false",
        "name": "FCFP4_1024b429",
        "number_of_missing_values": "0"
      },
      {
        "data_type": "numeric",
        "index": "33",
        "is_ignore": "false",
        "is_row_identifier": "false",
        "is_target": "false",
        "name": "FCFP4_1024b409",
        "number_of_missing_values": "0"
      },
      {
        "data_type": "numeric",
        "index": "34",
        "is_ignore": "false",
        "is_row_identifier": "false",
        "is_target": "false",
        "name": "FCFP4_1024b385",
        "number_of_missing_values": "0"
      },
      {
        "data_type": "numeric",
        "index": "35",
        "is_ignore": "false",
        "is_row_identifier": "false",
        "is_target": "false",
        "name": "FCFP4_1024b902",
        "number_of_missing_values": "0"
      },
      {
        "data_type": "numeric",
        "index": "36",
        "is_ignore": "false",
        "is_row_identifier": "false",
        "is_target": "false",
        "name": "FCFP4_1024b376",
        "number_of_missing_values": "0"
      },
      {
        "data_type": "numeric",
        "index": "37",
        "is_ignore": "false",
        "is_row_identifier": "false",
        "is_target": "false",
        "name": "FCFP4_1024b714",
        "number_of_missing_values": "0"
      },
      {
        "data_type": "numeric",
        "index": "38",
        "is_ignore": "false",
        "is_row_identifier": "false",
        "is_target": "false",
        "name": "FCFP4_1024b31",
        "number_of_missing_values": "0"
      },
      {
        "data_type": "numeric",
        "index": "39",
        "is_ignore": "false",
        "is_row_identifier": "false",
        "is_target": "false",
        "name": "FCFP4_1024b923",
        "number_of_missing_values": "0"
      },
      {
        "data_type": "numeric",
        "index": "40",
        "is_ignore": "false",
        "is_row_identifier": "false",
        "is_target": "false",
        "name": "FCFP4_1024b199",
        "number_of_missing_values": "0"
      },
      {
        "data_type": "numeric",
        "index": "41",
        "is_ignore": "false",
        "is_row_identifier": "false",
        "is_target": "false",
        "name": "FCFP4_1024b612",
        "number_of_missing_values": "0"
      },
      {
        "data_type": "numeric",
        "index": "42",
        "is_ignore": "false",
        "is_row_identifier": "false",
        "is_target": "false",
        "name": "FCFP4_1024b123",
        "number_of_missing_values": "0"
      },
      {
        "data_type": "numeric",
        "index": "43",
        "is_ignore": "false",
        "is_row_identifier": "false",
        "is_target": "false",
        "name": "FCFP4_1024b120",
        "number_of_missing_values": "0"
      },
      {
        "data_type": "numeric",
        "index": "44",
        "is_ignore": "false",
        "is_row_identifier": "false",
        "is_target": "false",
        "name": "FCFP4_1024b10",
        "number_of_missing_values": "0"
      },
      {
        "data_type": "numeric",
        "index": "45",
        "is_ignore": "false",
        "is_row_identifier": "false",
        "is_target": "false",
        "name": "FCFP4_1024b100",
        "number_of_missing_values": "0"
      },
      {
        "data_type": "numeric",
        "index": "46",
        "is_ignore": "false",
        "is_row_identifier": "false",
        "is_target": "false",
        "name": "FCFP4_1024b1001",
        "number_of_missing_values": "0"
      },
      {
        "data_type": "numeric",
        "index": "47",
        "is_ignore": "false",
        "is_row_identifier": "false",
        "is_target": "false",
        "name": "FCFP4_1024b1002",
        "number_of_missing_values": "0"
      },
      {
        "data_type": "numeric",
        "index": "48",
        "is_ignore": "false",
        "is_row_identifier": "false",
        "is_target": "false",
        "name": "FCFP4_1024b1003",
        "number_of_missing_values": "0"
      },
      {
        "data_type": "numeric",
        "index": "49",
        "is_ignore": "false",
        "is_row_identifier": "false",
        "is_target": "false",
        "name": "FCFP4_1024b1004",
        "number_of_missing_values": "0"
      },
      {
        "data_type": "numeric",
        "index": "50",
        "is_ignore": "false",
        "is_row_identifier": "false",
        "is_target": "false",
        "name": "FCFP4_1024b1005",
        "number_of_missing_values": "0"
      },
      {
        "data_type": "numeric",
        "index": "51",
        "is_ignore": "false",
        "is_row_identifier": "false",
        "is_target": "false",
        "name": "FCFP4_1024b1006",
        "number_of_missing_values": "0"
      },
      {
        "data_type": "numeric",
        "index": "52",
        "is_ignore": "false",
        "is_row_identifier": "false",
        "is_target": "true",
        "name": "pXC50",
        "number_of_missing_values": "0"
      }
    ]
  }
}