{
  "data_set_description": {
    "collection_date": "November 2013",
    "creator": "Dr Jeremy Besnard, Dr Ivan Olier, Dr Noureddin Sadawi, Dr Larisa Soldatova, Dr Crina Grosan, Prof Ross King, Dr Richard Bickerton, Prof Andrew Hopkins and Dr Willem van Hoorn",
    "default_target_attribute": "pXC50",
    "description": "This dataset contains QSAR data (from ChEMBL version 17) showing activity values (unit is pseudo-pCI50) of several compounds on drug target ChEMBL_ID: CHEMBL3478 (TID: 10602), and it has 203 rows and 43 features (not including molecule IDs and class feature: molecule_id and pXC50). The features represent Basic Molecular Descriptors which were generated from SMILES strings.  Missing value imputation was applied to this dataset (By choosing the Median).",
    "description_version": "1",
    "file_id": "3385989",
    "format": "ARFF",
    "id": "29195",
    "licence": "Public",
    "md5_checksum": "f8aeeb57350f31e415fd799ea8f818b2",
    "minio_url": "https://data.openml.org/datasets/0002/29195/dataset_29195.pq",
    "name": "QSAR-DATASET-FOR-DRUG-TARGET-CHEMBL3478",
    "original_data_url": "https://www.ebi.ac.uk/chembl/target/inspect/CHEMBL3478",
    "parquet_url": "https://data.openml.org/datasets/0002/29195/dataset_29195.pq",
    "processing_date": "2018-10-04 01:14:07",
    "row_id_attribute": "molecule_id",
    "status": "deactivated",
    "tag": [
      "MetaQSAR",
      "study_13"
    ],
    "upload_date": "2016-07-15T01:54:07",
    "url": "https://api.openml.org/data/v1/download/3385989/QSAR-DATASET-FOR-DRUG-TARGET-CHEMBL3478.arff",
    "version": "8",
    "visibility": "public"
  }
}