"molecule_id","AMW","C.","H.","Me","Mi","Mp","Mv","MW","N.","nAB","nAT","nB","nBM","nBO","nBR","nBT","nC","nCL","nCsp","nCsp2","nCsp3","nDB","nF","nH","nHet","nHM","nI","nN","nO","nP","nS","nSK","nTB","nX","O.","RBF","RBN","SCBO","Se","Si","Sp","Sv","X.","pXC50"
{1 8.523,2 41,3 41,4 1.02,5 1.12,6 0.687,7 0.661,8 332.41,9 5.1,10 12,11 39,13 16,14 24,16 40,17 16,20 15,21 1,22 4,24 16,25 7,26 1,28 2,29 4,31 1,32 23,35 10.3,36 0.125,37 5,38 34,39 39.774,40 43.661,41 26.807,42 25.777,44 4.602}
{0 CHEMBL1083086,1 9.306,2 35,3 45,4 1.023,5 1.137,6 0.657,7 0.629,8 372.25,9 7.5,10 6,11 40,13 9,14 22,15 1,16 40,17 14,20 9,21 5,22 3,24 18,25 8,26 1,28 3,29 4,32 22,34 1,35 10,36 0.175,37 7,38 28,39 40.913,40 45.496,41 26.279,42 25.163,43 2.5,44 8.222}
{0 CHEMBL1083439,1 7.334,2 35,3 47.5,4 1.017,5 1.141,6 0.623,7 0.603,8 293.36,9 7.5,10 6,11 40,13 9,14 21,16 40,17 14,20 9,21 5,22 3,24 19,25 7,28 3,29 4,32 21,35 10,36 0.175,37 7,38 27,39 40.683,40 45.654,41 24.926,42 24.138,44 7.699}
{0 CHEMBL1093033,1 6.917,2 41.5,3 49.2,4 0.996,5 1.13,6 0.651,7 0.612,8 449.62,9 4.6,10 16,11 65,13 18,14 36,16 68,17 27,20 17,21 10,22 2,23 1,24 32,25 6,28 3,29 2,32 33,34 1,35 3.1,36 0.088,37 6,38 46,39 64.727,40 73.481,41 42.285,42 39.779,43 1.5,44 7.553}
{0 CHEMBL1093335,1 6.917,2 41.5,3 49.2,4 0.996,5 1.13,6 0.651,7 0.612,8 449.62,9 4.6,10 16,11 65,13 18,14 36,16 68,17 27,20 17,21 10,22 2,23 1,24 32,25 6,28 3,29 2,32 33,34 1,35 3.1,36 0.088,37 6,38 46,39 64.727,40 73.481,41 42.285,42 39.779,43 1.5,44 7.42}
{0 CHEMBL1096985,1 7.256,2 38.8,3 47.1,4 1.007,5 1.133,6 0.644,7 0.616,8 616.79,9 7.1,10 16,11 85,13 21,14 49,16 89,17 33,20 19,21 14,22 5,24 40,25 12,28 6,29 6,32 45,35 7.1,36 0.112,37 10,38 62,39 85.596,40 96.305,41 54.705,42 52.373,44 5.018}
{0 CHEMBL1096986,1 7.369,2 39.3,3 46.1,4 1.008,5 1.133,6 0.648,7 0.622,8 655.83,9 7.9,10 20,11 89,13 25,14 53,16 94,17 35,20 21,21 14,22 5,24 41,25 13,28 7,29 6,32 48,35 6.7,36 0.106,37 10,38 68,39 89.698,40 100.803,41 57.711,42 55.394,44 4.973}
{0 CHEMBL115011,1 7.703,2 42.9,3 44.9,4 1.018,5 1.141,6 0.65,7 0.631,8 377.44,9 2,10 12,11 49,13 14,14 28,16 50,17 21,20 14,21 7,22 2,23 3,24 22,25 6,28 1,29 2,32 27,34 3,35 4.1,36 0.18,37 9,38 36,39 49.898,40 55.919,41 31.864,42 30.923,43 6.1,44 7.481}
{0 CHEMBL1171465,1 7.407,2 34.9,3 51.2,4 0.999,5 1.129,6 0.657,7 0.602,8 636.99,9 4.7,10 5,11 86,13 11,14 44,16 88,17 30,20 10,21 20,22 6,24 44,25 12,26 3,28 4,29 5,31 3,32 42,35 5.8,36 0.148,37 13,38 52.5,39 85.945,40 97.104,41 56.466,42 51.757,44 5.31}
{0 CHEMBL1171466,1 7.517,2 37.6,3 49.5,4 0.998,5 1.124,6 0.669,7 0.616,8 699.06,9 4.3,10 11,11 93,13 17,14 50,16 96,17 35,20 16,21 19,22 6,24 46,25 12,26 3,28 4,29 5,31 3,32 47,35 5.4,36 0.146,37 14,38 61.5,39 92.829,40 104.519,41 62.228,42 57.284,44 5.523}
{0 CHEMBL1173194,1 7.612,2 35,3 50,4 1.002,5 1.128,6 0.662,7 0.609,8 608.93,9 5,10 5,11 80,13 11,14 42,16 82,17 28,20 10,21 18,22 6,24 40,25 12,26 3,28 4,29 5,31 3,32 40,35 6.3,36 0.146,37 12,38 50.5,39 80.178,40 90.274,41 52.944,42 48.703,44 5.125}
{0 CHEMBL1173195,1 7.781,2 35.9,3 48.7,4 1.004,5 1.126,6 0.669,7 0.618,8 606.91,9 5.1,10 10,11 78,13 15,14 42,16 80,17 28,20 12,21 16,22 5,24 38,25 12,26 3,28 4,29 5,31 3,32 40,35 6.4,36 0.15,37 12,38 52,39 78.294,40 87.859,41 52.182,42 48.176,44 5.523}
{0 CHEMBL1173445,1 7.506,2 34.9,3 50.6,4 1.001,5 1.129,6 0.659,7 0.605,8 622.96,9 4.8,10 5,11 83,13 11,14 43,16 85,17 29,20 10,21 19,22 6,24 42,25 12,26 3,28 4,29 5,31 3,32 41,35 6,36 0.141,37 12,38 51.5,39 83.061,40 93.689,41 54.705,42 50.23,44 5.523}
{0 CHEMBL1213419,1 7.743,2 35.4,3 45.6,4 1.03,5 1.152,6 0.62,7 0.61,8 611.69,9 6.3,10 6,11 79,13 13,14 44,16 80,17 28,20 14,21 14,22 7,23 3,24 36,25 15,28 5,29 7,32 43,34 3,35 8.9,36 0.175,37 14,38 54,39 81.359,40 91.035,41 48.966,42 48.216,43 3.8,44 4.986}
{0 CHEMBL1213457,1 8.716,2 41.5,3 36.6,4 1.038,5 1.128,6 0.666,7 0.671,8 357.35,9 7.3,10 12,11 41,13 16,14 27,16 42,17 17,20 17,22 4,24 15,25 9,28 3,29 6,32 26,35 14.6,36 0.119,37 5,38 37,39 42.571,40 46.243,41 27.313,42 27.514,44 6.022}
{0 CHEMBL1213458,1 7.685,2 43.2,3 43.2,4 1.01,5 1.122,6 0.668,7 0.645,8 284.34,9 5.4,10 11,11 37,13 14,14 22,16 38,17 16,20 14,21 2,22 3,24 16,25 5,28 2,29 3,32 21,35 8.1,36 0.132,37 5,38 30.5,39 37.371,40 41.531,41 24.705,42 23.875,44 4.757}
{0 CHEMBL1213490,1 7.224,2 33.3,3 52,4 1.004,5 1.134,6 0.637,7 0.589,8 541.81,9 4,11 75,13 7,14 36,16 75,17 25,20 9,21 16,22 7,24 39,25 11,26 2,28 3,29 6,31 2,32 36,35 8,36 0.08,37 6,38 43,39 75.327,40 85.065,41 47.745,42 44.21,44 4.301}
{0 CHEMBL1213492,1 7.268,2 41.4,3 46.6,4 1.004,5 1.126,6 0.655,7 0.625,8 421.54,9 5.2,10 17,11 58,13 19,14 33,16 60,17 24,20 18,21 6,22 2,24 27,25 7,28 3,29 4,32 31,35 6.9,36 0.15,37 9,38 43.5,39 58.218,40 65.315,41 37.972,42 36.245,44 5.979}
{0 CHEMBL1307946,1 8.54,2 41.2,3 41.2,4 1.017,5 1.119,6 0.694,7 0.663,8 290.37,9 5.9,10 12,11 34,13 13,14 21,16 35,17 14,20 11,21 3,22 1,24 14,25 6,26 1,28 2,29 3,31 1,32 20,35 8.8,36 0.143,37 5,38 28,39 34.564,40 38.036,41 23.591,42 22.535,44 4}
{0 CHEMBL144205,1 6.93,2 33.3,3 50.8,4 1.012,5 1.144,6 0.61,7 0.583,8 436.57,9 6.3,11 63,13 5,14 33,16 65,17 21,20 5,21 16,22 5,24 32,25 10,28 4,29 6,32 31,35 9.5,36 0.108,37 7,38 38,39 63.741,40 72.062,41 38.409,42 36.75,44 9.523}
{0 CHEMBL145110,1 6.976,2 31.1,3 50.8,4 1.016,5 1.15,6 0.601,7 0.578,8 425.55,9 8.2,11 61,13 5,14 31,16 62,17 19,20 5,21 14,22 5,24 31,25 11,28 5,29 6,32 30,35 9.8,36 0.097,37 6,38 36,39 61.96,40 70.146,41 36.654,42 35.244,44 8.569}
{0 CHEMBL145891,1 8.576,2 45.7,3 39.1,4 1.014,5 1.11,6 0.708,7 0.681,8 394.48,9 4.3,10 18,11 46,13 22,14 30,16 48,17 21,20 21,22 4,24 18,25 7,26 1,28 2,29 4,31 1,32 28,35 8.7,36 0.125,37 6,38 43,39 46.658,40 51.076,41 32.568,42 31.304,44 6}
{0 CHEMBL146250,1 7.335,2 32.4,3 51.4,4 1.007,5 1.137,6 0.635,7 0.591,8 542.8,9 5.4,11 74,13 7,14 36,16 74,17 24,20 9,21 15,22 7,24 38,25 12,26 2,28 4,29 6,31 2,32 36,35 8.1,36 0.081,37 6,38 43,39 74.545,40 84.148,41 46.989,42 43.704,44 7.602}
{0 CHEMBL147506,1 8.601,2 38.6,3 40.9,4 1.03,5 1.125,6 0.67,7 0.653,8 378.44,9 4.5,10 12,11 44,13 16,14 27,16 45,17 17,20 15,21 2,22 4,24 18,25 9,26 1,28 2,29 6,31 1,32 26,35 13.6,36 0.156,37 7,38 37,39 45.313,40 49.495,41 29.477,42 28.733,44 6}
{0 CHEMBL148769,1 7.942,2 40,3 42.2,4 1.022,5 1.13,6 0.653,7 0.641,8 357.4,9 6.7,10 12,11 45,13 15,14 27,16 46,17 18,20 16,21 2,22 3,24 19,25 8,28 3,29 5,32 26,35 11.1,36 0.13,37 6,38 36,39 46.011,40 50.864,41 29.381,42 28.853,44 4.602}
{0 CHEMBL149534,1 8.523,2 41,3 41,4 1.02,5 1.12,6 0.687,7 0.661,8 332.41,9 5.1,10 12,11 39,13 16,14 24,16 40,17 16,20 15,21 1,22 4,24 16,25 7,26 1,28 2,29 4,31 1,32 23,35 10.3,36 0.125,37 5,38 34,39 39.774,40 43.661,41 26.807,42 25.777,44 6}
{0 CHEMBL152162,1 7.183,2 39.1,3 47.8,4 1.008,5 1.13,6 0.64,7 0.612,8 165.21,9 4.3,10 6,11 23,13 7,14 12,16 23,17 9,20 7,21 2,22 1,24 11,25 3,28 1,29 2,32 12,35 8.7,36 0.13,37 3,38 16,39 23.174,40 25.993,41 14.722,42 14.085,44 4.477}
{0 CHEMBL152665,1 7.559,2 40,3 45,4 1.015,5 1.129,6 0.648,7 0.628,8 151.18,9 5,10 6,11 20,13 7,14 11,16 20,17 8,20 7,21 1,22 1,24 9,25 3,28 1,29 2,32 11,35 10,36 0.1,37 2,38 15,39 20.291,40 22.578,41 12.96,42 12.558,44 4.477}
{0 CHEMBL154574,1 7.771,2 42.9,3 42.9,4 1.014,5 1.123,6 0.665,7 0.646,8 163.19,9 4.8,10 6,11 21,13 8,14 12,16 21,17 9,20 9,22 2,24 9,25 3,28 1,29 2,32 12,35 9.5,36 0.095,37 2,38 17,39 21.291,40 23.578,41 13.96,42 13.558,44 4.711}
{0 CHEMBL16300,1 8.068,2 41.2,3 41.2,4 1.024,5 1.127,6 0.659,7 0.649,8 137.15,9 5.9,10 6,11 17,13 7,14 10,16 17,17 7,20 7,22 1,24 7,25 3,28 1,29 2,32 10,35 11.8,36 0.059,37 1,38 14,39 17.407,40 19.163,41 11.199,42 11.031,44 4.477}
{0 CHEMBL1631910,1 6.75,2 35.2,3 51.9,4 1.006,5 1.138,6 0.614,7 0.583,8 364.49,9 3.7,10 6,11 54,13 8,14 27,16 55,17 19,20 8,21 11,22 2,24 28,25 7,28 2,29 5,32 26,35 9.3,36 0.109,37 6,38 32,39 54.327,40 61.441,41 33.182,42 31.465,44 5.588}
{0 CHEMBL1631911,1 6.641,2 35.1,3 52.6,4 1.004,5 1.138,6 0.613,7 0.579,8 378.52,9 3.5,10 6,11 57,13 8,14 28,16 58,17 20,20 8,21 12,22 2,24 30,25 7,28 2,29 5,32 27,35 8.8,36 0.103,37 6,38 33,39 57.211,40 64.856,41 34.944,42 32.992,44 5.921}
{0 CHEMBL1631912,1 6.542,2 35,3 53.3,4 1.002,5 1.138,6 0.612,7 0.575,8 392.55,9 3.3,10 6,11 60,13 8,14 29,16 61,17 21,20 8,21 13,22 2,24 32,25 7,28 2,29 5,32 28,35 8.3,36 0.098,37 6,38 34,39 60.094,40 68.272,41 36.705,42 34.519,44 5.903}
{0 CHEMBL1631913,1 7.215,2 39.7,3 47.6,4 1.009,5 1.128,6 0.641,7 0.614,8 454.57,9 3.2,10 12,11 63,13 15,14 35,16 65,17 25,20 16,21 9,22 3,24 30,25 8,28 2,29 6,32 33,35 9.5,36 0.108,37 7,38 44,39 63.538,40 71.066,41 40.398,42 38.707,44 6.799}
{0 CHEMBL1631914,1 7.215,2 39.7,3 47.6,4 1.009,5 1.128,6 0.641,7 0.614,8 454.57,9 3.2,10 12,11 63,13 15,14 35,16 65,17 25,20 16,21 9,22 3,24 30,25 8,28 2,29 6,32 33,35 9.5,36 0.108,37 7,38 44,39 63.538,40 71.066,41 40.398,42 38.707,44 7.1}
{0 CHEMBL1631915,1 7.215,2 39.7,3 47.6,4 1.009,5 1.128,6 0.641,7 0.614,8 454.57,9 3.2,10 12,11 63,13 15,14 35,16 65,17 25,20 16,21 9,22 3,24 30,25 8,28 2,29 6,32 33,35 9.5,36 0.108,37 7,38 44,39 63.538,40 71.066,41 40.398,42 38.707,44 6.547}
{0 CHEMBL1631916,1 7.024,2 38.5,3 49.2,4 1.006,5 1.13,6 0.633,7 0.604,8 456.59,9 3.1,10 12,11 65,13 14,14 35,16 67,17 25,20 14,21 11,22 2,24 32,25 8,28 2,29 6,32 33,35 9.2,36 0.104,37 7,38 43,39 65.421,40 73.481,41 41.159,42 39.234,44 6.35}
{0 CHEMBL1631917,1 7.024,2 38.5,3 49.2,4 1.006,5 1.13,6 0.633,7 0.604,8 456.59,9 3.1,10 12,11 65,13 14,14 35,16 67,17 25,20 14,21 11,22 2,24 32,25 8,28 2,29 6,32 33,35 9.2,36 0.104,37 7,38 43,39 65.421,40 73.481,41 41.159,42 39.234,44 6.928}
{0 CHEMBL1631918,1 7.024,2 38.5,3 49.2,4 1.006,5 1.13,6 0.633,7 0.604,8 456.59,9 3.1,10 12,11 65,13 14,14 35,16 67,17 25,20 14,21 11,22 2,24 32,25 8,28 2,29 6,32 33,35 9.2,36 0.104,37 7,38 43,39 65.421,40 73.481,41 41.159,42 39.234,44 6.343}
{0 CHEMBL1722433,1 7.985,2 39.5,3 44.7,4 1.006,5 1.125,6 0.682,7 0.641,8 303.42,9 7.9,10 12,11 38,13 13,14 22,16 39,17 15,20 11,21 4,22 1,24 17,25 6,26 1,28 3,29 2,31 1,32 21,35 5.3,36 0.154,37 6,38 29,39 38.222,40 42.74,41 25.904,42 24.369,44 4}
{0 CHEMBL1767029,1 6.787,2 35.6,3 51.1,4 1.003,5 1.139,6 0.622,7 0.588,8 305.42,9 6.7,10 6,11 45,13 9,14 22,16 45,17 16,20 9,21 7,22 3,24 23,25 6,28 3,29 3,32 22,35 6.7,36 0.2,37 9,38 28,39 45.123,40 51.275,41 27.995,42 26.477,44 4.182}
{0 CHEMBL1767030,1 6.97,2 39.2,3 49,4 1,5 1.131,6 0.642,7 0.608,8 355.48,9 5.9,10 11,11 51,13 14,14 27,16 52,17 20,20 13,21 7,22 3,24 25,25 6,28 3,29 3,32 26,35 5.9,36 0.173,37 9,38 35.5,39 51.007,40 57.69,41 32.756,42 31.003,44 4}
{0 CHEMBL1767031,1 7.129,2 38,3 48,4 1.005,5 1.135,6 0.64,7 0.61,8 356.47,9 8,10 11,11 50,13 14,14 27,16 51,17 19,20 12,21 7,22 3,24 24,25 7,28 4,29 3,32 26,35 6,36 0.176,37 9,38 35.5,39 50.225,40 56.773,41 32,42 30.498,44 4}
{0 CHEMBL1767032,1 7.027,2 41.1,3 48.2,4 0.998,5 1.127,6 0.652,7 0.617,8 393.53,9 5.4,10 12,11 56,13 15,14 31,16 58,17 23,20 15,21 8,22 3,24 27,25 6,28 3,29 3,32 29,35 5.4,36 0.155,37 9,38 40,39 55.891,40 63.106,41 36.517,42 34.53,44 4}
{0 CHEMBL1767033,1 6.575,2 34,3 52.8,4 1,5 1.143,6 0.614,7 0.576,8 348.5,9 7.5,10 6,11 53,13 9,14 25,16 53,17 18,20 9,21 9,22 3,24 28,25 7,28 4,29 3,32 25,35 5.7,36 0.189,37 10,38 31,39 52.992,40 60.604,41 32.523,42 30.552,44 4}
{0 CHEMBL1767034,1 6.937,2 40,3 49.1,4 0.998,5 1.129,6 0.646,7 0.61,8 381.52,9 5.5,10 12,11 55,13 15,14 29,16 56,17 22,20 15,21 7,22 3,24 27,25 6,28 3,29 3,32 28,35 5.5,36 0.179,37 10,38 38,39 54.891,40 62.106,41 35.517,42 33.53,44 4}
{0 CHEMBL1767035,1 8.54,2 35.6,3 48.9,4 1.008,5 1.136,6 0.652,7 0.611,8 384.31,9 6.7,10 6,11 45,13 9,14 23,15 1,16 45,17 16,20 9,21 7,22 3,24 22,25 7,26 1,28 3,29 3,32 23,34 1,35 6.7,36 0.2,37 9,38 29,39 45.352,40 51.117,41 29.347,42 27.502,43 2.2,44 4}
{0 CHEMBL1767036,1 6.937,2 40,3 49.1,4 0.998,5 1.129,6 0.646,7 0.61,8 381.52,9 5.5,10 12,11 55,13 15,14 29,16 56,17 22,20 15,21 7,22 3,24 27,25 6,28 3,29 3,32 28,35 5.5,36 0.179,37 10,38 38,39 54.891,40 62.106,41 35.517,42 33.53,44 4}
{0 CHEMBL1767037,1 7.337,2 39.7,3 46.6,4 1.009,5 1.13,6 0.645,7 0.62,8 425.53,9 5.2,10 12,11 58,13 16,14 32,16 59,17 23,20 16,21 7,22 4,24 27,25 8,28 3,29 5,32 31,35 8.6,36 0.186,37 11,38 42,39 58.545,40 65.524,41 37.426,42 35.96,44 4}
{0 CHEMBL1767038,1 7.084,2 38.9,3 48.1,4 1.002,5 1.133,6 0.644,7 0.612,8 382.51,9 7.4,10 12,11 54,13 15,14 29,16 55,17 21,20 14,21 7,22 3,24 26,25 7,28 4,29 3,32 28,35 5.6,36 0.182,37 10,38 38,39 54.109,40 61.189,41 34.762,42 33.025,44 4}
{0 CHEMBL1767039,1 7.721,2 38.9,3 46.3,4 1.008,5 1.132,6 0.66,7 0.627,8 416.95,9 7.4,10 12,11 54,13 15,14 30,16 55,17 21,18 1,20 14,21 7,22 3,24 25,25 8,26 1,28 4,29 3,32 29,34 1,35 5.6,36 0.182,37 10,38 39,39 54.432,40 61.133,41 35.62,42 33.852,43 1.9,44 4.23}
{0 CHEMBL1767040,1 7.783,2 41.7,3 45,4 1.005,5 1.126,6 0.673,7 0.64,8 467.01,9 6.7,10 17,11 60,13 20,14 35,16 62,17 25,18 1,20 18,21 7,22 3,24 27,25 8,26 1,28 4,29 3,32 33,34 1,35 5,36 0.161,37 10,38 46.5,39 60.316,40 67.548,41 40.381,42 38.379,43 1.7,44 4}
{0 CHEMBL1767041,1 7.171,2 35.3,3 48.5,4 1.012,5 1.141,6 0.624,7 0.6,8 487.62,9 7.4,10 11,11 68,13 15,14 36,16 69,17 24,20 13,21 11,22 4,24 33,25 11,28 5,29 6,32 35,35 8.8,36 0.188,37 13,38 45.5,39 68.843,40 77.561,41 42.415,42 40.771,44 4}
{0 CHEMBL1767042,1 7.171,2 35.3,3 48.5,4 1.012,5 1.141,6 0.624,7 0.6,8 487.62,9 7.4,10 11,11 68,13 15,14 36,16 69,17 24,20 13,21 11,22 4,24 33,25 11,28 5,29 6,32 35,35 8.8,36 0.188,37 13,38 45.5,39 68.843,40 77.561,41 42.415,42 40.771,44 4}
{0 CHEMBL1767043,1 7.311,2 35.8,3 47.2,4 1.012,5 1.141,6 0.631,7 0.608,8 387.49,9 9.4,10 11,11 53,13 14,14 29,16 54,17 19,20 12,21 7,22 3,24 25,25 9,28 5,29 4,32 28,35 7.5,36 0.185,37 10,38 37.5,39 53.654,40 60.481,41 33.461,42 32.234,44 4.41}
{0 CHEMBL1767044,1 7.311,2 35.8,3 47.2,4 1.012,5 1.141,6 0.631,7 0.608,8 387.49,9 9.4,10 11,11 53,13 14,14 29,16 54,17 19,20 12,21 7,22 3,24 25,25 9,28 5,29 4,32 28,35 7.5,36 0.185,37 10,38 37.5,39 53.654,40 60.481,41 33.461,42 32.234,44 4.312}
{0 CHEMBL1767045,1 6.845,2 36.7,3 50.6,4 1.003,5 1.136,6 0.626,7 0.593,8 540.73,9 5.1,10 12,11 79,13 16,14 40,16 80,17 29,20 16,21 13,22 4,24 40,25 10,28 4,29 6,32 39,35 7.6,36 0.188,37 15,38 50,39 79.276,40 89.723,41 49.455,42 46.857,44 4}
{0 CHEMBL1767046,1 6.884,2 37.5,3 50,4 1.001,5 1.135,6 0.633,7 0.599,8 440.6,9 6.3,10 12,11 64,13 15,14 33,16 65,17 24,20 15,21 9,22 3,24 32,25 8,28 4,29 4,32 32,35 6.3,36 0.2,37 13,38 42,39 64.087,40 72.644,41 40.5,42 38.32,44 4.228}
{0 CHEMBL1767047,1 6.859,2 41.1,3 49.3,4 0.994,5 1.127,6 0.652,7 0.612,8 500.7,9 5.5,10 18,11 73,13 21,14 39,16 75,17 30,20 21,21 9,22 3,24 36,25 7,28 4,29 3,32 37,35 4.1,36 0.187,37 14,38 51,39 72.527,40 82.265,41 47.569,42 44.659,44 4}
{0 CHEMBL1791401,1 7.101,2 34.7,3 50.8,4 1.002,5 1.138,6 0.637,7 0.595,8 1413.06,9 7.5,10 16,11 199,13 29,14 104,16 205,17 69,20 25,21 44,22 13,24 101,25 29,26 3,28 15,29 11,31 3,32 98,35 5.5,36 0.2,37 41,38 125,39 199.351,40 226.392,41 126.768,42 118.398,44 8.301}
{0 CHEMBL1791402,1 6.618,2 35.1,3 52.6,4 1.001,5 1.139,6 0.616,7 0.58,8 641.9,9 5.2,10 10,11 97,13 15,14 48,16 99,17 34,20 13,21 21,22 5,24 51,25 12,28 5,29 7,32 46,35 7.2,36 0.182,37 18,38 58,39 97.123,40 110.507,41 59.722,42 56.227,44 6.818}
{0 CHEMBL1800241,1 8.578,2 40.5,3 40.5,4 1.018,5 1.123,6 0.692,7 0.664,8 317.4,9 8.1,10 12,11 37,13 14,14 23,16 38,17 15,20 12,21 3,22 2,24 15,25 7,26 1,28 3,29 3,31 1,32 22,35 8.1,36 0.132,37 5,38 31,39 37.665,40 41.534,41 25.597,42 24.557,44 4.488}
{0 CHEMBL1800242,1 8.372,2 41.7,3 41.7,4 1.009,5 1.12,6 0.698,7 0.662,8 301.4,9 8.3,10 12,11 36,13 14,14 22,16 37,17 15,20 12,21 3,22 2,24 15,25 6,26 1,28 3,29 2,31 1,32 21,35 5.6,36 0.135,37 5,38 30,39 36.338,40 40.325,41 25.142,42 23.842,44 4}
{0 CHEMBL1800243,1 8.286,2 40,3 42.5,4 1.014,5 1.124,6 0.684,7 0.652,8 331.43,9 7.5,10 12,11 40,13 14,14 24,16 41,17 16,20 12,21 4,22 2,24 17,25 7,26 1,28 3,29 3,31 1,32 23,35 7.5,36 0.146,37 6,38 32,39 40.549,40 44.95,41 27.358,42 26.083,44 4}
{0 CHEMBL1800244,1 8.088,2 41,3 43.6,4 1.006,5 1.122,6 0.69,7 0.65,8 315.43,9 7.7,10 12,11 39,13 14,14 23,16 40,17 16,20 12,21 4,22 2,24 17,25 6,26 1,28 3,29 2,31 1,32 22,35 5.1,36 0.125,37 5,38 31,39 39.222,40 43.74,41 26.904,42 25.369,44 4}
{0 CHEMBL1800245,1 8.372,2 44.4,3 41.7,4 1.01,5 1.11,6 0.704,7 0.668,8 301.39,9 2.8,10 12,11 36,13 14,14 22,16 37,17 16,20 14,21 2,22 2,24 15,25 5,26 1,28 1,29 3,31 1,32 21,35 8.3,36 0.135,37 5,38 30,39 36.345,40 39.953,41 25.347,42 24.041,44 4}
{0 CHEMBL1800246,1 8.144,2 40.5,3 40.5,4 1.025,5 1.13,6 0.66,7 0.651,8 301.33,9 8.1,10 12,11 37,13 14,14 23,16 38,17 15,20 12,21 3,22 2,24 15,25 7,28 3,29 4,32 22,35 10.8,36 0.132,37 5,38 31,39 37.916,40 41.824,41 24.404,42 24.084,44 4.266}
{0 CHEMBL1800247,1 7.904,2 42.1,3 42.1,4 1.018,5 1.125,6 0.662,7 0.647,8 300.34,9 5.3,10 12,11 38,13 14,14 23,16 39,17 16,20 13,21 3,22 2,24 16,25 6,28 2,29 4,32 22,35 10.5,36 0.128,37 5,38 31,39 38.698,40 42.741,41 25.159,42 24.59,44 4}
{0 CHEMBL1800248,1 8.268,2 40,3 42.9,4 1.01,5 1.124,6 0.69,7 0.653,8 289.39,9 8.6,10 12,11 35,13 13,14 21,16 36,17 14,20 11,21 3,22 1,24 15,25 6,26 1,28 3,29 2,31 1,32 20,35 5.7,36 0.111,37 4,38 28,39 35.338,40 39.325,41 24.142,42 22.842,44 4}
{0 CHEMBL1800249,1 8.19,2 38.5,3 43.6,4 1.014,5 1.127,6 0.676,7 0.643,8 319.42,9 7.7,10 12,11 39,13 13,14 23,16 40,17 15,20 11,21 4,22 1,24 17,25 7,26 1,28 3,29 3,31 1,32 22,35 7.7,36 0.125,37 5,38 30,39 39.549,40 43.95,41 26.358,42 25.083,44 4}
{0 CHEMBL1800250,1 8.678,2 43.3,3 40,4 1.012,5 1.114,6 0.713,7 0.676,8 260.34,9 6.7,10 12,11 30,13 13,14 19,16 31,17 13,20 11,21 2,22 1,24 12,25 5,26 1,28 2,29 2,31 1,32 18,35 6.7,36 0.129,37 4,38 26,39 30.353,40 33.411,41 21.375,42 20.294,44 4}
{0 CHEMBL1800251,1 8.286,2 40,3 42.5,4 1.014,5 1.124,6 0.684,7 0.652,8 331.43,9 7.5,10 12,11 40,13 14,14 24,16 41,17 16,20 12,21 4,22 2,24 17,25 7,26 1,28 3,29 3,31 1,32 23,35 7.5,36 0.122,37 5,38 32,39 40.549,40 44.95,41 27.358,42 26.083,44 4}
{0 CHEMBL1800373,1 8.624,2 45.5,3 38.6,4 1.012,5 1.112,6 0.713,7 0.684,8 379.47,9 6.8,10 18,11 44,13 20,14 29,16 46,17 20,20 18,21 2,22 2,24 17,25 7,26 1,28 3,29 3,31 1,32 27,35 6.8,36 0.13,37 6,38 40,39 44.549,40 48.95,41 31.358,42 30.083,44 4}
{0 CHEMBL1800374,1 7.535,2 40.5,3 47.6,4 0.997,5 1.121,6 0.677,7 0.629,8 316.46,9 4.8,10 12,11 42,13 13,14 23,16 43,17 17,20 11,21 6,22 1,24 20,25 5,26 1,28 2,29 2,31 1,32 22,35 4.8,36 0.116,37 5,38 30,39 41.887,40 47.072,41 28.421,42 26.401,44 4}
{0 CHEMBL1800375,1 9.826,2 43.3,3 36.7,4 1.023,5 1.112,6 0.741,7 0.704,8 294.78,9 6.7,10 12,11 30,13 13,14 20,16 31,17 13,18 1,20 11,21 2,22 1,24 11,25 6,26 2,28 2,29 2,31 1,32 19,34 1,35 6.7,36 0.129,37 4,38 27,39 30.676,40 33.355,41 22.233,42 21.121,43 3.3,44 4}
{0 CHEMBL1800376,1 8.914,2 41.9,3 38.7,4 1.022,5 1.117,6 0.704,7 0.678,8 276.34,9 6.5,10 12,11 31,13 13,14 20,16 32,17 13,20 11,21 2,22 1,24 12,25 6,26 1,28 2,29 3,31 1,32 19,35 9.7,36 0.125,37 4,38 27,39 31.68,40 34.621,41 21.83,42 21.008,44 4}
{0 CHEMBL1800377,1 8.844,2 41.7,3 38.9,4 1.025,5 1.118,6 0.696,7 0.674,8 318.38,9 5.6,10 12,11 36,13 13,14 24,16 38,17 15,20 11,21 4,22 1,24 14,25 7,26 1,28 2,29 4,31 1,32 22,35 11.1,36 0.105,37 4,38 31,39 36.891,40 40.245,41 25.046,42 24.25,44 4}
{0 CHEMBL1800378,1 9.011,2 42.9,3 37.1,4 1.022,5 1.118,6 0.71,7 0.687,8 315.38,9 8.6,10 12,11 35,13 14,14 24,16 37,17 15,20 12,21 3,22 2,24 13,25 7,26 1,28 3,29 3,31 1,32 22,35 8.6,36 0.108,37 4,38 32,39 35.782,40 39.119,41 24.835,42 24.03,44 4}
{0 CHEMBL1800379,1 9.866,2 40.7,3 37,4 1.02,5 1.108,6 0.75,7 0.702,8 266.37,9 7.4,10 11,11 27,13 12,14 18,16 28,17 11,20 9,21 2,22 1,24 10,25 6,26 2,28 2,29 2,31 2,32 17,35 7.4,36 0.143,37 4,38 24.5,39 27.545,40 29.916,41 20.261,42 18.954,44 4}
{0 CHEMBL1800380,1 8.928,2 33.3,3 41.7,4 1.033,5 1.134,6 0.67,7 0.645,8 214.27,9 8.3,10 6,11 24,13 7,14 14,16 24,17 8,20 5,21 3,22 1,24 10,25 6,26 1,28 2,29 3,31 1,32 14,35 12.5,36 0.167,37 4,38 18,39 24.796,40 27.206,41 16.068,42 15.482,44 4}
{0 CHEMBL1800381,1 8.62,2 34.8,3 43.5,4 1.02,5 1.13,6 0.679,7 0.642,8 198.27,9 8.7,10 6,11 23,13 7,14 13,16 23,17 8,20 5,21 3,22 1,24 10,25 5,26 1,28 2,29 2,31 1,32 13,35 8.7,36 0.13,37 3,38 17,39 23.469,40 25.996,41 15.614,42 14.767,44 4}
{0 CHEMBL1800382,1 7.511,2 34.4,3 50,4 1.004,5 1.133,6 0.653,7 0.605,8 240.36,9 6.3,10 6,11 32,13 7,14 16,16 32,17 11,20 5,21 6,22 1,24 16,25 5,26 1,28 2,29 2,31 1,32 16,35 6.3,36 0.125,37 4,38 20,39 32.12,40 36.242,41 20.898,42 19.347,44 4}
{0 CHEMBL1800383,1 8.448,2 34.4,3 43.8,4 1.028,5 1.133,6 0.658,7 0.633,8 270.34,9 6.3,10 6,11 32,13 8,14 18,16 32,17 11,20 6,21 5,22 2,24 14,25 7,26 1,28 2,29 4,31 1,32 18,35 12.5,36 0.219,37 7,38 23,39 32.891,40 36.245,41 21.046,42 20.25,44 4}
{0 CHEMBL1800384,1 7.534,2 38.6,3 47.7,4 1,5 1.127,6 0.669,7 0.623,8 331.48,9 6.8,10 12,11 44,13 13,14 24,16 45,17 17,20 11,21 6,22 1,24 21,25 6,26 1,28 3,29 2,31 1,32 23,35 4.5,36 0.178,37 8,38 31,39 43.989,40 49.571,41 29.426,42 27.422,44 4}
{0 CHEMBL1800385,1 7.191,2 38,3 50,4 0.995,5 1.128,6 0.659,7 0.61,8 359.54,9 6,10 12,11 50,13 13,14 26,16 51,17 19,20 11,21 8,22 1,24 25,25 6,26 1,28 3,29 2,31 1,32 25,35 4,36 0.196,37 10,38 33,39 49.756,40 56.401,41 32.949,42 30.476,44 4}
{0 CHEMBL181459,1 7.236,2 39.6,3 47.2,4 1.006,5 1.13,6 0.645,7 0.617,8 383.49,9 5.7,10 12,11 53,13 15,14 29,16 54,17 21,20 15,21 6,22 3,24 25,25 7,28 3,29 4,32 28,35 7.5,36 0.185,37 10,38 38,39 53.334,40 59.9,41 34.211,42 32.718,44 6.26}
{0 CHEMBL1822042,1 6.517,2 33.3,3 54,4 1.005,5 1.141,6 0.602,7 0.568,8 410.57,9 3.2,10 6,11 63,13 8,14 29,16 63,17 21,20 8,21 13,22 2,24 34,25 8,28 2,29 6,32 29,35 9.5,36 0.222,37 14,38 34,39 63.305,40 71.896,41 37.921,42 35.76,44 5}
{0 CHEMBL1822043,1 6.433,2 33.3,3 54.5,4 1.003,5 1.141,6 0.601,7 0.565,8 424.6,9 3,10 6,11 66,13 8,14 30,16 66,17 22,20 8,21 14,22 2,24 36,25 8,28 2,29 6,32 30,35 9.1,36 0.227,37 15,38 35,39 66.189,40 75.311,41 39.682,42 37.287,44 5}
{0 CHEMBL1822046,1 6.706,2 37.5,3 51.8,4 1.002,5 1.131,6 0.624,7 0.589,8 375.51,9 1.8,10 6,11 56,13 9,14 28,16 57,17 21,20 10,21 11,22 3,24 29,25 6,28 1,29 5,32 27,35 8.9,36 0.193,37 11,38 34,39 56.109,40 63.358,41 34.938,42 32.971,44 5}
{0 CHEMBL1822050,1 6.509,2 36.2,3 53.4,4 1,5 1.134,6 0.616,7 0.578,8 377.53,9 1.7,10 6,11 58,13 8,14 28,16 59,17 21,20 8,21 13,22 2,24 31,25 6,28 1,29 5,32 27,35 8.6,36 0.186,37 11,38 33,39 57.992,40 65.773,41 35.699,42 33.497,44 5}
{0 CHEMBL1830392,1 6.402,2 35.7,3 53.6,4 0.992,5 1.139,6 0.622,7 0.578,8 358.54,9 7.1,10 10,11 56,13 12,14 27,16 57,17 20,20 10,21 10,22 2,24 30,25 6,28 4,29 2,32 26,35 3.6,36 0.175,37 10,38 34,39 55.549,40 63.81,41 34.83,42 32.364,44 7.796}
{0 CHEMBL1830396,1 6.5,2 35.8,3 52.8,4 0.994,5 1.14,6 0.624,7 0.582,8 344.51,9 7.5,10 10,11 53,13 12,14 26,16 54,17 19,20 10,21 9,22 2,24 28,25 6,28 4,29 2,32 25,35 3.8,36 0.167,37 9,38 33,39 52.665,40 60.394,41 33.069,42 30.837,44 7.959}
{0 CHEMBL1830397,1 6.235,2 35.5,3 54.8,4 0.989,5 1.139,6 0.619,7 0.571,8 386.6,9 6.5,10 10,11 62,13 12,14 29,16 63,17 22,20 10,21 12,22 2,24 34,25 6,28 4,29 2,32 28,35 3.2,36 0.127,37 8,38 36,39 61.316,40 70.64,41 38.353,42 35.417,44 8.102}
{0 CHEMBL1830420,1 6.402,2 35.7,3 53.6,4 0.992,5 1.139,6 0.622,7 0.578,8 358.54,9 7.1,10 10,11 56,13 12,14 27,16 57,17 20,20 10,21 10,22 2,24 30,25 6,28 4,29 2,32 26,35 3.6,36 0.193,37 11,38 34,39 55.549,40 63.81,41 34.83,42 32.364,44 8.208}
{0 CHEMBL1830422,1 6.315,2 35.6,3 54.2,4 0.99,5 1.139,6 0.62,7 0.574,8 372.57,9 6.8,10 10,11 59,13 12,14 28,16 60,17 21,20 10,21 11,22 2,24 32,25 6,28 4,29 2,32 27,35 3.4,36 0.183,37 11,38 35,39 58.432,40 67.225,41 36.591,42 33.89,44 8.18}
{0 CHEMBL1830424,1 6.402,2 35.7,3 53.6,4 0.992,5 1.139,6 0.622,7 0.578,8 358.54,9 7.1,10 10,11 56,13 12,14 27,16 57,17 20,20 10,21 10,22 2,24 30,25 6,28 4,29 2,32 26,35 3.6,36 0.175,37 10,38 34,39 55.549,40 63.81,41 34.83,42 32.364,44 8.276}
{0 CHEMBL1830536,1 6.602,2 37,3 51.9,4 0.994,5 1.137,6 0.631,7 0.59,8 356.52,9 7.4,10 10,11 54,13 13,14 27,16 55,17 20,20 12,21 8,22 3,24 28,25 6,28 4,29 2,32 26,35 3.7,36 0.182,37 10,38 35,39 53.665,40 61.394,41 34.069,42 31.837,44 8.62}
{0 CHEMBL1830537,1 6.402,2 35.7,3 53.6,4 0.992,5 1.139,6 0.622,7 0.578,8 358.54,9 7.1,10 10,11 56,13 12,14 27,16 57,17 20,20 10,21 10,22 2,24 30,25 6,28 4,29 2,32 26,35 3.6,36 0.175,37 10,38 34,39 55.549,40 63.81,41 34.83,42 32.364,44 8.444}
{0 CHEMBL1836042,1 6.998,2 31.6,3 53.9,4 1.003,5 1.138,6 0.625,7 0.575,8 531.82,9 3.9,11 76,13 5,14 35,16 76,17 24,20 6,21 18,22 5,24 41,25 11,26 2,28 3,29 6,31 2,32 35,35 7.9,36 0.118,37 9,38 40,39 76.21,40 86.48,41 47.506,42 43.736,44 4.745}
{0 CHEMBL1836142,1 7.609,2 31.9,3 51.4,4 1.007,5 1.133,6 0.648,7 0.595,8 547.84,9 4.2,11 72,13 5,14 36,16 73,17 23,20 6,21 17,22 5,24 37,25 12,26 3,28 3,29 6,31 3,32 35,35 8.3,36 0.068,37 5,38 41,39 72.52,40 81.57,41 46.631,42 42.87,44 4.301}
{0 CHEMBL1836143,1 7.335,2 32.4,3 51.4,4 1.007,5 1.137,6 0.635,7 0.591,8 542.8,9 5.4,11 74,13 7,14 36,16 74,17 24,20 9,21 15,22 7,24 38,25 12,26 2,28 4,29 6,31 2,32 36,35 8.1,36 0.081,37 6,38 43,39 74.545,40 84.148,41 46.989,42 43.704,44 6.328}
{0 CHEMBL1836144,1 7.431,2 31.1,3 52.7,4 1.005,5 1.135,6 0.64,7 0.586,8 549.86,9 4.1,11 74,13 5,14 35,16 74,17 23,20 6,21 17,22 5,24 39,25 12,26 3,28 3,29 6,31 3,32 35,35 8.1,36 0.122,37 9,38 40,39 74.403,40 83.985,41 47.392,42 43.397,44 4.377}
{0 CHEMBL1836145,1 7.159,2 32.4,3 52.7,4 1.004,5 1.136,6 0.632,7 0.584,8 529.8,9 4.1,11 74,13 5,14 36,16 75,17 24,20 6,21 18,22 5,24 39,25 11,26 2,28 3,29 6,31 2,32 35,35 8.1,36 0.067,37 5,38 41,39 74.327,40 84.065,41 46.745,42 43.21,44 4.658}
{0 CHEMBL188007,1 7.271,2 35.7,3 48.8,4 1.019,5 1.15,6 0.617,7 0.596,8 610.75,9 4.8,10 6,11 84,13 11,14 45,16 86,17 30,20 11,21 19,22 5,23 3,24 41,25 13,28 4,29 6,32 43,34 3,35 7.1,36 0.128,37 11,38 53,39 85.581,40 96.573,41 51.79,42 50.06,43 3.6,44 6.215}
{0 CHEMBL1914702,1 8.282,2 37.9,3 39.4,4 1.026,5 1.142,6 0.658,7 0.652,8 546.61,9 15.2,10 17,11 66,13 24,14 42,16 68,17 25,20 18,21 7,22 7,24 26,25 15,28 10,29 5,32 40,35 7.6,36 0.206,37 14,38 57.5,39 67.723,40 75.352,41 43.421,42 43.002,44 6.365}
{0 CHEMBL1914708,1 7.867,2 33.9,3 42.9,4 1.021,5 1.152,6 0.638,7 0.626,8 440.53,9 17.9,10 11,11 56,13 17,14 33,16 57,17 19,20 11,21 8,22 6,24 24,25 13,28 10,29 3,32 32,35 5.4,36 0.228,37 13,38 44.5,39 57.185,40 64.518,41 35.75,42 35.046,44 6.421}
{0 CHEMBL1938433,1 7.405,2 43.4,3 45.3,4 1.004,5 1.121,6 0.664,7 0.636,8 392.49,9 3.8,10 12,11 53,13 15,14 32,16 56,17 23,20 16,21 7,22 3,24 24,25 6,28 2,29 4,32 29,35 7.5,36 0.071,37 4,38 41,39 53.232,40 59.401,41 35.205,42 33.697,44 6.896}
{0 CHEMBL197774,1 8.483,2 47.4,3 36.8,4 1.021,5 1.114,6 0.695,7 0.686,8 322.34,9 5.3,10 12,11 38,13 16,14 26,16 40,17 18,20 17,21 1,22 4,24 14,25 6,28 2,29 4,32 24,35 10.5,36 0.1,37 4,38 36,39 38.814,40 42.325,41 26.398,42 26.063,44 6.446}
{0 CHEMBL2012815,1 6.578,2 37.5,3 52.3,4 0.995,5 1.134,6 0.628,7 0.588,8 578.83,9 4.5,10 11,11 88,13 16,14 44,16 90,17 33,20 15,21 18,22 5,24 46,25 9,28 4,29 5,32 42,35 5.7,36 0.122,37 11,38 54.5,39 87.599,40 99.759,41 55.285,42 51.722,44 5}
{0 CHEMBL2018302,1 7.292,2 43.5,3 45.7,4 0.998,5 1.123,6 0.669,7 0.636,8 335.44,9 6.5,10 16,11 46,13 17,14 28,16 49,17 20,20 15,21 5,22 1,24 21,25 5,28 3,29 2,32 25,35 4.3,36 0.061,37 3,38 37,39 45.912,40 51.651,41 30.779,42 29.235,44 5.959}
{0 CHEMBL209453,1 9.136,2 40.6,3 37.5,4 1.031,5 1.12,6 0.696,7 0.679,8 292.34,9 6.3,10 12,11 32,13 13,14 21,16 33,17 13,20 11,21 2,22 1,24 12,25 7,26 1,28 2,29 4,31 1,32 20,35 12.5,36 0.121,37 4,38 28,39 33.007,40 35.83,41 22.284,42 21.723,44 4}
{0 CHEMBL209551,1 6.183,2 31,3 58.6,4 0.99,5 1.141,6 0.607,7 0.548,8 358.61,9 3.4,11 58,13 2,14 24,16 58,17 18,20 2,21 16,22 2,24 34,25 6,26 1,28 2,29 3,31 1,32 24,35 5.2,36 0.172,37 10,38 26,39 57.4,40 66.188,41 35.205,42 31.803,44 5.943}
{0 CHEMBL213934,1 6.265,2 30.9,3 58.2,4 0.991,5 1.141,6 0.608,7 0.55,8 344.58,9 3.6,11 55,13 2,14 23,16 55,17 17,20 2,21 15,22 2,24 32,25 6,26 1,28 2,29 3,31 1,32 23,35 5.5,36 0.182,37 10,38 25,39 54.516,40 62.773,41 33.444,42 30.276,44 5.987}
{0 CHEMBL2152613,1 7.387,2 46.7,3 44.4,4 0.996,5 1.114,6 0.684,7 0.649,8 332.43,9 4.4,10 18,11 45,13 19,14 27,16 47,17 21,20 19,21 2,22 1,24 20,25 4,28 2,29 2,32 25,35 4.4,36 0.149,37 7,38 37,39 44.811,40 50.152,41 30.773,42 29.214,44 4.523}
{0 CHEMBL2158741,1 7.374,2 35.2,3 50,4 1.006,5 1.132,6 0.645,7 0.602,8 648.93,9 4.5,10 6,11 88,13 12,14 46,16 90,17 31,20 12,21 19,22 6,24 44,25 13,26 2,28 4,29 7,31 2,32 44,35 8,36 0.178,37 16,38 55,39 88.523,40 99.603,41 56.728,42 52.999,44 6.004}
{0 CHEMBL2158742,1 7.406,2 35.5,3 50,4 1.003,5 1.131,6 0.652,7 0.605,8 562.83,9 5.3,10 6,11 76,13 10,14 41,16 79,17 27,20 10,21 17,22 4,24 38,25 11,26 2,28 4,29 5,31 2,32 38,35 6.6,36 0.025,37 2,38 48,39 76.218,40 85.939,41 49.534,42 45.989,44 4}
{0 CHEMBL2158743,1 7.047,2 32.5,3 53,4 1.002,5 1.137,6 0.63,7 0.582,8 584.89,9 4.8,11 83,13 6,14 40,16 84,17 27,20 6,21 21,22 6,24 44,25 12,26 2,28 4,29 6,31 2,32 39,35 7.2,36 0.167,37 14,38 46,39 83.196,40 94.394,41 52.273,42 48.285,44 5.921}
{0 CHEMBL2158744,1 7.245,2 32.1,3 51.9,4 1.008,5 1.138,6 0.629,7 0.586,8 586.86,9 4.9,11 81,13 6,14 40,16 82,17 26,20 6,21 20,22 6,24 42,25 13,26 2,28 4,29 7,31 2,32 39,35 8.6,36 0.171,37 14,38 46,39 81.64,40 92.188,41 50.966,42 47.473,44 6.484}
{0 CHEMBL216641,1 7.17,2 41.4,3 47.1,4 1.001,5 1.127,6 0.655,7 0.623,8 623.82,9 5.7,10 26,11 87,13 29,14 50,16 91,17 36,20 25,21 11,22 3,24 41,25 10,28 5,29 5,32 46,35 5.7,36 0.165,37 15,38 66,39 87.05,40 98.012,41 57.006,42 54.163,44 6.585}
{0 CHEMBL2170177,1 7.799,2 44.7,3 42.1,4 1.01,5 1.119,6 0.676,7 0.655,8 296.35,9 5.3,10 16,11 38,13 17,14 24,16 40,17 17,20 15,21 2,22 1,24 16,25 5,28 2,29 3,32 22,35 7.9,36 0.1,37 4,38 33,39 38.371,40 42.531,41 25.705,42 24.875,44 4}
{0 CHEMBL2177582,1 8.082,2 44.3,3 42.6,4 1.008,5 1.126,6 0.686,7 0.657,8 493.02,9 6.6,10 18,11 61,13 21,14 38,16 64,17 27,18 1,20 22,21 5,22 3,23 1,24 26,25 8,26 1,28 4,29 2,32 35,34 2,35 3.3,36 0.094,37 6,38 50,39 61.501,40 68.678,41 41.864,42 40.048,43 3.3,44 4.337}
{0 CHEMBL2177587,1 7.787,2 44.3,3 44.3,4 1,5 1.12,6 0.687,7 0.65,8 475.03,9 6.6,10 18,11 61,13 21,14 37,16 64,17 27,18 1,20 22,21 5,22 3,24 27,25 7,26 1,28 4,29 2,32 34,34 1,35 3.3,36 0.094,37 6,38 49,39 60.989,40 68.338,41 41.926,42 39.664,43 1.6,44 4.886}
{0 CHEMBL2177588,1 7.787,2 44.3,3 44.3,4 1,5 1.12,6 0.687,7 0.65,8 475.03,9 6.6,10 18,11 61,13 21,14 37,16 64,17 27,18 1,20 22,21 5,22 3,24 27,25 7,26 1,28 4,29 2,32 34,34 1,35 3.3,36 0.094,37 6,38 49,39 60.989,40 68.338,41 41.926,42 39.664,43 1.6,44 4.444}
{0 CHEMBL2178342,1 8.822,2 43.2,3 37.8,4 1.015,5 1.119,6 0.713,7 0.685,8 326.41,9 10.8,10 17,11 37,13 18,14 25,16 39,17 16,20 15,21 1,22 1,24 14,25 7,26 1,28 4,29 2,31 1,32 23,35 5.4,36 0.128,37 5,38 34.5,39 37.556,40 41.408,41 26.387,42 25.336,44 4.357}
{0 CHEMBL2178343,1 8.733,2 41.7,3 38.9,4 1.015,5 1.122,6 0.705,7 0.676,8 314.4,9 11.1,10 16,11 36,13 17,14 24,16 38,17 15,20 13,21 2,22 1,24 14,25 7,26 1,28 4,29 2,31 1,32 22,35 5.6,36 0.132,37 5,38 33,39 36.556,40 40.408,41 25.387,42 24.336,44 4}
{0 CHEMBL2178344,1 7.907,2 43.6,3 41,4 1.009,5 1.126,6 0.679,7 0.658,8 308.37,9 10.3,10 17,11 39,13 18,14 25,16 41,17 17,20 15,21 2,22 1,24 16,25 6,28 4,29 2,32 23,35 5.1,36 0.122,37 5,38 34.5,39 39.363,40 43.903,41 26.5,42 25.676,44 4}
{0 CHEMBL2178345,1 8.176,2 44.4,3 38.9,4 1.013,5 1.125,6 0.687,7 0.671,8 294.34,9 11.1,10 17,11 36,13 18,14 24,16 38,17 16,20 15,21 1,22 1,24 14,25 6,28 4,29 2,32 22,35 5.6,36 0.105,37 4,38 33.5,39 36.48,40 40.488,41 24.739,42 24.149,44 4.523}
{0 CHEMBL2179618,1 7.114,2 39.6,3 47.9,4 1.003,5 1.131,6 0.646,7 0.614,8 341.45,9 6.3,10 12,11 48,13 14,14 26,16 49,17 19,20 14,21 5,22 2,24 23,25 6,28 3,29 3,32 25,35 6.3,36 0.143,37 7,38 34,39 48.123,40 54.275,41 30.995,42 29.477,44 5.027}
{0 CHEMBL226556,1 5.429,2 37.6,3 60.2,4 0.968,5 1.131,6 0.619,7 0.551,8 504.93,9 2.2,10 12,11 93,13 14,14 38,16 94,17 35,20 14,21 21,22 2,24 56,25 2,28 2,32 37,36 0.255,37 24,38 46,39 90.061,40 105.207,41 57.569,42 51.266,44 6.268}
{0 CHEMBL2312164,1 7.009,2 35,3 50,4 1.012,5 1.139,6 0.617,7 0.591,8 280.36,9 5,10 6,11 40,13 8,14 20,16 40,17 14,20 8,21 6,22 2,24 20,25 6,28 2,29 4,32 20,35 10,36 0.2,37 8,38 25,39 40.465,40 45.571,41 24.682,42 23.643,44 7.788}
{0 CHEMBL2312167,1 6.846,2 34.9,3 51.2,4 1.008,5 1.139,6 0.615,7 0.585,8 294.39,9 4.7,10 6,11 43,13 8,14 21,16 43,17 15,20 8,21 7,22 2,24 22,25 6,28 2,29 4,32 21,35 9.3,36 0.186,37 8,38 26,39 43.349,40 48.986,41 26.443,42 25.17,44 7.083}
{0 CHEMBL2312168,1 6.846,2 34.9,3 51.2,4 1.008,5 1.139,6 0.615,7 0.585,8 294.39,9 4.7,10 6,11 43,13 8,14 21,16 43,17 15,20 8,21 7,22 2,24 22,25 6,28 2,29 4,32 21,35 9.3,36 0.186,37 8,38 26,39 43.349,40 48.986,41 26.443,42 25.17,44 7.924}
{0 CHEMBL2333338,1 6.964,2 34.1,3 50,4 1.008,5 1.145,6 0.619,7 0.59,8 306.41,9 9.1,10 6,11 44,13 8,14 23,16 45,17 15,20 8,21 7,22 2,24 22,25 7,28 4,29 3,32 22,35 6.8,36 0.111,37 5,38 28,39 44.342,40 50.358,41 27.239,42 25.971,44 4.477}
{0 CHEMBL2333339,1 7.926,2 41.7,3 41.7,4 1.016,5 1.128,6 0.665,7 0.649,8 285.33,9 8.3,10 12,11 36,13 14,14 22,16 37,17 15,20 13,21 2,22 2,24 15,25 6,28 3,29 3,32 21,35 8.3,36 0.135,37 5,38 30,39 36.589,40 40.614,41 23.949,42 23.369,44 4.477}
{0 CHEMBL2333340,1 7.685,2 43.2,3 43.2,4 1.01,5 1.122,6 0.668,7 0.645,8 284.34,9 5.4,10 12,11 37,13 14,14 22,16 38,17 16,20 14,21 2,22 2,24 16,25 5,28 2,29 3,32 21,35 8.1,36 0.132,37 5,38 30,39 37.371,40 41.531,41 24.705,42 23.875,44 4.477}
{0 CHEMBL2333341,1 7.95,2 44.1,3 41.2,4 1.014,5 1.121,6 0.675,7 0.657,8 270.31,9 5.9,10 12,11 34,13 14,14 21,16 35,17 15,20 14,21 1,22 2,24 14,25 5,28 2,29 3,32 20,35 8.8,36 0.114,37 4,38 29,39 34.487,40 38.116,41 22.943,42 22.348,44 4.477}
{0 CHEMBL2333342,1 8.267,2 45.2,3 38.7,4 1.019,5 1.119,6 0.683,7 0.672,8 256.28,9 6.5,10 12,11 31,13 14,14 20,16 32,17 14,20 14,22 2,24 12,25 5,28 2,29 3,32 19,35 9.7,36 0.094,37 3,38 28,39 31.604,40 34.701,41 21.182,42 20.821,44 4.477}
{0 CHEMBL2333343,1 8.092,2 37.5,3 41.7,4 1.03,5 1.137,6 0.643,7 0.637,8 194.21,9 8.3,10 6,11 24,13 8,14 14,16 24,17 9,20 8,21 1,22 2,24 10,25 5,28 2,29 3,32 14,35 12.5,36 0.083,37 2,38 19,39 24.72,40 27.286,41 15.42,42 15.294,44 4.477}
{0 CHEMBL2333344,1 6.723,2 33.3,3 52.4,4 1.008,5 1.143,6 0.606,7 0.575,8 141.19,9 4.8,11 21,13 2,14 10,16 21,17 7,20 3,21 4,22 2,24 11,25 3,28 1,29 2,32 10,35 9.5,36 0.048,37 1,38 12,39 21.174,40 23.993,41 12.722,42 12.085,44 5.04}
{0 CHEMBL2333345,1 6.227,2 30.4,3 56.5,4 1.003,5 1.148,6 0.586,7 0.548,8 143.21,9 4.3,11 23,13 1,14 10,16 23,17 7,20 1,21 6,22 1,24 13,25 3,28 1,29 2,32 10,35 8.7,36 0.043,37 1,38 11,39 23.058,40 26.408,41 13.483,42 12.612,44 4.477}
{0 CHEMBL2333346,1 7.064,2 33.3,3 50,4 1.016,5 1.143,6 0.609,7 0.587,8 127.16,9 5.6,11 18,13 2,14 9,16 18,17 6,20 3,21 3,22 2,24 9,25 3,28 1,29 2,32 9,35 11.1,36 0.056,37 1,38 11,39 18.291,40 20.578,41 10.96,42 10.558,44 4.662}
{0 CHEMBL235262,1 6.914,2 38.7,3 51.6,4 0.992,5 1.125,6 0.652,7 0.601,8 428.65,9 3.2,10 12,11 62,13 14,14 31,16 63,17 24,20 14,21 10,22 2,24 32,25 6,26 1,28 2,29 3,31 1,32 30,35 4.8,36 0.175,37 11,38 39,39 61.516,40 69.773,41 40.444,42 37.276,44 7.42}
{0 CHEMBL235263,1 7.081,2 36.8,3 50.9,4 0.997,5 1.131,6 0.648,7 0.601,8 403.6,9 5.3,10 11,11 57,13 13,14 29,16 58,17 21,20 11,21 10,22 2,24 29,25 7,26 1,28 3,29 3,31 1,32 28,35 5.3,36 0.172,37 10,38 36.5,39 56.851,40 64.441,41 36.927,42 34.244,44 7.481}
{0 CHEMBL235674,1 8.338,2 45.5,3 40,4 1.008,5 1.114,6 0.707,7 0.676,8 458.58,9 7.3,10 23,11 55,13 25,14 36,16 58,17 25,20 23,21 2,22 2,24 22,25 8,26 1,28 4,29 3,31 1,32 33,35 5.5,36 0.138,37 8,38 49.5,39 55.418,40 61.278,41 38.887,42 37.158,44 4.301}
{0 CHEMBL235702,1 6.703,2 36.5,3 53.8,4 0.989,5 1.129,6 0.644,7 0.587,8 348.56,9 3.8,10 6,11 52,13 8,14 25,16 53,17 19,20 8,21 11,22 2,24 28,25 5,26 1,28 2,29 2,31 1,32 24,35 3.8,36 0.17,37 9,38 30,39 51.421,40 58.733,41 33.466,42 30.508,44 6.553}
{0 CHEMBL235703,1 7.365,2 36.5,3 51.9,4 0.995,5 1.128,6 0.66,7 0.603,8 383,9 3.8,10 6,11 52,13 8,14 26,16 53,17 19,18 1,20 8,21 11,22 2,24 27,25 6,26 2,28 2,29 2,31 1,32 25,34 1,35 3.8,36 0.17,37 9,38 31,39 51.745,40 58.677,41 34.324,42 31.335,43 1.9,44 6.187}
{0 CHEMBL235704,1 6.576,2 30.4,3 56.5,4 0.997,5 1.142,6 0.612,7 0.559,8 302.49,9 4.3,11 46,13 2,14 20,16 46,17 14,20 2,21 12,22 2,24 26,25 6,26 1,28 2,29 3,31 1,32 20,35 6.5,36 0.196,37 9,38 22,39 45.865,40 52.527,41 28.159,42 25.696,44 6.013}
{0 CHEMBL235842,1 8.368,2 45.2,3 40.5,4 1.005,5 1.113,6 0.712,7 0.675,8 351.46,9 7.1,10 17,11 42,13 19,14 27,16 44,17 19,20 18,21 1,22 2,24 17,25 6,26 1,28 3,29 2,31 1,32 25,35 4.8,36 0.091,37 4,38 37.5,39 42.222,40 46.74,41 29.904,42 28.369,44 4.699}
{0 CHEMBL235909,1 6.159,2 29.6,3 59.3,4 0.991,5 1.144,6 0.601,7 0.542,8 332.57,9 3.7,11 54,13 2,14 21,16 53,17 16,20 2,21 14,22 2,24 32,25 6,26 1,28 2,29 3,31 1,32 22,35 5.6,36 0.189,37 10,38 23,39 53.516,40 61.773,41 32.444,42 29.276,44 5.721}
{0 CHEMBL235911,1 6.111,2 30,3 60,4 0.983,5 1.142,6 0.612,7 0.543,8 244.45,9 5,11 40,13 1,14 16,16 40,17 12,20 1,21 11,22 1,24 24,25 4,26 1,28 2,29 1,31 1,32 16,35 2.5,36 0.175,37 7,38 17,39 39.327,40 45.693,41 24.489,42 21.74,44 4.506}
{0 CHEMBL235917,1 6.085,2 31.5,3 59.3,4 0.985,5 1.14,6 0.611,7 0.547,8 328.58,9 3.7,11 54,13 2,14 22,16 54,17 17,20 2,21 15,22 2,24 32,25 5,26 1,28 2,29 2,31 1,32 22,35 3.7,36 0.167,37 9,38 24,39 53.189,40 61.563,41 32.989,42 29.562,44 6.137}
{0 CHEMBL235918,1 6.423,2 30.4,3 58.9,4 0.983,5 1.139,6 0.628,7 0.555,8 359.67,9 5.4,11 56,13 2,14 23,16 56,17 17,20 2,21 15,22 2,24 33,25 6,26 2,28 3,29 1,31 2,32 23,35 1.8,36 0.161,37 9,38 25,39 55.04,40 63.772,41 35.188,42 31.055,44 6.658}
{0 CHEMBL236128,1 6.576,2 30.4,3 56.5,4 0.997,5 1.142,6 0.612,7 0.559,8 302.49,9 4.3,11 46,13 2,14 20,16 46,17 14,20 2,21 12,22 2,24 26,25 6,26 1,28 2,29 3,31 1,32 20,35 6.5,36 0.196,37 9,38 22,39 45.865,40 52.527,41 28.159,42 25.696,44 5.936}
{0 CHEMBL236129,1 6.761,2 35.7,3 53.6,4 0.993,5 1.131,6 0.637,7 0.585,8 378.59,9 3.6,10 6,11 56,13 8,14 27,16 57,17 20,20 8,21 12,22 2,24 30,25 6,26 1,28 2,29 3,31 1,32 26,35 5.4,36 0.193,37 11,38 32,39 55.632,40 63.358,41 35.682,42 32.75,44 6.886}
{0 CHEMBL236678,1 7.899,2 44.4,3 40.7,4 1.006,5 1.125,6 0.686,7 0.662,8 213.26,9 11.1,10 12,11 27,13 13,14 17,16 28,17 12,20 12,22 1,24 11,25 4,28 3,29 1,32 16,35 3.7,36 0.071,37 2,38 24,39 27.167,40 30.365,41 18.517,42 17.886,44 4.301}
{0 CHEMBL238587,1 7.306,2 37.2,3 50,4 0.996,5 1.128,6 0.662,7 0.61,8 569.87,9 6.4,10 12,11 78,13 15,14 42,16 81,17 29,20 14,21 15,22 3,24 39,25 10,26 2,28 5,29 3,31 2,32 39,35 3.8,36 0.099,37 8,38 51,39 77.665,40 88.018,41 51.631,42 47.581,44 8.377}
{0 CHEMBL238596,1 7.454,2 34.3,3 50,4 1.003,5 1.134,6 0.651,7 0.603,8 521.78,9 7.1,10 6,11 70,13 10,14 37,16 72,17 24,20 9,21 15,22 4,24 35,25 11,26 2,28 5,29 4,31 2,32 35,35 5.7,36 0.111,37 8,38 44,39 70.225,40 79.397,41 45.563,42 42.242,44 7.284}
{0 CHEMBL238829,1 7.473,2 37.5,3 48.8,4 1,5 1.128,6 0.664,7 0.616,8 597.88,9 6.3,10 12,11 80,13 16,14 44,16 83,17 30,20 15,21 15,22 4,24 39,25 11,26 2,28 5,29 4,31 2,32 41,35 5,36 0.12,37 10,38 54,39 79.992,40 90.228,41 53.086,42 49.296,44 7.745}
{0 CHEMBL241555,1 7.475,2 36.9,3 48.8,4 1.002,5 1.129,6 0.658,7 0.614,8 627.91,9 6,10 12,11 84,13 16,14 46,16 87,17 31,20 15,21 16,22 4,24 41,25 12,26 2,28 5,29 5,31 2,32 43,35 6,36 0.138,37 12,38 56,39 84.203,40 94.852,41 55.302,42 51.538,44 8.796}
{0 CHEMBL246199,1 8.03,2 47.9,3 39.6,4 1.007,5 1.113,6 0.697,7 0.675,8 385.45,9 6.3,10 18,11 48,13 21,14 32,16 51,17 23,20 21,21 2,22 3,24 19,25 6,28 3,29 3,32 29,35 6.3,36 0.098,37 5,38 44,39 48.356,40 53.445,41 33.472,42 32.423,44 5.678}
{0 CHEMBL247217,1 7.907,2 46.2,3 41,4 1.01,5 1.116,6 0.685,7 0.663,8 308.36,9 5.1,10 12,11 39,13 15,14 25,16 41,17 18,20 16,21 2,22 3,24 16,25 5,28 2,29 3,32 23,35 7.7,36 0.098,37 4,38 34,39 39.371,40 43.531,41 26.705,42 25.875,44 6.658}
{0 CHEMBL247218,1 7.147,2 43.1,3 47.1,4 0.998,5 1.121,6 0.662,7 0.627,8 364.48,9 3.9,10 12,11 51,13 15,14 29,16 53,17 22,20 16,21 6,22 3,24 24,25 5,28 2,29 3,32 27,35 5.9,36 0.094,37 5,38 38,39 50.905,40 57.192,41 33.75,42 31.982,44 6.745}
{0 CHEMBL247653,1 7.846,2 49,3 40.8,4 1.003,5 1.109,6 0.699,7 0.672,8 384.46,9 4.1,10 18,11 49,13 21,14 32,16 52,17 24,20 22,21 2,22 3,24 20,25 5,28 2,29 3,32 29,35 6.1,36 0.096,37 5,38 44,39 49.138,40 54.362,41 34.228,42 32.928,44 7.009}
{0 CHEMBL247654,1 8.03,2 47.9,3 39.6,4 1.007,5 1.113,6 0.697,7 0.675,8 385.45,9 6.3,10 18,11 48,13 21,14 32,16 51,17 23,20 21,21 2,22 3,24 19,25 6,28 3,29 3,32 29,35 6.3,36 0.098,37 5,38 44,39 48.356,40 53.445,41 33.472,42 32.423,44 7.252}
{0 CHEMBL251011,1 7.027,2 38.6,3 49.1,4 1.006,5 1.131,6 0.635,7 0.605,8 400.52,9 3.5,10 12,11 57,13 14,14 30,16 58,17 22,20 14,21 8,22 2,24 28,25 7,28 2,29 5,32 29,35 8.8,36 0.207,37 12,38 38,39 57.327,40 64.441,41 36.182,42 34.465,44 6.188}
{0 CHEMBL253308,1 7.138,2 34.2,3 51.9,4 0.998,5 1.135,6 0.644,7 0.593,8 563.87,9 6.3,10 6,11 79,13 10,14 40,16 81,17 27,20 9,21 18,22 4,24 41,25 11,26 2,28 5,29 4,31 2,32 38,35 5.1,36 0.123,37 10,38 47,39 78.876,40 89.643,41 50.847,42 46.823,44 7.638}
{0 CHEMBL253309,1 7.138,2 34.2,3 51.9,4 0.998,5 1.135,6 0.644,7 0.593,8 563.87,9 6.3,10 6,11 79,13 10,14 40,16 81,17 27,20 9,21 18,22 4,24 41,25 11,26 2,28 5,29 4,31 2,32 38,35 5.1,36 0.123,37 10,38 47,39 78.876,40 89.643,41 50.847,42 46.823,44 7.481}
{0 CHEMBL255714,1 6.759,2 35.5,3 51.3,4 1.002,5 1.139,6 0.622,7 0.587,8 513.71,9 6.6,10 6,11 76,13 12,14 38,16 77,17 27,20 13,21 14,22 6,24 39,25 10,28 5,29 5,32 37,35 6.6,36 0.104,37 8,38 47,39 76.167,40 86.597,41 47.245,42 44.637,44 4.301}
{0 CHEMBL255805,1 7.821,2 48.6,3 40.5,4 0.998,5 1.113,6 0.704,7 0.674,8 289.36,9 8.1,10 18,11 37,13 19,14 24,16 39,17 18,20 18,22 1,24 15,25 4,28 3,29 1,32 22,35 2.7,36 0.077,37 3,38 34,39 36.934,40 41.196,41 26.04,42 24.94,44 4.301}
{0 CHEMBL256440,1 8.688,2 47.1,3 38.2,4 1.004,5 1.109,6 0.733,7 0.694,8 295.39,9 8.8,10 17,11 34,13 18,14 23,16 36,17 16,20 16,22 1,24 13,25 5,26 1,28 3,29 1,31 1,32 21,35 2.9,36 0.083,37 3,38 32.5,39 34.127,40 37.7,41 24.926,42 23.6,44 4.301}
{0 CHEMBL257972,1 6.983,2 35.5,3 50,4 1.009,5 1.138,6 0.62,7 0.593,8 530.69,9 5.3,10 6,11 76,13 12,14 39,16 77,17 27,20 13,21 14,22 6,24 38,25 11,28 4,29 7,32 38,35 9.2,36 0.104,37 8,38 48,39 76.72,40 86.517,41 47.148,42 45.045,44 5.5}
{0 CHEMBL257973,1 6.938,2 35.7,3 50,4 1.006,5 1.14,6 0.625,7 0.594,8 485.65,9 7.1,10 6,11 70,13 12,14 36,16 71,17 25,20 13,21 12,22 6,24 35,25 10,28 5,29 5,32 35,35 7.1,36 0.099,37 7,38 45,39 70.4,40 79.767,41 43.722,42 41.583,44 4.301}
{0 CHEMBL261735,1 6.859,2 41.1,3 49.3,4 0.994,5 1.127,6 0.652,7 0.612,8 500.7,9 5.5,10 21,11 73,13 23,14 40,16 76,17 30,20 19,21 11,22 2,24 36,25 7,28 4,29 3,32 37,35 4.1,36 0.171,37 13,38 52.5,39 72.527,40 82.265,41 47.569,42 44.659,44 5}
{0 CHEMBL269935,1 7.82,2 51.4,3 40.5,4 0.998,5 1.103,6 0.709,7 0.679,8 289.35,9 2.7,10 18,11 37,13 19,14 24,16 39,17 19,20 19,22 1,24 15,25 3,28 1,29 2,32 22,35 5.4,36 0.077,37 3,38 34,39 36.942,40 40.824,41 26.245,42 25.139,44 4.301}
{0 CHEMBL270224,1 7.416,2 36.5,3 48.6,4 1.002,5 1.133,6 0.656,7 0.612,8 1097.59,9 8.1,10 22,11 148,13 31,14 81,16 153,17 54,20 28,21 26,22 9,24 72,25 22,26 3,28 12,29 7,31 3,32 76,35 4.7,36 0.229,37 35,38 101,39 148.25,40 167.661,41 97.035,42 90.626,44 8.398}
{0 CHEMBL271741,1 7.589,2 50,3 42.1,4 0.993,5 1.108,6 0.705,7 0.67,8 288.37,9 5.3,10 18,11 38,13 19,14 24,16 40,17 19,20 19,22 1,24 16,25 3,28 2,29 1,32 22,35 2.6,36 0.075,37 3,38 34,39 37.716,40 42.112,41 26.796,42 25.445,44 4.301}
{0 CHEMBL271949,1 8.411,2 48.6,3 40,4 0.997,5 1.103,6 0.734,7 0.689,8 294.4,9 5.7,10 17,11 35,13 18,14 23,16 37,17 17,20 17,22 1,24 14,25 4,26 1,28 2,29 1,31 1,32 21,35 2.9,36 0.081,37 3,38 32.5,39 34.909,40 38.617,41 25.682,42 24.106,44 4.301}
{0 CHEMBL272980,1 7.93,2 46,3 40,4 1.002,5 1.122,6 0.696,7 0.671,8 396.49,9 12,10 24,11 50,13 25,14 33,16 53,17 23,20 22,21 1,22 1,24 20,25 7,28 6,29 1,32 30,35 2,36 0.113,37 6,38 46,39 50.123,40 56.106,41 34.819,42 33.531,44 5}
{0 CHEMBL27759,1 7.843,2 43.8,3 41.7,4 1.01,5 1.124,6 0.677,7 0.655,8 376.45,9 8.3,10 18,11 48,13 20,14 30,16 50,17 21,20 19,21 2,22 2,24 20,25 7,28 4,29 3,32 28,35 6.3,36 0.14,37 7,38 41,39 48.458,40 53.943,41 32.478,42 31.444,44 4.312}
{0 CHEMBL317570,1 8.523,2 41,3 41,4 1.02,5 1.12,6 0.687,7 0.661,8 332.41,9 5.1,10 12,11 39,13 16,14 24,16 40,17 16,20 15,21 1,22 4,24 16,25 7,26 1,28 2,29 4,31 1,32 23,35 10.3,36 0.125,37 5,38 34,39 39.774,40 43.661,41 26.807,42 25.777,44 5}
{0 CHEMBL317814,1 8.844,2 41.7,3 38.9,4 1.025,5 1.118,6 0.696,7 0.674,8 318.38,9 5.6,10 12,11 36,13 16,14 23,16 37,17 15,20 15,22 4,24 14,25 7,26 1,28 2,29 4,31 1,32 22,35 11.1,36 0.135,37 5,38 33,39 36.891,40 40.245,41 25.046,42 24.25,44 5.301}
{0 CHEMBL319248,1 8.753,2 40,3 40,4 1.025,5 1.121,6 0.687,7 0.664,8 306.37,9 5.7,10 12,11 35,13 15,14 22,16 36,17 14,20 13,21 1,22 3,24 14,25 7,26 1,28 2,29 4,31 1,32 21,35 11.4,36 0.139,37 5,38 31,39 35.891,40 39.245,41 24.046,42 23.25,44 4.602}
{0 CHEMBL343448,1 7.511,2 33.3,3 50,4 1.009,5 1.135,6 0.642,7 0.6,8 540.78,9 5.6,11 72,13 7,14 37,16 73,17 24,20 9,21 15,22 7,24 36,25 12,26 2,28 4,29 6,31 2,32 36,35 8.3,36 0.027,37 2,38 44,39 72.661,40 81.733,41 46.228,42 43.177,44 6.292}
{0 CHEMBL356066,1 7.16,2 41.5,3 47.2,4 1,5 1.126,6 0.656,7 0.623,8 379.5,9 5.7,10 16,11 53,13 18,14 30,16 55,17 22,20 17,21 5,22 2,24 25,25 6,28 3,29 3,32 28,35 5.7,36 0.164,37 9,38 40,39 53.007,40 59.69,41 34.756,42 33.003,44 8.523}
{0 CHEMBL356769,1 7.599,2 43.2,3 45.3,4 1.004,5 1.118,6 0.674,7 0.64,8 721.94,9 3.2,10 29,11 95,13 31,14 57,16 100,17 41,20 29,21 12,22 2,24 43,25 11,26 1,28 3,29 7,31 1,32 52,35 7.4,36 0.16,37 16,38 73.5,39 95.345,40 106.185,41 64.074,42 60.791,44 4.77}
{0 CHEMBL363750,1 7.563,2 35.3,3 48.2,4 1.02,5 1.147,6 0.629,7 0.603,8 642.82,9 4.7,10 6,11 85,13 11,14 46,16 87,17 30,20 11,21 19,22 5,23 3,24 41,25 14,26 1,28 4,29 6,31 1,32 44,34 3,35 7.1,36 0.138,37 12,38 54,39 86.658,40 97.493,41 53.438,42 51.247,43 3.5,44 6.721}
{0 CHEMBL365927,1 7.493,2 40.6,3 45.3,4 1.012,5 1.127,6 0.651,7 0.628,8 479.58,9 4.7,10 12,11 64,13 17,14 37,16 66,17 26,20 18,21 8,22 5,24 29,25 9,28 3,29 6,32 35,35 9.4,36 0.167,37 11,38 48,39 64.756,40 72.149,41 41.642,42 40.201,44 6.192}
{0 CHEMBL379049,1 6.109,2 31.1,3 59,4 0.988,5 1.141,6 0.606,7 0.546,8 372.64,9 3.3,11 61,13 2,14 25,16 61,17 19,20 2,21 17,22 2,24 36,25 6,26 1,28 2,29 3,31 1,32 25,35 4.9,36 0.164,37 10,38 27,39 60.283,40 69.603,41 36.966,42 33.33,44 6.076}
{0 CHEMBL390991,1 7.639,2 38.5,3 47.4,4 1.001,5 1.126,6 0.671,7 0.625,8 595.86,9 6.4,10 12,11 78,13 16,14 45,16 82,17 30,20 15,21 15,22 4,24 37,25 11,26 2,28 5,29 4,31 2,32 41,35 5.1,36 0.098,37 8,38 55,39 78.109,40 87.812,41 52.324,42 48.769,44 8.62}
{0 CHEMBL391383,1 7.372,2 37.3,3 49.4,4 0.999,5 1.128,6 0.661,7 0.612,8 611.91,9 6,10 12,11 83,13 16,14 45,16 86,17 31,20 15,21 16,22 4,24 41,25 11,26 2,28 5,29 4,31 2,32 42,35 4.8,36 0.128,37 11,38 55,39 82.876,40 93.643,41 54.847,42 50.823,44 8.495}
{0 CHEMBL391384,1 7.278,2 37.2,3 50,4 0.997,5 1.129,6 0.658,7 0.609,8 625.94,9 5.8,10 12,11 86,13 16,14 46,16 89,17 32,20 15,21 17,22 4,24 43,25 11,26 2,28 5,29 4,31 2,32 43,35 4.7,36 0.135,37 12,38 56,39 85.759,40 97.058,41 56.608,42 52.35,44 8.569}
{0 CHEMBL391395,1 6.136,2 30.4,3 58.9,4 0.987,5 1.144,6 0.607,7 0.546,8 343.6,9 5.4,11 56,13 2,14 23,16 56,17 17,20 2,21 15,22 2,24 33,25 6,26 1,28 3,29 2,31 1,32 23,35 3.6,36 0.161,37 9,38 25,39 55.29,40 64.062,41 33.995,42 30.583,44 6.509}
{0 CHEMBL391396,1 6.282,2 32.2,3 57.6,4 0.99,5 1.139,6 0.614,7 0.556,8 370.62,9 3.4,11 59,13 2,14 26,16 60,17 19,20 2,21 17,22 2,24 34,25 6,26 1,28 2,29 3,31 1,32 25,35 5.1,36 0.167,37 10,38 28,39 58.4,40 67.188,41 36.205,42 32.803,44 6.237}
{0 CHEMBL393260,1 7.639,2 38.5,3 47.4,4 1.001,5 1.126,6 0.671,7 0.625,8 595.86,9 6.4,10 12,11 78,13 16,14 45,16 82,17 30,20 15,21 15,22 4,24 37,25 11,26 2,28 5,29 4,31 2,32 41,35 5.1,36 0.098,37 8,38 55,39 78.109,40 87.812,41 52.324,42 48.769,44 7.602}
{0 CHEMBL393261,1 7.473,2 37.5,3 48.8,4 1,5 1.128,6 0.664,7 0.616,8 597.88,9 6.3,10 12,11 80,13 16,14 44,16 83,17 30,20 15,21 15,22 4,24 39,25 11,26 2,28 5,29 4,31 2,32 41,35 5,36 0.12,37 10,38 54,39 79.992,40 90.228,41 53.086,42 49.296,44 7.155}
{0 CHEMBL393464,1 7.473,2 37.5,3 48.8,4 1,5 1.128,6 0.664,7 0.616,8 597.88,9 6.3,10 12,11 80,13 16,14 44,16 83,17 30,20 15,21 15,22 4,24 39,25 11,26 2,28 5,29 4,31 2,32 41,35 5,36 0.12,37 10,38 54,39 79.992,40 90.228,41 53.086,42 49.296,44 8.658}
{0 CHEMBL393827,1 6.223,2 33.3,3 57.6,4 0.987,5 1.137,6 0.617,7 0.558,8 410.69,9 3,11 66,13 2,14 30,16 68,17 22,20 2,21 20,22 2,24 38,25 6,26 1,28 2,29 3,31 1,32 28,35 4.5,36 0.147,37 10,38 32,39 65.167,40 75.018,41 40.728,42 36.857,44 5.377}
{0 CHEMBL393961,1 7.574,2 33.8,3 49.3,4 1.008,5 1.135,6 0.648,7 0.605,8 537.78,9 7,10 6,11 71,13 10,14 38,16 73,17 24,20 9,21 15,22 4,24 35,25 12,26 2,28 5,29 5,31 2,32 36,35 7,36 0.123,37 9,38 45,39 71.552,40 80.607,41 46.017,42 42.957,44 8.398}
{0 CHEMBL394261,1 7.639,2 38.5,3 47.4,4 1.001,5 1.126,6 0.671,7 0.625,8 595.86,9 6.4,10 12,11 78,13 16,14 45,16 82,17 30,20 15,21 15,22 4,24 37,25 11,26 2,28 5,29 4,31 2,32 41,35 5.1,36 0.098,37 8,38 55,39 78.109,40 87.812,41 52.324,42 48.769,44 8.796}
{0 CHEMBL396097,1 7.576,2 46.7,3 43.3,4 1.002,5 1.114,6 0.683,7 0.654,8 227.28,9 3.3,10 12,11 30,13 13,14 18,16 31,17 14,20 13,21 1,22 1,24 13,25 3,28 1,29 2,32 17,35 6.7,36 0.097,37 3,38 25,39 30.058,40 33.408,41 20.483,42 19.612,44 6.125}
{0 CHEMBL398420,1 7.662,2 44.9,3 42.9,4 1.005,5 1.12,6 0.678,7 0.652,8 375.46,9 6.1,10 18,11 49,13 20,14 30,16 51,17 22,20 20,21 2,22 2,24 21,25 6,28 3,29 3,32 28,35 6.1,36 0.118,37 6,38 41,39 49.24,40 54.86,41 33.233,42 31.95,44 4.301}
{0 CHEMBL399494,1 8.072,2 42.9,3 42.9,4 1.006,5 1.118,6 0.691,7 0.656,8 395.52,9 6.1,10 17,11 49,13 19,14 30,16 51,17 21,20 18,21 3,22 2,24 21,25 7,26 1,28 3,29 3,31 1,32 28,35 6.1,36 0.137,37 7,38 40.5,39 49.316,40 54.78,41 33.881,42 32.137,44 4.301}
{0 CHEMBL400721,1 8.293,2 43.5,3 41.3,4 1.009,5 1.117,6 0.698,7 0.665,8 381.49,9 6.5,10 17,11 46,13 19,14 29,16 48,17 20,20 18,21 2,22 2,24 19,25 7,26 1,28 3,29 3,31 1,32 27,35 6.5,36 0.125,37 6,38 39.5,39 46.433,40 51.365,41 32.12,42 30.61,44 4.301}
{0 CHEMBL401837,1 7.138,2 34.2,3 51.9,4 0.998,5 1.135,6 0.644,7 0.593,8 563.87,9 6.3,10 6,11 79,13 10,14 40,16 81,17 27,20 9,21 18,22 4,24 41,25 11,26 2,28 5,29 4,31 2,32 38,35 5.1,36 0.136,37 11,38 47,39 78.876,40 89.643,41 50.847,42 46.823,44 7.62}
{0 CHEMBL402363,1 6.863,2 36,3 50.7,4 1.005,5 1.137,6 0.623,7 0.591,8 514.69,9 5.3,10 6,11 75,13 12,14 38,16 76,17 27,20 13,21 14,22 6,24 38,25 10,28 4,29 6,32 37,35 8,36 0.105,37 8,38 47,39 75.392,40 85.308,41 46.694,42 44.33,44 5.642}
{0 CHEMBL402727,1 6.879,2 35.1,3 50.6,4 1.006,5 1.14,6 0.619,7 0.589,8 529.71,9 6.5,10 6,11 77,13 12,14 39,16 78,17 27,20 13,21 14,22 6,24 39,25 11,28 5,29 6,32 38,35 7.8,36 0.103,37 8,38 48,39 77.494,40 87.806,41 47.699,42 45.351,44 5.437}
{0 CHEMBL404172,1 6.8,2 34.7,3 53.7,4 0.993,5 1.134,6 0.638,7 0.584,8 646.03,9 5.3,10 6,11 95,13 10,14 47,16 98,17 33,20 9,21 24,22 4,24 51,25 11,26 2,28 5,29 4,31 2,32 44,35 4.2,36 0.082,37 8,38 54,39 94.294,40 107.719,41 60.654,42 55.457,44 7.699}
{0 CHEMBL405072,1 7.581,2 46.4,3 42.9,4 0.998,5 1.117,6 0.688,7 0.657,8 212.27,9 7.1,10 12,11 28,13 13,14 17,16 29,17 13,20 13,22 1,24 12,25 3,28 2,29 1,32 16,35 3.6,36 0.069,37 2,38 24,39 27.949,40 31.282,41 19.273,42 18.392,44 4.301}
{0 CHEMBL406927,1 7.501,2 40.9,3 47,4 1.001,5 1.127,6 0.665,7 0.628,8 495.07,9 6.1,10 20,11 66,13 22,14 38,16 69,17 27,18 1,20 17,21 10,22 2,24 31,25 8,26 1,28 4,29 3,32 35,34 1,35 4.5,36 0.159,37 11,38 50,39 66.083,40 74.378,41 43.904,42 41.433,43 1.5,44 5.189}
{0 CHEMBL407959,1 6.952,2 41.4,3 48.6,4 0.995,5 1.126,6 0.654,7 0.616,8 486.67,9 5.7,10 21,11 70,13 23,14 39,16 73,17 29,20 19,21 10,22 2,24 34,25 7,28 4,29 3,32 36,35 4.3,36 0.164,37 12,38 51.5,39 69.643,40 78.849,41 45.807,42 43.132,44 5.111}
{0 CHEMBL408513,1 8.844,2 41.7,3 38.9,4 1.025,5 1.118,6 0.696,7 0.674,8 318.38,9 5.6,10 12,11 36,13 16,14 23,16 37,17 15,20 15,22 4,24 14,25 7,26 1,28 2,29 4,31 1,32 22,35 11.1,36 0.135,37 5,38 33,39 36.891,40 40.245,41 25.046,42 24.25,44 6.42}
{0 CHEMBL419758,1 7.818,2 39,3 48.8,4 0.991,5 1.117,6 0.698,7 0.631,8 320.52,9 4.9,10 11,11 41,13 12,14 22,16 42,17 16,20 10,21 6,22 1,24 20,25 5,26 2,28 2,29 1,31 2,32 21,35 2.4,36 0.19,37 8,38 28.5,39 40.636,40 45.783,41 28.614,42 25.873,44 7.495}
{0 CHEMBL428737,1 7.582,2 37.7,3 48.1,4 1.001,5 1.127,6 0.667,7 0.62,8 583.85,9 6.5,10 12,11 77,13 16,14 43,16 80,17 29,20 15,21 14,22 4,24 37,25 11,26 2,28 5,29 4,31 2,32 40,35 5.2,36 0.113,37 9,38 53,39 77.109,40 86.812,41 51.324,42 47.769,44 7.252}
{0 CHEMBL430060,1 6.637,2 36.2,3 52.1,4 0.999,5 1.137,6 0.622,7 0.585,8 623.88,9 5.3,10 10,11 94,13 15,14 48,16 97,17 34,20 13,21 21,22 5,24 49,25 11,28 5,29 6,32 45,35 6.4,36 0.124,37 12,38 58,39 93.912,40 106.882,41 58.506,42 54.985,44 8.771}
{0 CHEMBL434466,1 8.576,2 45.7,3 39.1,4 1.014,5 1.11,6 0.708,7 0.681,8 394.48,9 4.3,10 18,11 46,13 22,14 30,16 48,17 21,20 21,22 4,24 18,25 7,26 1,28 2,29 4,31 1,32 28,35 8.7,36 0.125,37 6,38 43,39 46.658,40 51.076,41 32.568,42 31.304,44 6}
{0 CHEMBL437029,1 7.452,2 44.3,3 44.3,4 1,5 1.122,6 0.676,7 0.644,8 521.67,9 7.1,10 24,11 70,13 26,14 43,16 74,17 31,20 25,21 6,22 2,24 31,25 8,28 5,29 3,32 39,35 4.3,36 0.095,37 7,38 57,39 69.978,40 78.517,41 47.29,42 45.1,44 4.301}
{0 CHEMBL442661,1 8.332,2 47.1,3 38.2,4 1.021,5 1.113,6 0.688,7 0.678,8 283.3,9 2.9,10 11,11 34,13 15,14 22,16 35,17 16,20 16,22 4,24 13,25 5,28 1,29 4,32 21,35 11.8,36 0.143,37 5,38 31.5,39 34.713,40 37.827,41 23.392,42 23.041,44 4.642}
{0 CHEMBL445955,1 8.036,2 45.9,3 40.5,4 1.016,5 1.115,6 0.68,7 0.664,8 297.33,9 2.7,10 11,11 37,13 15,14 23,16 38,17 17,20 16,21 1,22 4,24 15,25 5,28 1,29 4,32 22,35 10.8,36 0.132,37 5,38 32.5,39 37.596,40 41.242,41 25.154,42 24.568,44 5.959}
{0 CHEMBL447397,1 10.967,2 39.1,3 30.4,4 1.088,5 1.158,6 0.68,7 0.701,8 252.23,10 5,11 23,13 7,14 16,16 23,17 9,20 6,21 3,22 2,23 3,24 7,25 7,26 1,29 3,31 1,32 16,34 3,35 13,36 0.174,37 4,38 20.5,39 25.014,40 26.643,41 15.631,42 16.115,43 13,44 6.495}
{0 CHEMBL447964,1 10.648,2 46.4,3 32.1,4 1.041,5 1.11,6 0.746,7 0.731,8 298.13,9 3.6,10 11,11 28,13 13,14 20,16 29,17 13,18 2,20 13,22 2,24 9,25 6,26 2,28 1,29 3,32 19,34 2,35 10.7,36 0.103,37 3,38 27.5,39 29.149,40 31.091,41 20.892,42 20.455,43 7.1,44 4.307}
{0 CHEMBL450362,1 11.803,2 48.3,3 20.7,4 1.087,5 1.15,6 0.737,7 0.769,8 342.29,9 6.9,10 16,11 29,13 17,14 25,16 31,17 14,20 13,21 1,22 1,23 4,24 6,25 9,26 1,28 2,29 2,31 1,32 23,34 4,35 6.9,36 0.097,37 3,38 34,39 31.52,40 33.355,41 21.364,42 22.3,43 13.8,44 6.658}
{0 CHEMBL453953,1 10.573,2 46.9,3 28.1,4 1.059,5 1.138,6 0.725,7 0.733,8 338.33,9 6.3,10 16,11 32,13 17,14 25,16 34,17 15,20 13,21 2,22 1,23 3,24 9,25 8,26 1,28 2,29 2,31 1,32 23,34 3,35 6.3,36 0.088,37 3,38 34,39 33.891,40 36.431,41 23.188,42 23.443,43 9.4,44 6.959}
{0 CHEMBL454671,1 12.705,2 46.2,3 19.2,4 1.085,5 1.135,6 0.781,7 0.791,8 330.33,9 7.7,10 15,11 26,13 16,14 23,16 28,17 12,20 11,21 1,22 1,23 3,24 5,25 9,26 2,28 2,29 2,31 2,32 21,34 3,35 7.7,36 0.107,37 3,38 31.5,39 28.2,40 29.52,41 20.313,42 20.577,43 11.5,44 7.022}
{0 CHEMBL454672,1 12.705,2 46.2,3 19.2,4 1.085,5 1.135,6 0.781,7 0.791,8 330.33,9 7.7,10 15,11 26,13 16,14 23,16 28,17 12,20 11,21 1,22 1,23 3,24 5,25 9,26 2,28 2,29 2,31 2,32 21,34 3,35 7.7,36 0.107,37 3,38 31.5,39 28.2,40 29.52,41 20.313,42 20.577,43 11.5,44 6.347}
{0 CHEMBL455395,1 12.259,2 46.9,3 18.8,4 1.107,5 1.17,6 0.719,7 0.769,8 392.3,9 6.3,10 16,11 32,13 17,14 28,16 34,17 15,20 13,21 2,22 1,23 6,24 6,25 11,26 1,28 2,29 2,31 1,32 26,34 6,35 6.3,36 0.088,37 3,38 37,39 35.429,40 37.45,41 23,42 24.593,43 18.8,44 6.495}
{0 CHEMBL455455,1 10.107,2 45.2,3 32.3,4 1.054,5 1.14,6 0.708,7 0.708,8 313.32,9 3.2,10 11,11 31,13 13,14 22,16 32,17 14,20 12,21 2,22 2,23 3,24 10,25 7,26 1,28 1,29 2,31 1,32 21,34 3,35 6.5,36 0.125,37 4,38 29.5,39 32.673,40 35.347,41 21.943,42 21.949,43 9.7,44 6.614}
{0 CHEMBL459677,1 9.345,2 47.1,3 35.3,4 1.03,5 1.111,6 0.713,7 0.702,8 317.74,9 2.9,10 11,11 34,13 15,14 23,16 35,17 16,18 1,20 16,22 4,24 12,25 6,26 1,28 1,29 4,32 22,34 1,35 11.8,36 0.143,37 5,38 32.5,39 35.036,40 37.771,41 24.25,42 23.869,43 2.9,44 5.22}
{0 CHEMBL460088,1 12.423,2 48.3,3 17.2,4 1.105,5 1.162,6 0.735,7 0.782,8 360.28,9 6.9,10 16,11 29,13 17,14 26,16 31,17 14,20 13,21 1,22 1,23 5,24 5,25 10,26 1,28 2,29 2,31 1,32 24,34 5,35 6.9,36 0.097,37 3,38 35,39 32.033,40 33.695,41 21.301,42 22.683,43 17.2,44 6.921}
{0 CHEMBL460963,1 6.676,2 39.7,3 50.8,4 0.991,5 1.131,6 0.644,7 0.601,8 420.61,9 6.3,10 16,11 63,13 18,14 33,16 65,17 25,20 16,21 9,22 2,24 32,25 6,28 4,29 2,32 31,35 3.2,36 0.138,37 9,38 43,39 62.432,40 71.225,41 40.591,42 37.89,44 8}
{0 CHEMBL461141,1 13.558,2 48.3,3 17.2,4 1.092,5 1.135,6 0.798,7 0.813,8 393.18,9 6.9,10 16,11 29,13 17,14 26,16 31,17 14,18 2,20 13,21 1,22 1,23 3,24 5,25 10,26 3,28 2,29 2,31 1,32 24,34 5,35 6.9,36 0.097,37 3,38 35,39 31.655,40 32.903,41 23.142,42 23.572,43 17.2,44 6.62}
{0 CHEMBL461142,1 9.279,2 43.9,3 36.6,4 1.038,5 1.138,6 0.694,7 0.684,8 380.42,9 4.9,10 16,11 41,13 17,14 28,16 43,17 18,20 13,21 5,22 1,23 3,24 15,25 8,26 1,28 2,29 2,31 1,32 26,34 3,35 4.9,36 0.093,37 4,38 37,39 42.542,40 46.676,41 28.472,42 28.024,43 7.3,44 5.699}
{0 CHEMBL461333,1 11.618,2 46.4,3 21.4,4 1.079,5 1.146,6 0.738,7 0.765,8 325.29,9 10.7,10 16,11 28,13 17,14 24,16 30,17 13,20 12,21 1,22 1,23 3,24 6,25 9,26 1,28 3,29 2,31 1,32 22,34 3,35 7.1,36 0.1,37 3,38 33,39 30.225,40 32.098,41 20.671,42 21.411,43 10.7,44 6.229}
{0 CHEMBL461763,1 8.334,2 50,3 37.5,4 1.015,5 1.106,6 0.704,7 0.689,8 333.36,9 2.5,10 16,11 40,13 20,14 27,16 42,17 20,20 20,22 4,24 15,25 5,28 1,29 4,32 25,35 10,36 0.119,37 5,38 39,39 40.596,40 44.242,41 28.154,42 27.568,44 5.359}
{0 CHEMBL462131,1 7.567,2 44.2,3 44.2,4 1.008,5 1.118,6 0.667,7 0.642,8 325.39,9 2.3,10 11,11 43,13 15,14 25,16 44,17 19,20 16,21 3,22 4,24 19,25 5,28 1,29 4,32 24,35 9.3,36 0.136,37 6,38 34.5,39 43.363,40 48.073,41 28.676,42 27.622,44 5.311}
{0 CHEMBL462146,1 10.469,2 37.5,3 33.3,4 1.075,5 1.164,6 0.674,7 0.684,8 251.25,9 4.2,10 5,11 24,13 7,14 16,16 24,17 9,20 6,21 3,22 2,23 3,24 8,25 7,26 1,28 1,29 2,31 1,32 16,34 3,35 8.3,36 0.125,37 3,38 20.5,39 25.789,40 27.932,41 16.182,42 16.422,43 12.5,44 5.77}
{0 CHEMBL462202,1 9.982,2 38.9,3 33.3,4 1.061,5 1.154,6 0.678,7 0.686,8 359.36,9 8.3,10 10,11 36,13 12,14 26,16 38,17 14,20 8,21 6,22 2,23 3,24 12,25 10,26 1,28 3,29 3,31 1,32 24,34 3,35 8.3,36 0.105,37 4,38 33,39 38.203,40 41.553,41 24.409,42 24.706,43 8.3,44 7.222}
{0 CHEMBL462203,1 10.773,2 44.7,3 26.3,4 1.07,5 1.141,6 0.713,7 0.734,8 409.37,9 7.9,10 16,11 38,13 18,14 31,16 41,17 17,20 14,21 3,22 2,23 3,24 10,25 11,26 1,28 3,29 4,31 1,32 28,34 3,35 10.5,36 0.098,37 4,38 41,39 40.647,40 43.348,41 27.102,42 27.894,43 7.9,44 7.824}
{0 CHEMBL462208,1 9.628,2 44.1,3 35.3,4 1.046,5 1.14,6 0.697,7 0.69,8 327.35,9 2.9,10 11,11 34,13 13,14 23,16 35,17 15,20 12,21 3,22 2,23 3,24 12,25 7,26 1,28 1,29 2,31 1,32 22,34 3,35 5.9,36 0.114,37 4,38 30.5,39 35.556,40 38.763,41 23.705,42 23.476,43 8.8,44 6.77}
{0 CHEMBL462209,1 9.628,2 44.1,3 35.3,4 1.046,5 1.14,6 0.697,7 0.69,8 327.35,9 2.9,10 11,11 34,13 13,14 23,16 35,17 15,20 12,21 3,22 2,23 3,24 12,25 7,26 1,28 1,29 2,31 1,32 22,34 3,35 5.9,36 0.114,37 4,38 30.5,39 35.556,40 38.763,41 23.705,42 23.476,43 8.8,44 6.292}
{0 CHEMBL462210,1 11.183,2 48.3,3 24.1,4 1.069,5 1.138,6 0.739,7 0.756,8 324.3,9 6.9,10 16,11 29,13 17,14 24,16 31,17 14,20 13,21 1,22 1,23 3,24 7,25 8,26 1,28 2,29 2,31 1,32 22,34 3,35 6.9,36 0.097,37 3,38 33,39 31.007,40 33.015,41 21.426,42 21.917,43 10.3,44 6.959}
{0 CHEMBL462223,1 11.183,2 48.3,3 24.1,4 1.069,5 1.138,6 0.739,7 0.756,8 324.3,9 6.9,10 16,11 29,13 17,14 24,16 31,17 14,20 13,21 1,22 1,23 3,24 7,25 8,26 1,28 2,29 2,31 1,32 22,34 3,35 6.9,36 0.097,37 3,38 33,39 31.007,40 33.015,41 21.426,42 21.917,43 10.3,44 6.377}
{0 CHEMBL462370,1 11.618,2 46.4,3 21.4,4 1.079,5 1.146,6 0.738,7 0.765,8 325.29,9 10.7,10 16,11 28,13 17,14 24,16 30,17 13,20 12,21 1,22 1,23 3,24 6,25 9,26 1,28 3,29 2,31 1,32 22,34 3,35 7.1,36 0.1,37 3,38 33,39 30.225,40 32.098,41 20.671,42 21.411,43 10.7,44 7.155}
{0 CHEMBL466215,1 7.17,2 42.7,3 46.7,4 0.997,5 1.125,6 0.664,7 0.629,8 537.72,9 6.7,10 26,11 75,13 28,14 44,16 79,17 32,20 23,21 9,22 2,24 35,25 8,28 5,29 3,32 40,35 4,36 0.152,37 12,38 59,39 74.745,40 84.348,41 49.813,42 47.153,44 5}
{0 CHEMBL468513,1 6.581,2 40,3 51.4,4 0.989,5 1.129,6 0.644,7 0.599,8 460.68,9 5.7,10 16,11 70,13 18,14 37,16 73,17 28,20 15,21 13,22 2,24 36,25 6,28 4,29 2,32 34,35 2.9,36 0.137,37 10,38 47,39 69.199,40 79.055,41 45.114,42 41.944,44 9}
{0 CHEMBL470225,1 7.893,2 38.3,3 46.7,4 1.003,5 1.123,6 0.684,7 0.631,8 473.58,9 5,10 17,11 60,13 19,14 34,16 62,17 23,20 17,21 6,22 2,24 28,25 9,26 2,28 3,29 4,30 1,31 1,32 32,35 6.7,36 0.177,37 11,38 44.5,39 60.152,40 67.374,41 41.063,42 37.883,44 4.301}
{0 CHEMBL470843,1 7.66,2 39.5,3 44.2,4 1.016,5 1.131,6 0.649,7 0.631,8 329.39,9 7,10 11,11 43,13 13,14 26,16 45,17 17,20 12,21 5,22 2,24 19,25 7,28 3,29 4,32 24,35 9.3,36 0.111,37 5,38 33.5,39 43.683,40 48.654,41 27.926,42 27.138,44 4.924}
{0 CHEMBL471041,1 10.166,2 44.7,3 28.9,4 1.077,5 1.164,6 0.668,7 0.705,8 386.3,9 5.3,10 12,11 38,13 15,14 28,16 39,17 17,20 16,21 1,22 3,23 5,24 11,25 10,28 2,29 3,32 27,34 5,35 7.9,36 0.154,37 6,38 37,39 40.934,40 44.23,41 25.392,42 26.791,43 13.2,44 4.411}
{0 CHEMBL471042,1 8.534,2 42.5,3 37.5,4 1.031,5 1.126,6 0.671,7 0.67,8 341.35,9 7.5,10 12,11 40,13 17,14 26,16 41,17 17,20 16,21 1,22 5,24 15,25 8,28 3,29 5,32 25,35 12.5,36 0.171,37 7,38 37,39 41.244,40 45.033,41 26.858,42 26.799,44 5.69}
{0 CHEMBL471043,1 8.054,2 43.2,3 40.9,4 1.021,5 1.122,6 0.668,7 0.655,8 354.39,9 4.5,10 12,11 44,13 16,14 27,16 45,17 19,20 17,21 2,22 4,24 18,25 7,28 2,29 5,32 26,35 11.4,36 0.178,37 8,38 37,39 44.909,40 49.365,41 29.375,42 28.831,44 4.889}
{0 CHEMBL471173,1 10.835,2 35.3,3 32.4,4 1.074,5 1.152,6 0.691,7 0.694,8 368.39,9 5.9,10 10,11 34,13 13,14 24,16 35,17 12,20 7,21 5,22 3,23 3,24 11,25 11,26 2,28 2,29 4,31 2,32 23,34 3,35 11.8,36 0.171,37 6,38 32,39 36.505,40 39.185,41 23.506,42 23.587,43 8.8,44 7.523}
{0 CHEMBL471174,1 12.763,2 40.6,3 21.9,4 1.088,5 1.134,6 0.77,7 0.773,8 408.43,9 6.3,10 15,11 32,13 18,14 27,16 34,17 13,20 11,21 2,22 3,23 3,24 7,25 12,26 3,28 2,29 4,31 3,32 25,34 3,35 12.5,36 0.147,37 5,38 37.5,39 34.815,40 36.274,41 24.631,42 24.72,43 9.4,44 7.456}
{0 CHEMBL471344,1 11.92,2 40.9,3 22.7,4 1.097,5 1.164,6 0.712,7 0.745,8 262.23,9 9.1,10 10,11 22,13 11,14 18,16 23,17 9,20 7,21 2,22 1,23 3,24 5,25 8,26 1,28 2,29 2,31 1,32 17,34 3,35 9.1,36 0.087,37 2,38 24,39 24.124,40 25.6,41 15.665,42 16.39,43 13.6,44 7.125}
{0 CHEMBL471494,1 10.358,2 47.1,3 32.4,4 1.04,5 1.109,6 0.738,7 0.726,8 352.18,9 2.9,10 11,11 34,13 15,14 24,16 35,17 16,18 2,20 16,22 4,24 11,25 7,26 2,28 1,29 4,32 23,34 2,35 11.8,36 0.143,37 5,38 33.5,39 35.36,40 37.715,41 25.108,42 24.696,43 5.9,44 5.366}
{0 CHEMBL471495,1 10.358,2 47.1,3 32.4,4 1.04,5 1.109,6 0.738,7 0.726,8 352.18,9 2.9,10 11,11 34,13 15,14 24,16 35,17 16,18 2,20 16,22 4,24 11,25 7,26 2,28 1,29 4,32 23,34 2,35 11.8,36 0.143,37 5,38 33.5,39 35.36,40 37.715,41 25.108,42 24.696,43 5.9,44 5.087}
{0 CHEMBL472345,1 8.815,2 45.2,3 35.5,4 1.037,5 1.117,6 0.68,7 0.685,8 273.26,9 3.2,10 11,11 31,13 13,14 22,16 33,17 14,20 13,21 1,22 2,24 11,25 6,28 1,29 5,32 20,35 16.1,36 0.091,37 3,38 29.5,39 32.156,40 34.621,41 21.085,42 21.229,44 4.068}
{0 CHEMBL472346,1 7.565,2 41.7,3 44.4,4 1.01,5 1.126,6 0.658,7 0.635,8 272.33,9 5.6,10 11,11 36,13 13,14 21,16 37,17 15,20 13,21 2,22 2,24 16,25 5,28 2,29 3,32 20,35 8.3,36 0.108,37 4,38 28.5,39 36.371,40 40.531,41 23.705,42 22.875,44 4.296}
{0 CHEMBL472347,1 7.944,2 45.7,3 41.3,4 1.015,5 1.115,6 0.677,7 0.659,8 365.41,9 2.2,10 17,11 46,13 19,14 29,16 48,17 21,20 19,21 2,22 2,24 19,25 6,28 1,29 5,32 27,35 10.9,36 0.146,37 7,38 39.5,39 46.691,40 51.282,41 31.131,42 30.337,44 4.989}
{0 CHEMBL472532,1 8.457,2 44.8,3 37.9,4 1.029,5 1.118,6 0.677,7 0.673,8 245.25,9 3.4,10 11,11 29,13 13,14 19,16 30,17 13,20 13,22 2,24 11,25 5,28 1,29 4,32 18,35 13.8,36 0.1,37 3,38 26.5,39 29.829,40 32.412,41 19.631,42 19.515,44 4.129}
{0 CHEMBL472533,1 8.861,2 47.1,3 35.3,4 1.036,5 1.123,6 0.686,7 0.689,8 301.29,9 2.9,10 11,11 34,13 15,14 23,16 35,17 16,20 16,22 4,23 1,24 12,25 6,28 1,29 4,32 22,34 1,35 11.8,36 0.143,37 5,38 32.5,39 35.225,40 38.167,41 23.33,42 23.425,43 2.9,44 5.115}
{0 CHEMBL472631,1 7.259,2 36.4,3 47.7,4 1.013,5 1.138,6 0.629,7 0.606,8 319.4,9 6.8,10 6,11 44,13 9,14 24,16 45,17 16,20 10,21 6,22 3,24 21,25 7,28 3,29 4,32 23,35 9.1,36 0.156,37 7,38 30,39 44.567,40 50.069,41 27.688,42 26.665,44 4.793}
{0 CHEMBL483254,1 7.132,2 42.9,3 46.9,4 0.996,5 1.124,6 0.664,7 0.628,8 349.47,9 6.1,10 16,11 49,13 18,14 28,16 51,17 21,20 17,21 4,22 2,24 23,25 5,28 3,29 2,32 26,35 4.1,36 0.137,37 7,38 38,39 48.796,40 55.066,41 32.54,42 30.762,44 6.26}
{0 CHEMBL484073,1 7.276,2 40,3 46.7,4 1.005,5 1.13,6 0.65,7 0.621,8 327.42,9 6.7,10 11,11 45,13 14,14 25,16 46,17 18,20 13,21 5,22 3,24 21,25 6,28 3,29 3,32 24,35 6.7,36 0.174,37 8,38 33.5,39 45.24,40 50.86,41 29.233,42 27.95,44 8.276}
{0 CHEMBL484489,1 8.22,2 37.5,3 45,4 1.024,5 1.141,6 0.651,7 0.628,8 328.8,9 5,10 6,11 40,13 9,14 22,16 40,17 15,18 1,20 10,21 5,22 3,23 1,24 18,25 7,26 1,28 2,29 3,32 22,34 2,35 7.5,36 0.2,37 8,38 28,39 40.974,40 45.645,41 26.023,42 25.139,43 5,44 8.367}
{0 CHEMBL485514,1 7.301,2 43.8,3 45.8,4 1,5 1.12,6 0.666,7 0.634,8 350.45,9 4.2,10 12,11 48,13 15,14 28,16 50,17 21,20 16,21 5,22 3,24 22,25 5,28 2,29 3,32 26,35 6.3,36 0.14,37 7,38 37,39 48.022,40 53.777,41 31.989,42 30.455,44 8.921}
{0 CHEMBL486686,1 7.06,2 35.4,3 49.4,4 1.01,5 1.139,6 0.622,7 0.596,8 557.72,9 6.3,10 6,11 79,13 13,14 41,16 80,17 28,20 14,21 14,22 7,24 39,25 12,28 5,29 7,32 40,35 8.9,36 0.175,37 14,38 51,39 79.821,40 90.016,41 49.154,42 47.066,44 5.928}
{0 CHEMBL489332,1 6.862,2 41,3 49.2,4 0.993,5 1.128,6 0.653,7 0.613,8 418.59,9 6.6,10 16,11 61,13 18,14 34,16 64,17 25,20 16,21 9,22 2,24 30,25 6,28 4,29 2,32 31,35 3.3,36 0.125,37 8,38 44,39 60.549,40 68.81,41 39.83,42 37.364,44 8.06}
{0 CHEMBL490018,1 6.733,2 38.3,3 51.1,4 0.998,5 1.132,6 0.633,7 0.595,8 316.44,9 4.3,10 6,11 47,13 10,14 23,16 47,17 18,20 12,21 6,22 4,24 24,25 5,28 2,29 3,32 23,35 6.4,36 0.191,37 9,38 30,39 46.905,40 53.192,41 29.75,42 27.982,44 8.432}
{0 CHEMBL491316,1 6.975,2 41.4,3 48.3,4 0.994,5 1.127,6 0.656,7 0.618,8 404.56,9 6.9,10 16,11 58,13 18,14 33,16 61,17 24,20 16,21 8,22 2,24 28,25 6,28 4,29 2,32 30,35 3.4,36 0.131,37 8,38 43,39 57.665,40 65.394,41 38.069,42 35.837,44 8.045}
{0 CHEMBL493782,1 9.628,2 44.1,3 35.3,4 1.046,5 1.14,6 0.697,7 0.69,8 327.35,9 2.9,10 11,11 34,13 13,14 23,16 35,17 15,20 12,21 3,22 2,23 3,24 12,25 7,26 1,28 1,29 2,31 1,32 22,34 3,35 5.9,36 0.114,37 4,38 30.5,39 35.556,40 38.763,41 23.705,42 23.476,43 8.8,44 5.77}
{0 CHEMBL493783,1 9.95,2 42.4,3 33.3,4 1.054,5 1.147,6 0.695,7 0.696,8 328.34,9 6.1,10 11,11 33,13 13,14 23,16 34,17 14,20 11,21 3,22 2,23 3,24 11,25 8,26 1,28 2,29 2,31 1,32 22,34 3,35 6.1,36 0.118,37 4,38 30.5,39 34.774,40 37.846,41 22.949,42 22.97,43 9.1,44 6.119}
{0 CHEMBL494645,1 8.953,2 42.9,3 40,4 1.032,5 1.142,6 0.686,7 0.665,8 313.37,9 2.9,10 11,11 35,13 12,14 22,16 36,17 15,20 11,21 4,22 1,23 3,24 14,25 6,26 1,28 1,29 1,31 1,32 21,34 3,35 2.9,36 0.139,37 5,38 28.5,39 36.112,40 39.968,41 24.012,42 23.288,43 8.6,44 5.432}
{0 CHEMBL494813,1 10.383,2 40,3 34.3,4 1.056,5 1.14,6 0.709,7 0.697,8 363.41,9 2.9,10 11,11 35,13 14,14 24,16 36,17 14,20 11,21 3,22 3,23 3,24 12,25 9,26 2,28 1,29 3,31 2,32 23,34 3,35 8.6,36 0.139,37 5,38 32.5,39 36.96,40 39.892,41 24.807,42 24.378,43 8.6,44 6.469}
{0 CHEMBL494990,1 8.632,2 37.8,3 43.2,4 1.036,5 1.151,6 0.655,7 0.636,8 319.38,9 2.7,10 5,11 37,13 7,14 22,16 38,17 14,20 6,21 8,22 2,23 3,24 16,25 7,26 1,28 1,29 2,31 1,32 21,34 3,35 5.4,36 0.105,37 4,38 26.5,39 38.323,40 42.593,41 24.228,42 23.529,43 8.1,44 5.481}
{0 CHEMBL496094,1 9.653,2 45.2,3 33.3,4 1.042,5 1.137,6 0.708,7 0.703,8 405.43,9 7.1,10 16,11 42,13 18,14 31,16 45,17 19,20 15,21 4,22 2,23 3,24 14,25 9,26 1,28 3,29 2,31 1,32 28,34 3,35 4.8,36 0.067,37 3,38 41,39 43.76,40 47.759,41 29.716,42 29.518,43 7.1,44 6.465}
{0 CHEMBL496511,1 8.953,2 42.9,3 40,4 1.032,5 1.142,6 0.686,7 0.665,8 313.37,9 2.9,10 11,11 35,13 12,14 22,16 36,17 15,20 11,21 4,22 1,23 3,24 14,25 6,26 1,28 1,29 1,31 1,32 21,34 3,35 2.9,36 0.139,37 5,38 28.5,39 36.112,40 39.968,41 24.012,42 23.288,43 8.6,44 6.013}
{0 CHEMBL496512,1 9.439,2 42.9,3 37.1,4 1.048,5 1.14,6 0.683,7 0.677,8 330.35,10 11,11 35,13 12,14 23,16 36,17 15,20 11,21 4,22 1,23 3,24 13,25 7,26 1,29 3,31 1,32 22,34 3,35 8.6,36 0.167,37 6,38 29.5,39 36.665,40 39.889,41 23.915,42 23.696,43 8.6,44 5.26}
{0 CHEMBL496703,1 10.268,2 39.1,3 30.4,4 1.098,5 1.171,6 0.628,7 0.68,8 236.16,10 5,11 23,13 7,14 16,16 23,17 9,20 6,21 3,22 2,23 3,24 7,25 7,29 4,32 16,34 3,35 17.4,36 0.174,37 4,38 20.5,39 25.265,40 26.933,41 14.437,42 15.643,43 13,44 5.602}
{0 CHEMBL496923,1 8.54,2 41.2,3 41.2,4 1.017,5 1.119,6 0.694,7 0.663,8 290.37,9 5.9,10 11,11 34,13 13,14 21,16 35,17 14,20 12,21 2,22 2,24 14,25 6,26 1,28 2,29 3,31 1,32 20,35 8.8,36 0.114,37 4,38 28.5,39 34.564,40 38.036,41 23.591,42 22.535,44 5.569}
{0 CHEMBL497123,1 9.81,2 42.9,3 34.3,4 1.054,5 1.142,6 0.69,7 0.691,8 343.35,9 2.9,10 11,11 35,13 13,14 24,16 36,17 15,20 12,21 3,22 2,23 3,24 12,25 8,26 1,28 1,29 3,31 1,32 23,34 3,35 8.6,36 0.139,37 5,38 31.5,39 36.883,40 39.972,41 24.159,42 24.19,43 8.6,44 6.745}
{0 CHEMBL497331,1 8.632,2 37.8,3 43.2,4 1.036,5 1.151,6 0.655,7 0.636,8 319.38,9 2.7,10 5,11 37,13 7,14 22,16 38,17 14,20 6,21 8,22 2,23 3,24 16,25 7,26 1,28 1,29 2,31 1,32 21,34 3,35 5.4,36 0.105,37 4,38 26.5,39 38.323,40 42.593,41 24.228,42 23.529,43 8.1,44 6.398}
{0 CHEMBL497332,1 9.984,2 44.7,3 31.6,4 1.049,5 1.141,6 0.709,7 0.71,8 379.39,9 7.9,10 16,11 38,13 18,14 28,16 40,17 17,20 14,21 3,22 2,23 3,24 12,25 9,26 1,28 3,29 2,31 1,32 26,34 3,35 5.3,36 0.1,37 4,38 38,39 39.876,40 43.344,41 26.955,42 26.992,43 7.9,44 7.009}
{0 CHEMBL497760,1 9.604,2 46.9,3 34.4,4 1.036,5 1.125,6 0.719,7 0.705,8 307.34,9 3.1,10 11,11 32,13 13,14 23,16 34,17 15,20 12,21 3,22 2,23 2,24 11,25 6,26 1,28 1,29 2,31 1,32 21,34 2,35 6.3,36 0.059,37 2,38 30.5,39 33.16,40 36.008,41 23.006,42 22.566,43 6.3,44 5.119}
{0 CHEMBL502752,1 10.383,2 40,3 34.3,4 1.056,5 1.14,6 0.709,7 0.697,8 363.41,9 2.9,10 11,11 35,13 14,14 24,16 36,17 14,20 11,21 3,22 3,23 3,24 12,25 9,26 2,28 1,29 3,31 2,32 23,34 3,35 8.6,36 0.139,37 5,38 32.5,39 36.96,40 39.892,41 24.807,42 24.378,43 8.6,44 5.027}
{0 CHEMBL504161,1 11.874,2 44.8,3 24.1,4 1.072,5 1.136,6 0.761,7 0.762,8 344.36,9 6.9,10 15,11 29,13 16,14 24,16 31,17 13,20 11,21 2,22 1,23 3,24 7,25 9,26 2,28 2,29 2,31 2,32 22,34 3,35 6.9,36 0.129,37 4,38 32.5,39 31.084,40 32.935,41 22.074,42 22.104,43 10.3,44 7.824}
{0 CHEMBL504669,1 9.345,2 47.1,3 35.3,4 1.03,5 1.111,6 0.713,7 0.702,8 317.74,9 2.9,10 11,11 34,13 15,14 23,16 35,17 16,18 1,20 16,22 4,24 12,25 6,26 1,28 1,29 4,32 22,34 1,35 11.8,36 0.143,37 5,38 32.5,39 35.036,40 37.771,41 24.25,42 23.869,43 2.9,44 4.889}
{0 CHEMBL505199,1 8.187,2 46.4,3 39.3,4 1.018,5 1.114,6 0.685,7 0.671,8 229.25,9 3.6,10 11,11 28,13 13,14 18,16 29,17 13,20 13,22 2,24 11,25 4,28 1,29 3,32 17,35 10.7,36 0.103,37 3,38 25.5,39 28.502,40 31.203,41 19.176,42 18.8,44 4.326}
{0 CHEMBL505259,1 11.313,2 50,3 26.7,4 1.051,5 1.121,6 0.779,7 0.763,8 339.38,9 3.3,10 16,11 30,13 17,14 24,16 32,17 15,20 14,21 1,22 1,23 3,24 8,25 7,26 2,28 1,29 1,31 2,32 22,34 3,35 3.3,36 0.094,37 3,38 33,39 31.538,40 33.643,41 23.375,42 22.894,43 10,44 5.824}
{0 CHEMBL507716,1 9.628,2 44.1,3 35.3,4 1.046,5 1.14,6 0.697,7 0.69,8 327.35,9 2.9,10 11,11 34,13 13,14 23,16 35,17 15,20 12,21 3,22 2,23 3,24 12,25 7,26 1,28 1,29 2,31 1,32 22,34 3,35 5.9,36 0.114,37 4,38 30.5,39 35.556,40 38.763,41 23.705,42 23.476,43 8.8,44 7.119}
{0 CHEMBL509207,1 10.573,2 46.9,3 28.1,4 1.059,5 1.138,6 0.725,7 0.733,8 338.33,9 6.3,10 16,11 32,13 17,14 25,16 34,17 15,20 13,21 2,22 1,23 3,24 9,25 8,26 1,28 2,29 2,31 1,32 23,34 3,35 6.3,36 0.088,37 3,38 34,39 33.891,40 36.431,41 23.188,42 23.443,43 9.4,44 6.569}
{0 CHEMBL509445,1 10.573,2 46.9,3 28.1,4 1.059,5 1.138,6 0.725,7 0.733,8 338.33,9 6.3,10 16,11 32,13 17,14 25,16 34,17 15,20 13,21 2,22 1,23 3,24 9,25 8,26 1,28 2,29 2,31 1,32 23,34 3,35 6.3,36 0.088,37 3,38 34,39 33.891,40 36.431,41 23.188,42 23.443,43 9.4,44 6.553}
{0 CHEMBL512043,1 11.618,2 46.4,3 21.4,4 1.079,5 1.146,6 0.738,7 0.765,8 325.29,9 10.7,10 16,11 28,13 17,14 24,16 30,17 13,20 12,21 1,22 1,23 3,24 6,25 9,26 1,28 3,29 2,31 1,32 22,34 3,35 7.1,36 0.1,37 3,38 33,39 30.225,40 32.098,41 20.671,42 21.411,43 10.7,44 7.046}
{0 CHEMBL512179,1 8.457,2 44.8,3 37.9,4 1.029,5 1.118,6 0.677,7 0.673,8 245.25,9 3.4,10 11,11 29,13 13,14 19,16 30,17 13,20 13,22 2,24 11,25 5,28 1,29 4,32 18,35 13.8,36 0.1,37 3,38 26.5,39 29.829,40 32.412,41 19.631,42 19.515,44 4.244}
{0 CHEMBL512516,1 12.155,2 35.7,3 25,4 1.098,5 1.156,6 0.714,7 0.733,8 340.33,9 7.1,10 10,11 28,13 13,14 22,16 29,17 10,20 7,21 3,22 3,23 3,24 7,25 11,26 2,28 2,29 4,31 2,32 21,34 3,35 14.3,36 0.138,37 4,38 30,39 30.738,40 32.354,41 19.983,42 20.533,43 10.7,44 7.523}
{0 CHEMBL512517,1 11.432,2 42.1,3 26.3,4 1.079,5 1.145,6 0.722,7 0.736,8 434.42,9 5.3,10 16,11 38,13 19,14 30,16 40,17 16,20 13,21 3,22 3,23 4,24 10,25 12,26 2,28 2,29 4,31 2,32 28,34 4,35 10.5,36 0.15,37 6,38 41,39 41.018,40 43.524,41 27.443,42 27.97,43 10.5,44 7.222}
{0 CHEMBL513589,1 8.342,2 42.4,3 39.4,4 1.032,5 1.122,6 0.662,7 0.659,8 275.28,9 3,10 11,11 33,13 13,14 21,16 34,17 14,20 13,21 1,22 2,24 13,25 6,28 1,29 5,32 20,35 15.2,36 0.118,37 4,38 28.5,39 34.04,40 37.037,41 21.847,42 21.756,44 4.368}
{0 CHEMBL517869,1 12.259,2 46.9,3 18.8,4 1.107,5 1.17,6 0.719,7 0.769,8 392.3,9 6.3,10 16,11 32,13 17,14 28,16 34,17 15,20 13,21 2,22 1,23 6,24 6,25 11,26 1,28 2,29 2,31 1,32 26,34 6,35 6.3,36 0.088,37 3,38 37,39 35.429,40 37.45,41 23,42 24.593,43 18.8,44 6.699}
{0 CHEMBL518165,1 8.259,2 47.7,3 38.6,4 1.018,5 1.111,6 0.69,7 0.677,8 363.39,9 2.3,10 16,11 44,13 20,14 29,16 46,17 21,20 20,21 1,22 4,24 17,25 6,28 1,29 5,32 27,35 11.4,36 0.13,37 6,38 41,39 44.807,40 48.867,41 30.369,42 29.81,44 5.394}
{0 CHEMBL518821,1 11.115,2 44.7,3 23.7,4 1.075,5 1.143,6 0.72,7 0.747,8 422.37,9 10.5,10 21,11 38,13 22,14 32,16 41,17 17,20 15,21 2,22 1,23 3,24 9,25 12,26 1,28 4,29 4,31 1,32 29,34 3,35 10.5,36 0.146,37 6,38 43.5,39 40.865,40 43.431,41 27.347,42 28.389,43 7.9,44 8.155}
{0 CHEMBL523588,1 9.628,2 44.1,3 35.3,4 1.046,5 1.14,6 0.697,7 0.69,8 327.35,9 2.9,10 11,11 34,13 13,14 23,16 35,17 15,20 12,21 3,22 2,23 3,24 12,25 7,26 1,28 1,29 2,31 1,32 22,34 3,35 5.9,36 0.143,37 5,38 30.5,39 35.556,40 38.763,41 23.705,42 23.476,43 8.8,44 6.481}
{0 CHEMBL524024,1 8.899,2 36.1,3 41.7,4 1.043,5 1.158,6 0.652,7 0.64,8 320.37,9 5.6,10 5,11 36,13 7,14 22,16 37,17 13,20 5,21 8,22 2,23 3,24 15,25 8,26 1,28 2,29 2,31 1,32 21,34 3,35 5.6,36 0.108,37 4,38 26.5,39 37.542,40 41.676,41 23.472,42 23.024,43 8.3,44 6.071}
{0 CHEMBL525529,1 10.167,2 46.9,3 31.3,4 1.052,5 1.136,6 0.717,7 0.717,8 325.33,9 3.1,10 11,11 32,13 13,14 24,16 34,17 15,20 12,21 3,22 2,23 3,24 10,25 7,26 1,28 1,29 2,31 1,32 22,34 3,35 6.3,36 0.059,37 2,38 31.5,39 33.673,40 36.347,41 22.943,42 22.949,43 9.4,44 6.886}
{0 CHEMBL561483,1 7.14,2 41,3 47.5,4 1.002,5 1.127,6 0.651,7 0.619,8 435.57,9 4.9,10 20,11 61,13 21,14 35,16 64,17 25,20 17,21 8,22 1,24 29,25 7,28 3,29 4,32 32,35 6.6,36 0.156,37 10,38 46,39 61.101,40 68.73,41 39.733,42 37.772,44 6.658}
{0 CHEMBL561604,1 8.167,2 40.4,3 40.4,4 1.025,5 1.131,6 0.66,7 0.652,8 465.51,9 8.8,10 20,11 57,13 25,14 37,16 60,17 23,20 17,21 6,22 5,24 23,25 11,28 5,29 6,32 34,35 10.5,36 0.167,37 10,38 52,39 58.425,40 64.485,41 37.608,42 37.137,44 6.658}
{0 CHEMBL564382,1 7.837,2 50,3 40.4,4 0.998,5 1.109,6 0.707,7 0.678,8 407.5,9 5.8,10 26,11 52,13 28,14 35,16 56,17 26,20 25,21 1,22 2,24 21,25 5,28 3,29 2,32 31,35 3.8,36 0.089,37 5,38 50,39 51.912,40 57.651,41 36.779,42 35.235,44 5.319}
{0 CHEMBL564876,1 7.085,2 43.4,3 47.2,4 0.994,5 1.122,6 0.666,7 0.628,8 375.51,9 5.7,10 20,11 53,13 21,14 31,16 56,17 23,20 17,21 6,22 1,24 25,25 5,28 3,29 2,32 28,35 3.8,36 0.143,37 8,38 42,39 52.68,40 59.481,41 35.302,42 33.289,44 5.886}
{0 CHEMBL572545,1 7.706,2 45.5,3 42.4,4 1.005,5 1.118,6 0.681,7 0.656,8 254.31,9 6.1,10 12,11 33,13 13,14 21,16 35,17 15,20 13,21 2,22 1,24 14,25 4,28 2,29 2,32 19,35 6.1,36 0.029,37 1,38 28,39 33.16,40 36.907,41 22.489,42 21.633,44 5.719}
{0 CHEMBL572805,1 9.872,2 46.7,3 36.7,4 1.024,5 1.11,6 0.74,7 0.709,8 296.16,9 3.3,10 12,11 30,13 13,14 20,16 31,17 14,18 2,20 13,21 1,22 1,24 11,25 5,26 2,28 1,29 2,32 19,34 2,35 6.7,36 0.097,37 3,38 27,39 30.705,40 33.296,41 22.199,42 21.267,43 6.7,44 6.018}
{0 CHEMBL573189,1 7.183,2 39.1,3 47.8,4 1.008,5 1.13,6 0.64,7 0.612,8 165.21,9 4.3,10 6,11 23,13 7,14 12,16 23,17 9,20 7,21 2,22 1,24 11,25 3,28 1,29 2,32 12,35 8.7,36 0.087,37 2,38 16,39 23.174,40 25.993,41 14.722,42 14.085,44 5}
{0 CHEMBL573190,1 8.775,2 46.7,3 36.7,4 1.036,5 1.136,6 0.679,7 0.679,8 263.26,9 3.3,10 12,11 30,13 13,14 20,16 31,17 14,20 13,21 1,22 1,23 2,24 11,25 5,28 1,29 2,32 19,34 2,35 6.7,36 0.097,37 3,38 27,39 31.083,40 34.088,41 20.358,42 20.378,43 6.7,44 5.959}
{0 CHEMBL574378,1 8.99,2 34.8,3 41.3,4 1.032,5 1.129,6 0.677,7 0.651,8 413.52,9 6.5,10 12,11 46,13 17,14 28,16 47,17 16,20 13,21 3,22 5,24 19,25 11,26 2,28 3,29 6,31 2,32 27,35 13,36 0.149,37 7,38 39,39 47.491,40 51.913,41 31.131,42 29.942,44 5}
{0 CHEMBL574594,1 8.775,2 46.7,3 36.7,4 1.036,5 1.136,6 0.679,7 0.679,8 263.26,9 3.3,10 12,11 30,13 13,14 20,16 31,17 14,20 13,21 1,22 1,23 2,24 11,25 5,28 1,29 2,32 19,34 2,35 6.7,36 0.097,37 3,38 27,39 31.083,40 34.088,41 20.358,42 20.378,43 6.7,44 6.155}
{0 CHEMBL575258,1 7.312,2 45.5,3 45.5,4 0.998,5 1.116,6 0.674,7 0.641,8 241.31,9 3,10 12,11 33,13 13,14 19,16 34,17 15,20 13,21 2,22 1,24 15,25 3,28 1,29 2,32 18,35 6.1,36 0.118,37 4,38 26,39 32.942,40 36.824,41 22.245,42 21.139,44 5}
{0 CHEMBL575259,1 7.312,2 45.5,3 45.5,4 0.998,5 1.116,6 0.674,7 0.641,8 241.31,9 3,10 12,11 33,13 13,14 19,16 34,17 15,20 13,21 2,22 1,24 15,25 3,28 1,29 2,32 18,35 6.1,36 0.118,37 4,38 26,39 32.942,40 36.824,41 22.245,42 21.139,44 5}
{0 CHEMBL575482,1 7.719,2 48.4,3 41.9,4 1.002,5 1.11,6 0.693,7 0.665,8 239.29,9 3.2,10 12,11 31,13 13,14 20,16 33,17 15,20 13,21 2,22 1,24 13,25 3,28 1,29 2,32 18,35 6.5,36 0.03,37 1,38 27,39 31.058,40 34.408,41 21.483,42 20.612,44 5.635}
{0 CHEMBL583490,1 8.319,2 48.3,3 37.9,4 1.017,5 1.11,6 0.696,7 0.683,8 241.26,9 3.4,10 12,11 29,13 13,14 20,16 31,17 14,20 13,21 1,22 1,24 11,25 4,28 1,29 3,32 18,35 10.3,36 0.032,37 1,38 27,39 29.502,40 32.203,41 20.176,42 19.8,44 6.602}
{0 CHEMBL583967,1 7.784,2 45,3 42.5,4 1.012,5 1.116,6 0.673,7 0.652,8 311.36,9 2.5,10 12,11 40,13 13,14 26,16 43,17 18,20 13,21 5,22 1,24 17,25 5,28 1,29 4,32 23,35 10,36 0.07,37 3,38 33,39 40.48,40 44.658,41 26.915,42 26.095,44 6.678}
{0 CHEMBL584273,1 7.765,2 44.3,3 44.3,4 0.999,5 1.115,6 0.691,7 0.651,8 473.64,9 4.9,10 23,11 61,13 24,14 37,16 64,17 27,20 22,21 5,22 1,24 27,25 7,26 1,28 3,29 3,31 1,32 34,35 4.9,36 0.141,37 9,38 49.5,39 60.967,40 68.026,41 42.165,42 39.717,44 4.301}
{0 CHEMBL585365,1 7.312,2 45.5,3 45.5,4 0.998,5 1.116,6 0.674,7 0.641,8 241.31,9 3,10 12,11 33,13 13,14 19,16 34,17 15,20 13,21 2,22 1,24 15,25 3,28 1,29 2,32 18,35 6.1,36 0.088,37 3,38 26,39 32.942,40 36.824,41 22.245,42 21.139,44 5.347}
{0 CHEMBL586040,1 7.924,2 44.8,3 43.1,4 1.001,5 1.114,6 0.697,7 0.658,8 459.61,9 5.2,10 23,11 58,13 24,14 36,16 61,17 26,20 22,21 4,22 1,24 25,25 7,26 1,28 3,29 3,31 1,32 33,35 5.2,36 0.148,37 9,38 48.5,39 58.083,40 64.61,41 40.404,42 38.19,44 4.301}
{0 CHEMBL589311,1 6.393,2 32.6,3 54.7,4 1,5 1.145,6 0.602,7 0.563,8 549.8,9 5.8,11 86,13 5,14 41,16 88,17 28,20 5,21 23,22 5,24 47,25 11,28 5,29 6,32 39,35 7,36 0.068,37 6,38 46,39 86.028,40 98.467,41 51.745,42 48.459,44 8.347}
{0 CHEMBL589906,1 6.327,2 31.8,3 55.3,4 1,5 1.147,6 0.597,7 0.558,8 537.79,9 5.9,11 85,13 5,14 39,16 86,17 27,20 5,21 22,22 5,24 47,25 11,28 5,29 6,32 38,35 7.1,36 0.163,37 14,38 44,39 85.028,40 97.467,41 50.745,42 47.459,44 7.921}
{0 CHEMBL589918,1 6.335,2 32.6,3 55.1,4 0.999,5 1.145,6 0.601,7 0.562,8 563.83,9 5.6,11 89,13 5,14 42,16 91,17 29,20 5,21 24,22 5,24 49,25 11,28 5,29 6,32 40,35 6.7,36 0.066,37 6,38 47,39 88.912,40 101.882,41 53.506,42 49.985,44 8.301}
{0 CHEMBL592719,1 6.455,2 32.5,3 54.2,4 1.002,5 1.145,6 0.602,7 0.565,8 535.77,9 6,11 83,13 5,14 40,16 85,17 27,20 5,21 22,22 5,24 45,25 11,28 5,29 6,32 38,35 7.2,36 0.071,37 6,38 45,39 83.145,40 95.052,41 49.983,42 46.932,44 8.26}
{0 CHEMBL594544,1 7.749,2 38,3 44,4 1.019,5 1.144,6 0.644,7 0.628,8 387.46,9 10,10 12,11 50,13 14,14 30,16 52,17 19,20 13,21 6,22 2,23 1,24 22,25 9,28 5,29 3,32 28,34 1,35 6,36 0.115,37 6,38 38,39 50.956,40 57.196,41 32.182,42 31.376,43 2,44 6.684}
{0 CHEMBL598363,1 6.522,2 32.5,3 53.8,4 1.003,5 1.145,6 0.603,7 0.568,8 521.74,9 6.3,11 80,13 5,14 39,16 82,17 26,20 5,21 21,22 5,24 43,25 11,28 5,29 6,32 37,35 7.5,36 0.073,37 6,38 44,39 80.261,40 91.637,41 48.222,42 45.405,44 8.268}
{0 CHEMBL598797,1 7.492,2 41.4,3 44.8,4 1.008,5 1.128,6 0.659,7 0.633,8 434.54,9 6.9,10 17,11 58,13 19,14 34,16 60,17 24,19 2,20 15,21 7,22 1,24 26,25 8,28 4,29 4,32 32,33 1,35 6.9,36 0.183,37 11,38 45.5,39 58.436,40 65.398,41 38.216,42 36.74,44 7.879}
{0 CHEMBL609583,1 8.615,2 39.6,3 39.6,4 1.022,5 1.128,6 0.684,7 0.663,8 413.5,9 10.4,10 17,11 48,13 20,14 32,16 51,17 19,20 15,21 4,22 3,24 19,25 10,26 1,28 5,29 4,31 1,32 29,35 8.3,36 0.078,37 4,38 43.5,39 49.08,40 54.156,41 32.824,42 31.841,44 8.337}
{0 CHEMBL95553,1 8.71,2 40,3 40,4 1.028,5 1.122,6 0.682,7 0.662,8 348.41,9 5,10 12,11 40,13 16,14 25,16 41,17 16,20 15,21 1,22 4,24 16,25 8,26 1,28 2,29 5,31 1,32 24,35 12.5,36 0.146,37 6,38 35,39 41.102,40 44.87,41 27.261,42 26.492,44 5.301}
{0 CHEMBL96051,1 7.771,2 42.9,3 42.9,4 1.014,5 1.123,6 0.665,7 0.646,8 326.38,9 4.8,10 11,11 42,13 14,14 26,16 44,17 18,20 13,21 5,22 3,24 18,25 6,28 2,29 4,32 24,35 9.5,36 0.136,37 6,38 34.5,39 42.582,40 47.156,41 27.921,42 27.116,44 5.125}
{0 CHEMBL97108,1 8.157,2 39,3 43.9,4 1.016,5 1.124,6 0.672,7 0.642,8 334.43,9 4.9,10 12,11 41,13 15,14 24,16 42,17 16,20 13,21 3,22 3,24 18,25 7,26 1,28 2,29 4,31 1,32 23,35 9.8,36 0.143,37 6,38 33,39 41.658,40 46.076,41 27.568,42 26.304,44 4.602}
{0 CHEMBL97387,1 8.523,2 41,3 41,4 1.02,5 1.12,6 0.687,7 0.661,8 332.41,9 5.1,10 12,11 39,13 16,14 24,16 40,17 16,20 15,21 1,22 4,24 16,25 7,26 1,28 2,29 4,31 1,32 23,35 10.3,36 0.125,37 5,38 34,39 39.774,40 43.661,41 26.807,42 25.777,44 4.602}
{0 CHEMBL97632,1 7.713,2 38.3,3 46.8,4 1.009,5 1.126,6 0.662,7 0.625,8 362.49,9 4.3,10 12,11 47,13 15,14 26,16 48,17 18,20 13,21 5,22 3,24 22,25 7,26 1,28 2,29 4,31 1,32 25,35 8.5,36 0.146,37 7,38 35,39 47.425,40 52.906,41 31.091,42 29.357,44 4.602}
{0 CHEMBL97860,1 8.157,2 39,3 43.9,4 1.016,5 1.124,6 0.672,7 0.642,8 334.43,9 4.9,10 12,11 41,13 15,14 24,16 42,17 16,20 13,21 3,22 3,24 18,25 7,26 1,28 2,29 4,31 1,32 23,35 9.8,36 0.167,37 7,38 33,39 41.658,40 46.076,41 27.568,42 26.304,44 4.602}
{0 CHEMBL98,1 6.778,2 35.9,3 51.3,4 1.004,5 1.137,6 0.621,7 0.588,8 264.36,9 5.1,10 6,11 39,13 8,14 19,16 39,17 14,20 8,21 6,22 2,24 20,25 5,28 2,29 3,32 19,35 7.7,36 0.205,37 8,38 24,39 39.138,40 44.362,41 24.228,42 22.928,44 6.523}
{0 CHEMBL98345,1 9.136,2 40.6,3 37.5,4 1.031,5 1.12,6 0.696,7 0.679,8 292.34,9 6.3,10 12,11 32,13 15,14 21,16 33,17 13,20 13,22 3,24 12,25 7,26 1,28 2,29 4,31 1,32 20,35 12.5,36 0.121,37 4,38 30,39 33.007,40 35.83,41 22.284,42 21.723,44 5.301}
{0 CHEMBL98346,1 8.432,2 39.5,3 42.1,4 1.02,5 1.123,6 0.679,7 0.652,8 320.4,9 5.3,10 12,11 38,13 15,14 23,16 39,17 15,20 13,21 2,22 3,24 16,25 7,26 1,28 2,29 4,31 1,32 22,35 10.5,36 0.154,37 6,38 32,39 38.774,40 42.661,41 25.807,42 24.777,44 5.301}
{0 CHEMBL98669,1 8.601,2 38.6,3 40.9,4 1.03,5 1.125,6 0.67,7 0.653,8 378.44,9 4.5,10 12,11 44,13 16,14 27,16 45,17 17,20 15,21 2,22 4,24 18,25 9,26 1,28 2,29 6,31 1,32 26,35 13.6,36 0.156,37 7,38 37,39 45.313,40 49.495,41 29.477,42 28.733,44 6}
{0 CHEMBL99,1 6.873,2 38.6,3 50,4 1,5 1.131,6 0.636,7 0.601,8 302.41,9 4.5,10 6,11 44,13 10,14 22,16 44,17 17,20 12,21 5,22 4,24 22,25 5,28 2,29 3,32 22,35 6.8,36 0.136,37 6,38 29,39 44.022,40 49.777,41 27.989,42 26.455,44 7.538}
