{
  "data_set_description": {
    "collection_date": "November 2013",
    "creator": "Dr Jeremy Besnard, Dr Ivan Olier, Dr Noureddin Sadawi, Dr Larisa Soldatova, Dr Crina Grosan, Prof Ross King, Dr Richard Bickerton, Prof Andrew Hopkins and Dr Willem van Hoorn",
    "default_target_attribute": "pXC50",
    "description": "This dataset contains QSAR data (from ChEMBL version 17) showing activity values (unit is pseudo-pCI50) of several compounds on drug target ChEMBL_ID: CHEMBL5103 (TID: 10945), and it has 129 rows and 1289 features (not including molecule IDs and class feature: molecule_id and pXC50). The features represent Molecular Descriptors which were generated from SMILES strings. Missing value imputation was applied to this dataset (By choosing the Median).",
    "description_version": "1",
    "file_id": "3384237",
    "format": "ARFF",
    "id": "29143",
    "licence": "Public",
    "md5_checksum": "68f8ee28648930486026ca50dbb08d1f",
    "minio_url": "https://data.openml.org/datasets/0002/29143/dataset_29143.pq",
    "name": "QSAR-DATASET-FOR-DRUG-TARGET-CHEMBL5103",
    "original_data_url": "https://www.ebi.ac.uk/chembl/target/inspect/CHEMBL5103",
    "parquet_url": "https://data.openml.org/datasets/0002/29143/dataset_29143.pq",
    "processing_date": "2018-10-04 01:16:55",
    "row_id_attribute": "molecule_id",
    "status": "deactivated",
    "tag": [
      "MetaQSAR",
      "study_13"
    ],
    "upload_date": "2016-07-15T01:46:12",
    "url": "https://api.openml.org/data/v1/download/3384237/QSAR-DATASET-FOR-DRUG-TARGET-CHEMBL5103.arff",
    "version": "9",
    "visibility": "public"
  }
}