"molecule_id","AMW","C.","H.","Me","Mi","Mp","Mv","MW","N.","nAB","nAT","nB","nBM","nBO","nBR","nBT","nC","nCL","nCsp","nCsp2","nCsp3","nDB","nF","nH","nHet","nHM","nI","nN","nO","nP","nS","nSK","nTB","nX","O.","RBF","RBN","SCBO","Se","Si","Sp","Sv","X.","pXC50"
{1 8.181,2 39,3 44.1,4 1.004,5 1.125,6 0.692,7 0.647,8 482.69,9 10.2,10 16,11 59,13 19,14 35,16 61,17 23,19 2,20 14,21 7,22 2,24 26,25 10,26 2,28 6,29 2,31 2,32 33,33 1,35 3.4,36 0.131,37 8,38 47,39 59.254,40 66.401,41 40.853,42 38.2,44 9}
{0 CHEMBL1651723,1 7.791,2 41.8,3 43.8,4 1.002,5 1.125,6 0.683,7 0.647,8 1137.53,9 9.6,10 50,11 146,13 54,14 91,16 155,17 61,20 44,21 17,22 4,24 64,25 21,26 2,28 14,29 5,31 2,32 82,35 3.4,36 0.123,37 19,38 120,39 146.305,40 164.243,41 99.683,42 94.418,44 8}
{0 CHEMBL1651821,1 7.66,2 40.6,3 45,4 1.003,5 1.127,6 0.673,7 0.637,8 1225.65,9 8.8,10 50,11 160,13 54,14 97,16 169,17 65,20 44,21 21,22 4,24 72,25 23,26 2,28 14,29 7,31 2,32 88,35 4.4,36 0.148,37 25,38 126,39 160.494,40 180.323,41 107.637,42 101.955,44 7.125}
{0 CHEMBL1651822,1 7.603,2 40.1,3 45.5,4 1.004,5 1.128,6 0.668,7 0.633,8 1269.71,9 8.4,10 50,11 167,13 54,14 100,16 176,17 67,20 44,21 23,22 4,24 76,25 24,26 2,28 14,29 8,31 2,32 91,35 4.8,36 0.159,37 28,38 129,39 167.588,40 188.363,41 111.615,42 105.723,44 7.244}
{0 CHEMBL1651823,1 7.723,2 41.2,3 44.4,4 1.003,5 1.126,6 0.678,7 0.642,8 1181.59,9 9.2,10 50,11 153,13 54,14 94,16 162,17 63,20 44,21 19,22 4,24 68,25 22,26 2,28 14,29 6,31 2,32 85,35 3.9,36 0.136,37 22,38 123,39 153.399,40 172.283,41 103.66,42 98.186,44 7.569}
{0 CHEMBL1651824,1 7.66,2 40.6,3 45,4 1.003,5 1.127,6 0.673,7 0.637,8 1225.65,9 8.8,10 50,11 160,13 54,14 97,16 169,17 65,20 44,21 21,22 4,24 72,25 23,26 2,28 14,29 7,31 2,32 88,35 4.4,36 0.148,37 25,38 126,39 160.494,40 180.323,41 107.637,42 101.955,44 7.367}
{0 CHEMBL1651825,1 7.603,2 40.1,3 45.5,4 1.004,5 1.128,6 0.668,7 0.633,8 1269.71,9 8.4,10 50,11 167,13 54,14 100,16 176,17 67,20 44,21 23,22 4,24 76,25 24,26 2,28 14,29 8,31 2,32 91,35 4.8,36 0.159,37 28,38 129,39 167.588,40 188.363,41 111.615,42 105.723,44 7.215}
{0 CHEMBL1651826,1 7.55,2 39.7,3 46,4 1.004,5 1.129,6 0.664,7 0.629,8 1313.77,9 8,10 50,11 174,13 54,14 103,16 183,17 69,20 44,21 25,22 4,24 80,25 25,26 2,28 14,29 9,31 2,32 94,35 5.2,36 0.169,37 31,38 132,39 174.683,40 196.402,41 115.592,42 109.491,44 7.26}
{0 CHEMBL1651828,1 8.034,2 34.1,3 44.7,4 1.014,5 1.142,6 0.66,7 0.628,8 682.93,9 14.1,10 21,11 85,13 25,14 50,16 88,17 29,20 16,21 13,22 4,24 38,25 18,26 2,28 12,29 4,31 2,32 47,35 4.7,36 0.205,37 18,38 64.5,39 86.17,40 97.055,41 56.08,42 53.339,44 8.301}
{0 CHEMBL1651829,1 7.791,2 41.8,3 43.8,4 1.002,5 1.125,6 0.683,7 0.647,8 1137.53,9 9.6,10 50,11 146,13 54,14 91,16 155,17 61,20 44,21 17,22 4,24 64,25 21,26 2,28 14,29 5,31 2,32 82,35 3.4,36 0.123,37 19,38 120,39 146.305,40 164.243,41 99.683,42 94.418,44 7.62}
{0 CHEMBL1651830,1 7.723,2 41.2,3 44.4,4 1.003,5 1.126,6 0.678,7 0.642,8 1181.59,9 9.2,10 50,11 153,13 54,14 94,16 162,17 63,20 44,21 19,22 4,24 68,25 22,26 2,28 14,29 6,31 2,32 85,35 3.9,36 0.136,37 22,38 123,39 153.399,40 172.283,41 103.66,42 98.186,44 7.097}
{0 CHEMBL1651831,1 7.55,2 39.7,3 46,4 1.004,5 1.129,6 0.664,7 0.629,8 1313.77,9 8,10 50,11 174,13 54,14 103,16 183,17 69,20 44,21 25,22 4,24 80,25 25,26 2,28 14,29 9,31 2,32 94,35 5.2,36 0.169,37 31,38 132,39 174.683,40 196.402,41 115.592,42 109.491,44 7.409}
{0 CHEMBL211129,1 8.583,2 38.8,3 42.9,4 1.014,5 1.129,6 0.694,7 0.653,8 420.58,9 8.2,10 16,11 49,13 17,14 30,16 51,17 19,20 13,21 6,22 1,23 1,24 21,25 9,26 2,28 4,29 2,31 2,32 28,34 1,35 4.1,36 0.098,37 5,38 39,39 49.68,40 55.329,41 34.017,42 32.014,43 2,44 5.824}
{0 CHEMBL211405,1 8.216,2 38.8,3 44.9,4 1.003,5 1.122,6 0.696,7 0.646,8 402.59,9 8.2,10 16,11 49,13 17,14 29,16 51,17 19,20 13,21 6,22 1,24 22,25 8,26 2,28 4,29 2,31 2,32 27,35 4.1,36 0.098,37 5,38 38,39 49.167,40 54.989,41 34.08,42 31.631,44 6.523}
{0 CHEMBL211871,1 8.408,2 39.6,3 43.8,4 1.008,5 1.119,6 0.699,7 0.653,8 403.57,9 6.3,10 16,11 48,13 17,14 29,16 50,17 19,20 13,21 6,22 1,24 21,25 8,26 2,28 3,29 3,31 2,32 27,35 6.3,36 0.12,37 6,38 38,39 48.393,40 53.7,41 33.529,42 31.324,44 5.959}
{0 CHEMBL212815,1 8.679,2 40,3 42.2,4 1.01,5 1.127,6 0.707,7 0.662,8 390.55,9 8.9,10 16,11 45,13 17,14 28,16 47,17 18,20 13,21 5,22 1,23 1,24 19,25 8,26 2,28 4,29 1,31 2,32 26,34 1,35 2.2,36 0.085,37 4,38 37,39 45.469,40 50.704,41 31.801,42 29.772,43 2.2,44 5.921}
{0 CHEMBL245663,1 7.01,2 41.6,3 48.1,4 0.995,5 1.127,6 0.657,7 0.619,8 539.74,9 6.5,10 23,11 77,13 25,14 43,16 80,17 32,20 22,21 10,22 2,24 37,25 8,28 5,29 3,32 40,35 3.9,36 0.15,37 12,38 56.5,39 76.629,40 86.763,41 50.574,42 47.68,44 5.638}
{0 CHEMBL246321,1 7.01,2 41.6,3 48.1,4 0.995,5 1.127,6 0.657,7 0.619,8 539.74,9 6.5,10 23,11 77,13 25,14 43,16 80,17 32,20 22,21 10,22 2,24 37,25 8,28 5,29 3,32 40,35 3.9,36 0.15,37 12,38 56.5,39 76.629,40 86.763,41 50.574,42 47.68,44 7.699}
{0 CHEMBL247504,1 7.115,2 40.8,3 47.4,4 0.998,5 1.13,6 0.656,7 0.621,8 540.73,9 7.9,10 23,11 76,13 25,14 43,16 79,17 31,20 22,21 9,22 2,24 36,25 9,28 6,29 3,32 40,35 3.9,36 0.152,37 12,38 56.5,39 75.847,40 85.846,41 49.819,42 47.175,44 4}
{0 CHEMBL247700,1 7.022,2 40.5,3 48.1,4 0.997,5 1.13,6 0.653,7 0.616,8 554.76,9 7.6,10 23,11 79,13 25,14 44,16 82,17 32,20 22,21 10,22 2,24 38,25 9,28 6,29 3,32 41,35 3.8,36 0.159,37 13,38 57.5,39 78.73,40 89.261,41 51.58,42 48.702,44 6.77}
{0 CHEMBL247945,1 7.528,2 46.9,3 43.2,4 0.997,5 1.115,6 0.689,7 0.656,8 609.78,9 6.2,10 34,11 81,13 36,14 51,16 86,17 38,20 32,21 6,22 2,24 35,25 8,28 5,29 3,32 46,35 3.7,36 0.105,37 9,38 70,39 80.745,40 90.348,41 55.813,42 53.153,44 6.301}
{0 CHEMBL269261,1 6.713,2 39.6,3 50.5,4 0.992,5 1.131,6 0.644,7 0.602,8 610.88,9 6.6,10 23,11 91,13 25,14 48,16 94,17 36,20 22,21 14,22 2,24 46,25 9,28 6,29 3,32 45,35 3.3,36 0.16,37 15,38 61.5,39 90.265,40 102.922,41 58.626,42 54.809,44 4.917}
{0 CHEMBL377399,1 8.012,2 38.5,3 46.2,4 1.001,5 1.123,6 0.689,7 0.638,8 416.62,9 7.7,10 16,11 52,13 17,14 30,16 54,17 20,20 13,21 7,22 1,24 24,25 8,26 2,28 4,29 2,31 2,32 28,35 3.8,36 0.093,37 5,38 39,39 52.051,40 58.404,41 35.841,42 33.157,44 6.097}
{0 CHEMBL377769,1 8.163,2 37.7,3 45.3,4 1.007,5 1.125,6 0.685,7 0.639,8 432.62,9 7.5,10 16,11 53,13 17,14 31,16 55,17 20,20 13,21 7,22 1,24 24,25 9,26 2,28 4,29 3,31 2,32 29,35 5.7,36 0.109,37 6,38 40,39 53.378,40 59.613,41 36.296,42 33.872,44 6.097}
{0 CHEMBL378091,1 8.447,2 39.1,3 43.5,4 1.006,5 1.121,6 0.703,7 0.654,8 388.56,9 8.7,10 16,11 46,13 17,14 28,16 48,17 18,20 13,21 5,22 1,24 20,25 8,26 2,28 4,29 2,31 2,32 26,35 4.3,36 0.083,37 4,38 37,39 46.283,40 51.574,41 32.318,42 30.104,44 5.721}
{0 CHEMBL393847,1 6.807,2 41.8,3 49.4,4 0.99,5 1.126,6 0.657,7 0.614,8 537.77,9 6.3,10 23,11 79,13 25,14 43,16 82,17 33,20 22,21 11,22 2,24 39,25 7,28 5,29 2,32 40,35 2.5,36 0.159,37 13,38 56.5,39 78.185,40 88.969,41 51.881,42 48.492,44 6.721}
{0 CHEMBL397316,1 7.01,2 41.6,3 48.1,4 0.995,5 1.127,6 0.657,7 0.619,8 539.74,9 6.5,10 23,11 77,13 25,14 43,16 80,17 32,20 22,21 10,22 2,24 37,25 8,28 5,29 3,32 40,35 3.9,36 0.15,37 12,38 56.5,39 76.629,40 86.763,41 50.574,42 47.68,44 6.602}
{0 CHEMBL429108,1 6.804,2 42.5,3 49.3,4 0.989,5 1.124,6 0.659,7 0.616,8 496.71,9 5.5,10 23,11 73,13 24,14 40,16 76,17 31,20 21,21 10,22 1,24 36,25 6,28 4,29 2,32 37,35 2.7,36 0.145,37 11,38 52.5,39 72.199,40 82.055,41 48.114,42 44.944,44 7.097}
{0 CHEMBL438685,1 7.207,2 42.3,3 46.5,4 0.998,5 1.126,6 0.663,7 0.629,8 511.68,9 7,10 23,11 71,13 25,14 41,16 74,17 30,20 22,21 8,22 2,24 33,25 8,28 5,29 3,32 38,35 4.2,36 0.135,37 10,38 54.5,39 70.861,40 79.933,41 47.052,42 44.627,44 4}
{0 CHEMBL439392,1 6.936,2 40.2,3 48.8,4 0.995,5 1.13,6 0.651,7 0.613,8 568.79,9 7.3,10 23,11 82,13 25,14 45,16 85,17 33,20 22,21 11,22 2,24 40,25 9,28 6,29 3,32 42,35 3.7,36 0.165,37 14,38 58.5,39 81.614,40 92.676,41 53.341,42 50.228,44 6.824}
{0 CHEMBL474041,1 7.15,2 48,3 46,4 0.99,5 1.11,6 0.686,7 0.645,8 357.48,9 2,10 18,11 50,13 19,14 30,16 53,17 24,20 19,21 5,22 1,24 23,25 3,28 1,29 2,32 27,35 4,36 0.094,37 5,38 40,39 49.476,40 55.484,41 34.29,42 32.246,44 5.717}
