{
  "data_features": {
    "feature": [
      {
        "data_type": "nominal",
        "index": "0",
        "is_ignore": "false",
        "is_row_identifier": "true",
        "is_target": "false",
        "name": "molecule_id",
        "nominal_value": [
          "CHEMBL190258",
          "CHEMBL191634",
          "CHEMBL192017",
          "CHEMBL192043",
          "CHEMBL192342",
          "CHEMBL192938",
          "CHEMBL193131",
          "CHEMBL193356",
          "CHEMBL193619",
          "CHEMBL193722",
          "CHEMBL199439",
          "CHEMBL199653",
          "CHEMBL200107",
          "CHEMBL200262",
          "CHEMBL202878",
          "CHEMBL291727",
          "CHEMBL292224",
          "CHEMBL294192",
          "CHEMBL298547",
          "CHEMBL298852",
          "CHEMBL299491",
          "CHEMBL299988",
          "CHEMBL300755",
          "CHEMBL301065",
          "CHEMBL301244",
          "CHEMBL301572",
          "CHEMBL301954",
          "CHEMBL363145",
          "CHEMBL363434",
          "CHEMBL373332",
          "CHEMBL412889",
          "CHEMBL416301",
          "CHEMBL417549",
          "CHEMBL425896",
          "CHEMBL431735",
          "CHEMBL433833",
          "CHEMBL434978",
          "CHEMBL52251",
          "CHEMBL52761",
          "CHEMBL53982",
          "CHEMBL54004",
          "CHEMBL54344",
          "CHEMBL54480",
          "CHEMBL54537",
          "CHEMBL54747",
          "CHEMBL55140",
          "CHEMBL55264",
          "CHEMBL55359",
          "CHEMBL55371",
          "CHEMBL55464",
          "CHEMBL55810",
          "CHEMBL55837",
          "CHEMBL55856",
          "CHEMBL55886",
          "CHEMBL55988",
          "CHEMBL56011",
          "CHEMBL56028",
          "CHEMBL56073",
          "CHEMBL56253",
          "CHEMBL56254",
          "CHEMBL56255",
          "CHEMBL58830",
          "CHEMBL834",
          "CHEMBL870",
          "CHEMBL923",
          "CHEMBL924"
        ],
        "number_of_missing_values": "0"
      },
      {
        "data_type": "numeric",
        "index": "1",
        "is_ignore": "false",
        "is_row_identifier": "false",
        "is_target": "false",
        "name": "N.",
        "number_of_missing_values": "0"
      },
      {
        "data_type": "numeric",
        "index": "2",
        "is_ignore": "false",
        "is_row_identifier": "false",
        "is_target": "false",
        "name": "nN",
        "number_of_missing_values": "0"
      },
      {
        "data_type": "numeric",
        "index": "3",
        "is_ignore": "false",
        "is_row_identifier": "false",
        "is_target": "false",
        "name": "nHet",
        "number_of_missing_values": "0"
      },
      {
        "data_type": "numeric",
        "index": "4",
        "is_ignore": "false",
        "is_row_identifier": "false",
        "is_target": "false",
        "name": "AMW",
        "number_of_missing_values": "0"
      },
      {
        "data_type": "numeric",
        "index": "5",
        "is_ignore": "false",
        "is_row_identifier": "false",
        "is_target": "false",
        "name": "C.",
        "number_of_missing_values": "0"
      },
      {
        "data_type": "numeric",
        "index": "6",
        "is_ignore": "false",
        "is_row_identifier": "false",
        "is_target": "false",
        "name": "H.",
        "number_of_missing_values": "0"
      },
      {
        "data_type": "numeric",
        "index": "7",
        "is_ignore": "false",
        "is_row_identifier": "false",
        "is_target": "false",
        "name": "Me",
        "number_of_missing_values": "0"
      },
      {
        "data_type": "numeric",
        "index": "8",
        "is_ignore": "false",
        "is_row_identifier": "false",
        "is_target": "false",
        "name": "Mi",
        "number_of_missing_values": "0"
      },
      {
        "data_type": "numeric",
        "index": "9",
        "is_ignore": "false",
        "is_row_identifier": "false",
        "is_target": "false",
        "name": "Mp",
        "number_of_missing_values": "0"
      },
      {
        "data_type": "numeric",
        "index": "10",
        "is_ignore": "false",
        "is_row_identifier": "false",
        "is_target": "false",
        "name": "Mv",
        "number_of_missing_values": "0"
      },
      {
        "data_type": "numeric",
        "index": "11",
        "is_ignore": "false",
        "is_row_identifier": "false",
        "is_target": "false",
        "name": "MW",
        "number_of_missing_values": "0"
      },
      {
        "data_type": "numeric",
        "index": "12",
        "is_ignore": "false",
        "is_row_identifier": "false",
        "is_target": "true",
        "name": "pXC50",
        "number_of_missing_values": "0"
      }
    ]
  }
}