{
  "data_features": {
    "feature": [
      {
        "data_type": "nominal",
        "index": "0",
        "is_ignore": "false",
        "is_row_identifier": "true",
        "is_target": "false",
        "name": "molecule_id",
        "nominal_value": [
          "CHEMBL10",
          "CHEMBL101253",
          "CHEMBL103667",
          "CHEMBL105442",
          "CHEMBL1173655",
          "CHEMBL119385",
          "CHEMBL1230020",
          "CHEMBL1236107",
          "CHEMBL1240703",
          "CHEMBL1241674",
          "CHEMBL124660",
          "CHEMBL1287853",
          "CHEMBL1289926",
          "CHEMBL1336",
          "CHEMBL1421",
          "CHEMBL14762",
          "CHEMBL1614701",
          "CHEMBL1615182",
          "CHEMBL162",
          "CHEMBL1721885",
          "CHEMBL178737",
          "CHEMBL1789941",
          "CHEMBL180022",
          "CHEMBL186290",
          "CHEMBL1908391",
          "CHEMBL1908392",
          "CHEMBL1908393",
          "CHEMBL1908394",
          "CHEMBL1908395",
          "CHEMBL1908396",
          "CHEMBL1908397",
          "CHEMBL191003",
          "CHEMBL202625",
          "CHEMBL202730",
          "CHEMBL203214",
          "CHEMBL203619",
          "CHEMBL203791",
          "CHEMBL204061",
          "CHEMBL204063",
          "CHEMBL204139",
          "CHEMBL204158",
          "CHEMBL204170",
          "CHEMBL204966",
          "CHEMBL206233",
          "CHEMBL215152",
          "CHEMBL2177136",
          "CHEMBL2180266",
          "CHEMBL2180267",
          "CHEMBL2180268",
          "CHEMBL2180269",
          "CHEMBL2180270",
          "CHEMBL2180271",
          "CHEMBL2180272",
          "CHEMBL2180273",
          "CHEMBL2180274",
          "CHEMBL2180275",
          "CHEMBL2180276",
          "CHEMBL2180277",
          "CHEMBL2180278",
          "CHEMBL2180279",
          "CHEMBL2180280",
          "CHEMBL2180281",
          "CHEMBL2180282",
          "CHEMBL2180283",
          "CHEMBL2180284",
          "CHEMBL2180285",
          "CHEMBL2180286",
          "CHEMBL2180287",
          "CHEMBL2180288",
          "CHEMBL2180289",
          "CHEMBL2180290",
          "CHEMBL2180608",
          "CHEMBL2180609",
          "CHEMBL2180610",
          "CHEMBL2180611",
          "CHEMBL2180612",
          "CHEMBL2180613",
          "CHEMBL2180614",
          "CHEMBL2180615",
          "CHEMBL2180616",
          "CHEMBL2180617",
          "CHEMBL2180618",
          "CHEMBL221959",
          "CHEMBL223360",
          "CHEMBL230011",
          "CHEMBL2309006",
          "CHEMBL2309609",
          "CHEMBL24828",
          "CHEMBL249697",
          "CHEMBL255863",
          "CHEMBL259084",
          "CHEMBL261454",
          "CHEMBL261849",
          "CHEMBL278041",
          "CHEMBL288441",
          "CHEMBL296468",
          "CHEMBL300138",
          "CHEMBL307152",
          "CHEMBL31965",
          "CHEMBL362558",
          "CHEMBL362588",
          "CHEMBL362814",
          "CHEMBL363058",
          "CHEMBL377300",
          "CHEMBL377711",
          "CHEMBL377717",
          "CHEMBL378167",
          "CHEMBL379218",
          "CHEMBL381532",
          "CHEMBL382838",
          "CHEMBL384304",
          "CHEMBL386051",
          "CHEMBL427211",
          "CHEMBL428690",
          "CHEMBL440084",
          "CHEMBL441176",
          "CHEMBL445813",
          "CHEMBL450786",
          "CHEMBL464552",
          "CHEMBL475251",
          "CHEMBL477772",
          "CHEMBL483321",
          "CHEMBL491473",
          "CHEMBL494089",
          "CHEMBL496862",
          "CHEMBL509032",
          "CHEMBL513909",
          "CHEMBL521851",
          "CHEMBL522892",
          "CHEMBL525191",
          "CHEMBL535",
          "CHEMBL553",
          "CHEMBL554",
          "CHEMBL558752",
          "CHEMBL572878",
          "CHEMBL572881",
          "CHEMBL573339",
          "CHEMBL574738",
          "CHEMBL576982",
          "CHEMBL601719",
          "CHEMBL607707",
          "CHEMBL608154",
          "CHEMBL91829",
          "CHEMBL939",
          "CHEMBL941"
        ],
        "number_of_missing_values": "0"
      },
      {
        "data_type": "numeric",
        "index": "1",
        "is_ignore": "false",
        "is_row_identifier": "false",
        "is_target": "false",
        "name": "nN",
        "number_of_missing_values": "0"
      },
      {
        "data_type": "numeric",
        "index": "2",
        "is_ignore": "false",
        "is_row_identifier": "false",
        "is_target": "false",
        "name": "N.",
        "number_of_missing_values": "0"
      },
      {
        "data_type": "numeric",
        "index": "3",
        "is_ignore": "false",
        "is_row_identifier": "false",
        "is_target": "true",
        "name": "pXC50",
        "number_of_missing_values": "0"
      }
    ]
  }
}