"molecule_id","FCFP4_1024b265","FCFP4_1024b737","FCFP4_1024b875","FCFP4_1024b632","FCFP4_1024b781","FCFP4_1024b585","FCFP4_1024b947","FCFP4_1024b537","FCFP4_1024b971","FCFP4_1024b911","FCFP4_1024b680","FCFP4_1024b521","FCFP4_1024b983","FCFP4_1024b702","FCFP4_1024b65","FCFP4_1024b957","FCFP4_1024b826","FCFP4_1024b556","FCFP4_1024b18","FCFP4_1024b846","FCFP4_1024b661","FCFP4_1024b289","FCFP4_1024b6","FCFP4_1024b870","FCFP4_1024b178","FCFP4_1024b9","FCFP4_1024b698","FCFP4_1024b541","FCFP4_1024b730","FCFP4_1024b888","FCFP4_1024b4","FCFP4_1024b365","FCFP4_1024b376","FCFP4_1024b514","FCFP4_1024b100","FCFP4_1024b75","FCFP4_1024b118","FCFP4_1024b353","FCFP4_1024b558","FCFP4_1024b745","FCFP4_1024b829","FCFP4_1024b909","FCFP4_1024b363","FCFP4_1024b940","FCFP4_1024b986","FCFP4_1024b891","FCFP4_1024b271","FCFP4_1024b108","FCFP4_1024b603","FCFP4_1024b145","FCFP4_1024b409","pXC50"
{1 1,2 1,3 1,4 1,5 1,6 1,7 1,8 1,9 1,10 1,11 1,12 1,13 1,14 1,15 1,16 1,17 1,18 1,19 1,20 1,31 1,33 1,46 1,48 1,49 1,50 1,52 6.77}
{0 CHEMBL115432,1 1,2 1,3 1,4 1,5 1,6 1,7 1,8 1,9 1,10 1,11 1,12 1,13 1,14 1,15 1,16 1,17 1,18 1,19 1,31 1,33 1,52 6}
{0 CHEMBL115462,1 1,2 1,3 1,4 1,5 1,6 1,7 1,8 1,9 1,10 1,11 1,12 1,13 1,14 1,15 1,16 1,17 1,18 1,19 1,20 1,31 1,33 1,52 6.032}
{0 CHEMBL115534,1 1,2 1,3 1,4 1,5 1,6 1,7 1,8 1,9 1,10 1,11 1,12 1,13 1,14 1,15 1,16 1,17 1,18 1,19 1,20 1,31 1,33 1,52 6}
{0 CHEMBL115637,1 1,2 1,3 1,4 1,5 1,6 1,7 1,8 1,9 1,10 1,11 1,12 1,13 1,14 1,15 1,16 1,17 1,18 1,19 1,20 1,31 1,33 1,46 1,48 1,49 1,50 1,52 7.102}
{0 CHEMBL115742,1 1,2 1,3 1,4 1,5 1,6 1,7 1,8 1,9 1,10 1,11 1,12 1,13 1,14 1,15 1,16 1,17 1,18 1,19 1,20 1,31 1,33 1,52 6.815}
{0 CHEMBL115815,1 1,2 1,3 1,4 1,5 1,6 1,7 1,8 1,9 1,10 1,11 1,12 1,13 1,14 1,15 1,16 1,17 1,18 1,19 1,20 1,31 1,33 1,52 6}
{0 CHEMBL115960,1 1,2 1,3 1,4 1,5 1,6 1,7 1,8 1,9 1,10 1,11 1,12 1,13 1,14 1,15 1,16 1,17 1,18 1,19 1,20 1,31 1,33 1,44 1,46 1,48 1,49 1,50 1,52 6.377}
{0 CHEMBL115966,1 1,2 1,3 1,4 1,5 1,6 1,7 1,8 1,9 1,10 1,11 1,12 1,13 1,14 1,15 1,16 1,17 1,18 1,19 1,20 1,31 1,33 1,43 1,46 1,48 1,49 1,50 1,52 6}
{0 CHEMBL115971,1 1,2 1,3 1,4 1,5 1,6 1,7 1,8 1,9 1,10 1,11 1,12 1,13 1,14 1,15 1,16 1,17 1,18 1,19 1,20 1,31 1,33 1,46 1,48 1,49 1,50 1,52 7.041}
{0 CHEMBL115981,1 1,2 1,3 1,4 1,5 1,6 1,7 1,8 1,9 1,10 1,11 1,12 1,13 1,14 1,15 1,16 1,17 1,18 1,19 1,20 1,31 1,33 1,52 6}
{0 CHEMBL116070,1 1,2 1,3 1,4 1,5 1,6 1,7 1,8 1,9 1,10 1,11 1,12 1,13 1,14 1,15 1,16 1,17 1,18 1,19 1,20 1,31 1,33 1,52 7.509}
{0 CHEMBL116089,1 1,2 1,3 1,4 1,5 1,6 1,7 1,8 1,9 1,10 1,11 1,12 1,13 1,14 1,15 1,16 1,17 1,18 1,19 1,20 1,31 1,33 1,52 7}
{0 CHEMBL116152,1 1,2 1,3 1,4 1,5 1,6 1,7 1,8 1,9 1,10 1,11 1,12 1,13 1,14 1,15 1,16 1,17 1,18 1,19 1,20 1,31 1,33 1,52 8}
{0 CHEMBL116307,1 1,2 1,3 1,4 1,5 1,6 1,7 1,8 1,9 1,10 1,11 1,12 1,13 1,14 1,15 1,16 1,17 1,18 1,19 1,20 1,31 1,33 1,52 6}
{0 CHEMBL116363,1 1,2 1,3 1,4 1,5 1,6 1,7 1,8 1,9 1,10 1,11 1,12 1,13 1,14 1,15 1,16 1,17 1,18 1,19 1,20 1,31 1,33 1,46 1,48 1,49 1,50 1,52 6}
{0 CHEMBL116454,1 1,2 1,3 1,4 1,5 1,6 1,7 1,8 1,9 1,10 1,11 1,12 1,13 1,14 1,15 1,16 1,17 1,18 1,19 1,20 1,31 1,33 1,46 1,48 1,49 1,50 1,52 6}
{0 CHEMBL116958,1 1,2 1,3 1,4 1,5 1,6 1,7 1,8 1,9 1,10 1,11 1,12 1,13 1,14 1,15 1,16 1,17 1,18 1,19 1,20 1,31 1,33 1,46 1,48 1,49 1,50 1,52 6}
{0 CHEMBL117093,1 1,2 1,3 1,4 1,5 1,6 1,7 1,8 1,9 1,10 1,11 1,12 1,13 1,14 1,15 1,16 1,17 1,18 1,19 1,20 1,31 1,33 1,46 1,48 1,49 1,50 1,52 6}
{0 CHEMBL117198,1 1,2 1,3 1,4 1,5 1,6 1,7 1,8 1,9 1,10 1,11 1,12 1,13 1,14 1,15 1,16 1,17 1,18 1,19 1,20 1,31 1,33 1,52 7.071}
{0 CHEMBL117279,1 1,2 1,3 1,4 1,5 1,6 1,7 1,8 1,9 1,10 1,11 1,12 1,13 1,14 1,15 1,16 1,17 1,18 1,19 1,20 1,31 1,33 1,46 1,48 1,49 1,50 1,52 7.699}
{0 CHEMBL117292,1 1,2 1,3 1,4 1,5 1,6 1,7 1,8 1,9 1,10 1,11 1,12 1,13 1,14 1,15 1,16 1,17 1,18 1,19 1,20 1,31 1,33 1,46 1,48 1,49 1,50 1,52 6}
{0 CHEMBL117367,1 1,2 1,3 1,4 1,5 1,6 1,7 1,8 1,9 1,10 1,11 1,12 1,13 1,14 1,15 1,16 1,17 1,18 1,19 1,20 1,31 1,33 1,52 6}
{0 CHEMBL117452,1 1,2 1,3 1,4 1,5 1,6 1,7 1,8 1,9 1,10 1,11 1,12 1,13 1,14 1,15 1,16 1,17 1,18 1,19 1,20 1,31 1,33 1,46 1,48 1,49 1,50 1,52 6}
{0 CHEMBL117453,1 1,2 1,3 1,4 1,5 1,6 1,7 1,8 1,9 1,10 1,11 1,12 1,13 1,14 1,15 1,16 1,17 1,18 1,19 1,20 1,31 1,33 1,52 4.959}
{0 CHEMBL117565,1 1,2 1,3 1,4 1,5 1,6 1,7 1,8 1,9 1,10 1,11 1,12 1,13 1,14 1,15 1,16 1,17 1,18 1,19 1,20 1,31 1,33 1,46 1,48 1,49 1,50 1,52 6}
{0 CHEMBL117571,1 1,2 1,3 1,4 1,5 1,6 1,7 1,8 1,9 1,10 1,11 1,12 1,13 1,14 1,15 1,16 1,17 1,18 1,19 1,20 1,31 1,33 1,35 1,44 1,52 5.398}
{0 CHEMBL117668,1 1,2 1,3 1,4 1,5 1,6 1,7 1,8 1,9 1,10 1,11 1,12 1,13 1,14 1,15 1,16 1,17 1,18 1,19 1,20 1,31 1,33 1,52 6}
{0 CHEMBL117671,1 1,2 1,3 1,4 1,5 1,6 1,7 1,8 1,9 1,10 1,11 1,12 1,13 1,14 1,15 1,16 1,17 1,18 1,19 1,20 1,31 1,33 1,49 1,52 6}
{0 CHEMBL117746,1 1,2 1,3 1,4 1,5 1,6 1,7 1,8 1,9 1,10 1,11 1,12 1,13 1,14 1,15 1,16 1,17 1,18 1,19 1,20 1,31 1,33 1,52 6}
{0 CHEMBL117894,1 1,2 1,3 1,4 1,5 1,6 1,7 1,8 1,9 1,10 1,11 1,12 1,13 1,14 1,15 1,16 1,17 1,18 1,19 1,20 1,31 1,33 1,46 1,48 1,49 1,50 1,52 8.222}
{0 CHEMBL117936,1 1,2 1,3 1,4 1,5 1,6 1,7 1,8 1,9 1,10 1,11 1,12 1,13 1,14 1,15 1,16 1,17 1,18 1,19 1,20 1,31 1,33 1,52 7.194}
{0 CHEMBL118022,1 1,2 1,3 1,4 1,5 1,6 1,7 1,8 1,9 1,10 1,11 1,12 1,13 1,14 1,15 1,16 1,17 1,18 1,19 1,20 1,31 1,33 1,43 1,52 6.719}
{0 CHEMBL118034,1 1,2 1,3 1,4 1,5 1,6 1,7 1,8 1,9 1,10 1,11 1,12 1,13 1,14 1,15 1,16 1,17 1,18 1,19 1,20 1,31 1,33 1,46 1,48 1,49 1,50 1,52 6}
{0 CHEMBL118074,1 1,2 1,3 1,4 1,5 1,6 1,7 1,8 1,9 1,10 1,11 1,12 1,13 1,14 1,15 1,16 1,17 1,18 1,19 1,20 1,31 1,33 1,46 1,48 1,49 1,50 1,52 6.35}
{0 CHEMBL118089,1 1,2 1,3 1,4 1,5 1,6 1,7 1,8 1,9 1,10 1,11 1,12 1,13 1,14 1,15 1,16 1,17 1,18 1,19 1,20 1,31 1,33 1,44 1,46 1,48 1,49 1,50 1,52 7.131}
{0 CHEMBL118113,1 1,2 1,3 1,4 1,5 1,6 1,7 1,8 1,9 1,10 1,11 1,12 1,13 1,14 1,15 1,16 1,17 1,18 1,19 1,20 1,31 1,33 1,52 6}
{0 CHEMBL118114,1 1,2 1,3 1,4 1,5 1,6 1,7 1,8 1,9 1,10 1,11 1,12 1,13 1,14 1,15 1,16 1,17 1,18 1,19 1,20 1,31 1,33 1,49 1,52 6}
{0 CHEMBL118299,1 1,2 1,3 1,4 1,5 1,6 1,7 1,8 1,9 1,10 1,11 1,12 1,13 1,14 1,15 1,16 1,17 1,18 1,19 1,20 1,31 1,33 1,46 1,48 1,49 1,50 1,52 6}
{0 CHEMBL118300,1 1,2 1,3 1,4 1,5 1,6 1,7 1,8 1,9 1,10 1,11 1,12 1,13 1,14 1,15 1,16 1,17 1,18 1,19 1,20 1,31 1,33 1,46 1,47 1,48 1,49 1,50 1,52 6.432}
{0 CHEMBL118358,1 1,2 1,3 1,4 1,5 1,6 1,7 1,8 1,9 1,10 1,11 1,12 1,13 1,14 1,15 1,16 1,17 1,18 1,19 1,20 1,31 1,33 1,46 1,48 1,49 1,50 1,52 6}
{0 CHEMBL118518,1 1,2 1,3 1,4 1,5 1,6 1,7 1,8 1,9 1,10 1,11 1,12 1,13 1,14 1,15 1,16 1,17 1,18 1,19 1,20 1,31 1,33 1,52 5.409}
{0 CHEMBL118886,1 1,2 1,3 1,4 1,5 1,6 1,7 1,8 1,9 1,10 1,11 1,12 1,13 1,14 1,15 1,16 1,17 1,18 1,19 1,20 1,31 1,33 1,52 6}
{0 CHEMBL119039,1 1,2 1,3 1,4 1,5 1,6 1,7 1,8 1,9 1,10 1,11 1,12 1,13 1,14 1,15 1,16 1,17 1,18 1,19 1,20 1,31 1,33 1,42 1,46 1,48 1,49 1,50 1,52 8.301}
{0 CHEMBL119091,1 1,2 1,3 1,4 1,5 1,6 1,7 1,8 1,9 1,10 1,11 1,12 1,13 1,14 1,15 1,16 1,17 1,18 1,19 1,20 1,31 1,33 1,46 1,49 1,52 6}
{0 CHEMBL119183,1 1,2 1,3 1,4 1,5 1,6 1,7 1,8 1,9 1,10 1,11 1,12 1,13 1,14 1,15 1,16 1,17 1,18 1,19 1,20 1,31 1,33 1,52 7.638}
{0 CHEMBL119335,1 1,2 1,3 1,4 1,5 1,6 1,7 1,8 1,9 1,10 1,11 1,12 1,13 1,14 1,15 1,16 1,17 1,18 1,19 1,20 1,31 1,33 1,46 1,48 1,49 1,50 1,52 6}
{0 CHEMBL119348,1 1,2 1,3 1,4 1,5 1,6 1,7 1,8 1,9 1,10 1,11 1,12 1,13 1,14 1,15 1,16 1,17 1,18 1,19 1,20 1,31 1,33 1,46 1,48 1,49 1,50 1,52 6}
{0 CHEMBL119501,1 1,2 1,3 1,4 1,5 1,6 1,7 1,8 1,9 1,10 1,11 1,12 1,13 1,14 1,15 1,16 1,17 1,18 1,19 1,20 1,31 1,33 1,46 1,48 1,49 1,50 1,52 6}
{0 CHEMBL119522,1 1,2 1,3 1,4 1,5 1,6 1,7 1,8 1,9 1,10 1,11 1,12 1,13 1,14 1,15 1,16 1,17 1,18 1,19 1,20 1,31 1,33 1,48 1,49 1,52 6}
{0 CHEMBL119523,1 1,2 1,3 1,4 1,5 1,6 1,7 1,8 1,9 1,10 1,11 1,12 1,13 1,14 1,15 1,16 1,17 1,18 1,19 1,20 1,31 1,33 1,46 1,49 1,52 6.056}
{0 CHEMBL119532,1 1,2 1,3 1,4 1,5 1,6 1,7 1,8 1,9 1,10 1,11 1,12 1,13 1,14 1,15 1,16 1,17 1,18 1,19 1,20 1,31 1,33 1,47 1,52 6}
{0 CHEMBL119599,1 1,2 1,3 1,4 1,5 1,6 1,7 1,8 1,9 1,10 1,11 1,12 1,13 1,14 1,15 1,16 1,17 1,18 1,19 1,31 1,33 1,52 6.481}
{0 CHEMBL119705,1 1,2 1,3 1,4 1,5 1,6 1,7 1,8 1,9 1,10 1,11 1,12 1,13 1,14 1,15 1,16 1,17 1,18 1,19 1,20 1,31 1,33 1,46 1,48 1,49 1,50 1,52 6.62}
{0 CHEMBL119711,1 1,2 1,3 1,4 1,5 1,6 1,7 1,8 1,9 1,10 1,11 1,12 1,13 1,14 1,15 1,16 1,17 1,18 1,19 1,20 1,31 1,33 1,46 1,48 1,49 1,50 1,52 6}
{0 CHEMBL119732,1 1,2 1,3 1,4 1,5 1,6 1,7 1,8 1,9 1,10 1,11 1,12 1,13 1,14 1,15 1,16 1,17 1,18 1,19 1,20 1,31 1,32 1,33 1,52 6.854}
{0 CHEMBL119733,1 1,2 1,3 1,4 1,5 1,6 1,7 1,8 1,9 1,10 1,11 1,12 1,13 1,14 1,15 1,16 1,17 1,18 1,19 1,20 1,31 1,33 1,52 8.222}
{0 CHEMBL119815,1 1,2 1,3 1,4 1,5 1,6 1,7 1,8 1,9 1,10 1,11 1,12 1,13 1,14 1,15 1,16 1,17 1,18 1,19 1,20 1,31 1,33 1,52 6}
{0 CHEMBL119861,1 1,2 1,3 1,4 1,5 1,6 1,7 1,8 1,9 1,10 1,11 1,12 1,13 1,14 1,15 1,16 1,17 1,18 1,19 1,20 1,31 1,32 1,33 1,52 6.398}
{0 CHEMBL119886,1 1,2 1,3 1,4 1,5 1,6 1,7 1,8 1,9 1,10 1,11 1,12 1,13 1,14 1,15 1,16 1,17 1,18 1,19 1,20 1,31 1,33 1,46 1,49 1,52 6}
{0 CHEMBL119901,1 1,2 1,3 1,4 1,5 1,6 1,7 1,8 1,9 1,10 1,11 1,12 1,13 1,14 1,15 1,16 1,17 1,18 1,19 1,31 1,33 1,52 6}
{0 CHEMBL262570,1 1,2 1,3 1,4 1,5 1,6 1,7 1,8 1,9 1,10 1,12 1,13 1,15 1,16 1,17 1,18 1,19 1,20 1,33 1,52 6}
{0 CHEMBL263080,1 1,2 1,3 1,4 1,5 1,6 1,7 1,8 1,9 1,10 1,11 1,12 1,13 1,14 1,16 1,17 1,18 1,19 1,27 1,31 1,33 1,52 4.187}
{0 CHEMBL263081,1 1,2 1,3 1,4 1,5 1,6 1,7 1,8 1,9 1,10 1,11 1,12 1,13 1,14 1,15 1,16 1,17 1,18 1,19 1,20 1,31 1,33 1,47 1,52 6.699}
{0 CHEMBL266064,12 1,13 1,17 1,18 1,19 1,51 1,52 4.77}
{0 CHEMBL266197,1 1,2 1,3 1,4 1,5 1,6 1,7 1,8 1,9 1,10 1,12 1,13 1,15 1,16 1,17 1,18 1,19 1,20 1,33 1,52 5.638}
{0 CHEMBL266198,1 1,2 1,3 1,4 1,5 1,6 1,7 1,8 1,9 1,10 1,11 1,12 1,13 1,14 1,15 1,16 1,17 1,18 1,19 1,20 1,31 1,33 1,52 5.398}
{0 CHEMBL266429,1 1,2 1,3 1,4 1,5 1,6 1,7 1,8 1,9 1,10 1,11 1,12 1,13 1,14 1,15 1,16 1,17 1,18 1,19 1,20 1,31 1,33 1,52 4.721}
{0 CHEMBL266460,1 1,2 1,3 1,4 1,5 1,6 1,7 1,8 1,9 1,10 1,12 1,13 1,15 1,16 1,17 1,18 1,19 1,20 1,31 1,33 1,52 5.398}
{0 CHEMBL266572,1 1,2 1,3 1,4 1,6 1,7 1,8 1,9 1,10 1,12 1,13 1,15 1,16 1,19 1,20 1,33 1,52 5.678}
{0 CHEMBL266708,1 1,2 1,3 1,4 1,5 1,6 1,7 1,8 1,9 1,10 1,12 1,13 1,15 1,16 1,17 1,18 1,19 1,20 1,33 1,52 5.398}
{0 CHEMBL266798,4 1,5 1,7 1,9 1,11 1,12 1,13 1,14 1,15 1,16 1,17 1,18 1,19 1,20 1,27 1,31 1,33 1,52 5.398}
{0 CHEMBL266799,9 1,12 1,13 1,16 1,17 1,18 1,19 1,27 1,51 1,52 4.409}
{0 CHEMBL267125,1 1,2 1,3 1,4 1,5 1,6 1,7 1,8 1,9 1,10 1,11 1,12 1,13 1,14 1,15 1,16 1,17 1,18 1,19 1,20 1,31 1,33 1,52 6}
{0 CHEMBL267127,12 1,13 1,16 1,17 1,18 1,19 1,51 1,52 5.456}
{0 CHEMBL267456,1 1,2 1,3 1,4 1,5 1,6 1,7 1,8 1,9 1,10 1,11 1,12 1,13 1,14 1,15 1,16 1,17 1,18 1,19 1,20 1,31 1,33 1,52 5.398}
{0 CHEMBL267678,1 1,2 1,3 1,4 1,5 1,6 1,7 1,8 1,9 1,10 1,11 1,12 1,13 1,14 1,15 1,16 1,17 1,18 1,19 1,20 1,31 1,33 1,52 4.427}
{0 CHEMBL267914,7 1,9 1,11 1,12 1,13 1,14 1,15 1,16 1,17 1,18 1,19 1,20 1,29 1,31 1,33 1,51 1,52 4.824}
{0 CHEMBL267938,1 1,2 1,3 1,4 1,5 1,6 1,7 1,8 1,9 1,10 1,11 1,12 1,13 1,14 1,16 1,17 1,18 1,19 1,31 1,33 1,52 6}
{0 CHEMBL268070,1 1,2 1,3 1,4 1,5 1,6 1,7 1,8 1,9 1,10 1,11 1,12 1,13 1,14 1,16 1,17 1,18 1,19 1,31 1,33 1,52 5}
{0 CHEMBL268099,1 1,2 1,3 1,4 1,5 1,6 1,7 1,8 1,9 1,11 1,12 1,13 1,14 1,17 1,18 1,19 1,31 1,33 1,52 6}
{0 CHEMBL268530,1 1,2 1,3 1,4 1,5 1,6 1,7 1,8 1,9 1,10 1,12 1,13 1,15 1,16 1,17 1,18 1,19 1,20 1,31 1,33 1,43 1,52 5.398}
{0 CHEMBL268567,1 1,2 1,3 1,4 1,5 1,6 1,7 1,8 1,9 1,10 1,11 1,12 1,13 1,14 1,15 1,16 1,17 1,18 1,19 1,20 1,31 1,33 1,52 5.398}
{0 CHEMBL268667,1 1,2 1,3 1,4 1,5 1,6 1,7 1,8 1,9 1,11 1,12 1,13 1,14 1,17 1,18 1,19 1,31 1,33 1,52 5.398}
{0 CHEMBL269056,12 1,13 1,17 1,18 1,19 1,51 1,52 4.745}
{0 CHEMBL269075,1 1,2 1,3 1,4 1,5 1,6 1,7 1,8 1,9 1,10 1,11 1,12 1,13 1,14 1,15 1,16 1,17 1,18 1,19 1,20 1,27 1,31 1,33 1,52 4.678}
{0 CHEMBL269495,12 1,13 1,17 1,18 1,19 1,31 1,51 1,52 4.721}
{0 CHEMBL269497,1 1,2 1,3 1,4 1,5 1,6 1,7 1,8 1,9 1,10 1,11 1,12 1,13 1,14 1,15 1,16 1,17 1,18 1,19 1,20 1,31 1,33 1,52 5.398}
{0 CHEMBL269570,1 1,2 1,3 1,4 1,5 1,6 1,7 1,8 1,9 1,11 1,12 1,13 1,14 1,17 1,18 1,19 1,31 1,33 1,52 6}
{0 CHEMBL269598,1 1,2 1,3 1,4 1,5 1,6 1,7 1,8 1,9 1,10 1,11 1,12 1,13 1,14 1,15 1,16 1,17 1,18 1,19 1,20 1,30 1,31 1,33 1,52 4.337}
{0 CHEMBL292178,21 1,22 1,23 1,24 1,25 1,26 1,28 1,32 1,34 1,42 1,45 1,52 5.097}
{0 CHEMBL292463,21 1,22 1,23 1,24 1,25 1,26 1,28 1,32 1,52 5}
{0 CHEMBL297482,21 1,22 1,23 1,24 1,25 1,26 1,28 1,31 1,32 1,34 1,42 1,49 1,52 4.824}
{0 CHEMBL297719,21 1,22 1,23 1,24 1,25 1,26 1,28 1,31 1,32 1,34 1,42 1,52 4.721}
{0 CHEMBL297905,21 1,22 1,23 1,24 1,25 1,26 1,28 1,32 1,34 1,42 1,52 5.155}
{0 CHEMBL298770,21 1,22 1,23 1,24 1,25 1,26 1,28 1,32 1,34 1,42 1,52 5.097}
{0 CHEMBL298775,21 1,22 1,23 1,24 1,25 1,26 1,28 1,32 1,34 1,42 1,52 5.398}
{0 CHEMBL298885,21 1,22 1,23 1,24 1,25 1,26 1,28 1,32 1,34 1,42 1,52 4.824}
{0 CHEMBL299985,21 1,22 1,23 1,24 1,25 1,26 1,28 1,32 1,34 1,42 1,52 5}
{0 CHEMBL300007,21 1,22 1,23 1,24 1,25 1,26 1,28 1,32 1,34 1,42 1,52 5}
{0 CHEMBL300266,21 1,22 1,23 1,24 1,25 1,26 1,28 1,32 1,34 1,42 1,52 5.222}
{0 CHEMBL301606,21 1,22 1,23 1,24 1,25 1,26 1,28 1,32 1,42 1,52 4.699}
{0 CHEMBL312723,25 1,27 1,29 1,30 1,33 1,35 1,36 1,37 1,38 1,39 1,40 1,41 1,43 1,44 1,45 1,47 1,52 4.398}
{0 CHEMBL313325,29 1,33 1,35 1,36 1,37 1,39 1,41 1,43 1,44 1,45 1,47 1,52 4.301}
{0 CHEMBL313781,27 1,29 1,30 1,33 1,34 1,35 1,36 1,37 1,38 1,39 1,40 1,41 1,43 1,44 1,45 1,47 1,52 4}
{0 CHEMBL313980,16 1,27 1,29 1,30 1,33 1,35 1,36 1,37 1,38 1,39 1,40 1,41 1,43 1,44 1,45 1,47 1,52 4.432}
{0 CHEMBL315487,4 1,27 1,29 1,30 1,31 1,33 1,35 1,36 1,37 1,38 1,39 1,40 1,41 1,43 1,44 1,45 1,47 1,52 5.097}
{0 CHEMBL315559,19 1,27 1,29 1,30 1,33 1,35 1,36 1,37 1,38 1,39 1,40 1,41 1,43 1,44 1,45 1,47 1,52 5.046}
{0 CHEMBL323832,1 1,2 1,3 1,4 1,5 1,6 1,7 1,8 1,9 1,10 1,11 1,12 1,13 1,14 1,15 1,16 1,17 1,18 1,19 1,20 1,31 1,33 1,52 6}
{0 CHEMBL324133,1 1,2 1,3 1,4 1,5 1,6 1,7 1,8 1,9 1,10 1,12 1,13 1,15 1,16 1,17 1,18 1,19 1,20 1,33 1,52 6.886}
{0 CHEMBL324158,1 1,2 1,3 1,4 1,5 1,6 1,7 1,8 1,9 1,10 1,11 1,12 1,13 1,14 1,15 1,16 1,17 1,18 1,19 1,20 1,31 1,33 1,52 7}
{0 CHEMBL324824,1 1,2 1,3 1,4 1,5 1,6 1,7 1,8 1,9 1,10 1,11 1,12 1,13 1,14 1,15 1,16 1,17 1,18 1,19 1,20 1,31 1,33 1,46 1,48 1,49 1,50 1,52 6.328}
{0 CHEMBL325033,1 1,2 1,3 1,4 1,5 1,6 1,7 1,8 1,9 1,10 1,11 1,12 1,13 1,14 1,15 1,16 1,17 1,18 1,19 1,20 1,31 1,33 1,46 1,48 1,49 1,50 1,52 6}
{0 CHEMBL325184,1 1,2 1,3 1,4 1,5 1,6 1,7 1,8 1,9 1,10 1,11 1,12 1,13 1,14 1,15 1,16 1,17 1,18 1,19 1,20 1,31 1,33 1,46 1,48 1,49 1,50 1,52 7.721}
{0 CHEMBL325286,1 1,2 1,3 1,4 1,5 1,6 1,7 1,8 1,9 1,10 1,11 1,12 1,13 1,14 1,15 1,16 1,17 1,18 1,19 1,31 1,33 1,52 6.108}
{0 CHEMBL325618,1 1,2 1,3 1,4 1,5 1,6 1,7 1,8 1,9 1,10 1,11 1,12 1,13 1,14 1,15 1,16 1,17 1,18 1,19 1,20 1,31 1,33 1,46 1,48 1,49 1,50 1,52 6}
{0 CHEMBL325651,1 1,2 1,3 1,4 1,5 1,6 1,7 1,8 1,9 1,10 1,11 1,12 1,13 1,14 1,15 1,16 1,17 1,18 1,19 1,20 1,31 1,33 1,48 1,49 1,52 6}
{0 CHEMBL325893,1 1,2 1,3 1,4 1,5 1,6 1,7 1,8 1,9 1,10 1,11 1,12 1,13 1,14 1,15 1,16 1,17 1,18 1,19 1,20 1,31 1,33 1,52 6.071}
{0 CHEMBL326120,1 1,2 1,3 1,4 1,5 1,6 1,7 1,8 1,9 1,10 1,11 1,12 1,13 1,14 1,15 1,16 1,17 1,18 1,19 1,20 1,31 1,33 1,52 7.77}
{0 CHEMBL326271,1 1,2 1,3 1,4 1,5 1,6 1,7 1,8 1,9 1,10 1,11 1,12 1,13 1,14 1,15 1,16 1,17 1,18 1,19 1,20 1,31 1,33 1,46 1,48 1,49 1,50 1,52 6}
{0 CHEMBL326360,1 1,2 1,3 1,4 1,5 1,6 1,7 1,8 1,9 1,10 1,11 1,12 1,13 1,14 1,15 1,16 1,17 1,18 1,19 1,20 1,31 1,33 1,49 1,52 6}
{0 CHEMBL326712,1 1,2 1,3 1,4 1,5 1,6 1,7 1,8 1,9 1,10 1,11 1,12 1,13 1,14 1,15 1,16 1,17 1,18 1,19 1,20 1,31 1,33 1,46 1,48 1,49 1,50 1,52 6}
{0 CHEMBL326771,1 1,2 1,3 1,4 1,5 1,6 1,7 1,8 1,9 1,10 1,11 1,12 1,13 1,14 1,15 1,16 1,17 1,18 1,19 1,20 1,31 1,33 1,46 1,48 1,49 1,50 1,52 7.62}
{0 CHEMBL331055,1 1,2 1,3 1,4 1,5 1,6 1,7 1,8 1,9 1,10 1,11 1,12 1,13 1,14 1,15 1,16 1,17 1,18 1,19 1,20 1,31 1,33 1,46 1,48 1,49 1,50 1,52 6.745}
{0 CHEMBL331248,1 1,2 1,3 1,4 1,5 1,6 1,7 1,8 1,9 1,10 1,11 1,12 1,13 1,14 1,16 1,17 1,18 1,19 1,20 1,31 1,33 1,52 6}
{0 CHEMBL331584,1 1,2 1,3 1,4 1,5 1,6 1,7 1,8 1,9 1,10 1,11 1,12 1,13 1,14 1,15 1,16 1,17 1,18 1,19 1,20 1,31 1,33 1,46 1,48 1,49 1,50 1,52 6}
{0 CHEMBL331662,1 1,2 1,3 1,4 1,5 1,6 1,7 1,8 1,9 1,10 1,11 1,12 1,13 1,14 1,15 1,16 1,17 1,18 1,19 1,20 1,31 1,33 1,52 6}
{0 CHEMBL419046,1 1,2 1,3 1,4 1,5 1,6 1,7 1,8 1,9 1,10 1,11 1,12 1,13 1,14 1,15 1,16 1,17 1,18 1,19 1,20 1,31 1,33 1,37 1,45 1,48 1,52 6.854}
{0 CHEMBL419854,25 1,27 1,29 1,30 1,31 1,33 1,35 1,36 1,37 1,38 1,39 1,40 1,41 1,43 1,44 1,45 1,47 1,52 4.523}
{0 CHEMBL421231,1 1,2 1,3 1,4 1,5 1,6 1,7 1,8 1,9 1,10 1,11 1,12 1,13 1,14 1,15 1,16 1,17 1,18 1,19 1,20 1,31 1,33 1,48 1,49 1,52 6}
{0 CHEMBL428508,1 1,2 1,3 1,4 1,5 1,6 1,7 1,8 1,9 1,10 1,11 1,12 1,13 1,14 1,15 1,16 1,17 1,18 1,19 1,20 1,31 1,33 1,46 1,49 1,52 5.398}
{0 CHEMBL434222,1 1,2 1,3 1,4 1,5 1,6 1,7 1,8 1,9 1,10 1,11 1,12 1,13 1,14 1,15 1,16 1,17 1,18 1,19 1,20 1,31 1,33 1,52 6}
{0 CHEMBL50404,21 1,22 1,23 1,24 1,25 1,26 1,28 1,31 1,32 1,34 1,42 1,48 1,49 1,52 4.959}
{0 CHEMBL51654,21 1,22 1,23 1,24 1,25 1,26 1,32 1,52 5.301}
{0 CHEMBL51663,21 1,22 1,23 1,24 1,25 1,26 1,28 1,31 1,32 1,34 1,42 1,52 4.398}
{0 CHEMBL51664,21 1,22 1,23 1,24 1,25 1,26 1,28 1,32 1,34 1,42 1,52 4.824}
{0 CHEMBL51974,21 1,22 1,23 1,24 1,25 1,26 1,28 1,32 1,34 1,42 1,52 5}
{0 CHEMBL52193,19 1,21 1,22 1,23 1,24 1,25 1,26 1,28 1,32 1,34 1,42 1,52 4.523}
{0 CHEMBL52632,19 1,21 1,22 1,23 1,24 1,25 1,26 1,28 1,32 1,34 1,42 1,52 5.155}
{0 CHEMBL52682,21 1,22 1,23 1,24 1,25 1,26 1,28 1,32 1,34 1,42 1,52 5.046}
{0 CHEMBL52706,21 1,22 1,23 1,24 1,25 1,26 1,28 1,32 1,52 4.77}
{0 CHEMBL52793,15 1,21 1,22 1,23 1,24 1,25 1,26 1,28 1,32 1,33 1,34 1,42 1,52 5.155}
{0 CHEMBL52795,21 1,22 1,23 1,24 1,25 1,26 1,28 1,32 1,34 1,42 1,52 5}
{0 CHEMBL52799,21 1,22 1,23 1,24 1,25 1,26 1,28 1,32 1,34 1,42 1,52 5.301}
{0 CHEMBL52855,21 1,22 1,23 1,24 1,25 1,26 1,28 1,31 1,32 1,34 1,42 1,43 1,49 1,52 4.745}
{0 CHEMBL53082,21 1,22 1,23 1,24 1,25 1,26 1,28 1,32 1,34 1,42 1,52 5.301}
{0 CHEMBL53269,21 1,22 1,23 1,24 1,25 1,26 1,28 1,32 1,34 1,42 1,52 5.523}
{0 CHEMBL53270,21 1,22 1,23 1,24 1,25 1,26 1,28 1,32 1,34 1,42 1,52 4.824}
{0 CHEMBL53475,3 1,21 1,22 1,23 1,24 1,25 1,26 1,28 1,32 1,36 1,52 5.301}
{0 CHEMBL54162,21 1,22 1,23 1,24 1,25 1,26 1,28 1,32 1,34 1,42 1,52 4.959}
{0 CHEMBL608,27 1,29 1,30 1,33 1,35 1,36 1,37 1,38 1,40 1,44 1,47 1,52 4.301}
{0 CHEMBL6215,12 1,13 1,17 1,18 1,19 1,30 1,51 1,52 4}
{0 CHEMBL6229,12 1,13 1,16 1,17 1,18 1,19 1,31 1,51 1,52 5.602}
{0 CHEMBL6248,4 1,5 1,6 1,7 1,11 1,12 1,13 1,15 1,17 1,19 1,31 1,33 1,47 1,52 6.757}
{0 CHEMBL6249,1 1,2 1,3 1,4 1,5 1,6 1,7 1,8 1,9 1,10 1,12 1,13 1,15 1,16 1,17 1,18 1,19 1,20 1,33 1,52 5.456}
{0 CHEMBL6257,1 1,2 1,3 1,4 1,5 1,7 1,9 1,11 1,12 1,13 1,14 1,17 1,18 1,19 1,31 1,52 5.886}
{0 CHEMBL6258,1 1,2 1,3 1,4 1,5 1,6 1,7 1,8 1,9 1,10 1,12 1,13 1,14 1,15 1,16 1,17 1,18 1,19 1,20 1,33 1,52 5.398}
{0 CHEMBL6264,1 1,2 1,3 1,4 1,5 1,6 1,7 1,8 1,9 1,10 1,12 1,13 1,15 1,16 1,17 1,18 1,19 1,20 1,31 1,33 1,52 6}
{0 CHEMBL6275,1 1,2 1,3 1,4 1,5 1,6 1,7 1,8 1,9 1,10 1,11 1,12 1,13 1,14 1,16 1,17 1,18 1,19 1,20 1,31 1,33 1,52 5.398}
{0 CHEMBL6278,1 1,2 1,3 1,4 1,5 1,6 1,7 1,8 1,9 1,10 1,11 1,12 1,13 1,14 1,15 1,16 1,17 1,18 1,19 1,31 1,33 1,52 6}
{0 CHEMBL6316,1 1,2 1,3 1,4 1,5 1,6 1,7 1,8 1,9 1,10 1,12 1,13 1,15 1,16 1,17 1,18 1,19 1,20 1,33 1,52 5.398}
{0 CHEMBL6320,1 1,2 1,3 1,4 1,5 1,7 1,9 1,11 1,12 1,13 1,14 1,17 1,18 1,19 1,31 1,52 5.398}
{0 CHEMBL6324,1 1,2 1,3 1,4 1,5 1,6 1,7 1,8 1,9 1,10 1,12 1,13 1,15 1,16 1,17 1,18 1,19 1,20 1,33 1,52 5.398}
{0 CHEMBL6369,1 1,2 1,3 1,4 1,5 1,6 1,7 1,8 1,9 1,10 1,12 1,13 1,15 1,16 1,17 1,18 1,19 1,20 1,33 1,52 4.699}
{0 CHEMBL6370,1 1,2 1,3 1,4 1,5 1,6 1,7 1,8 1,9 1,10 1,12 1,13 1,15 1,16 1,17 1,18 1,19 1,20 1,21 1,33 1,52 4.824}
{0 CHEMBL6371,1 1,2 1,3 1,4 1,5 1,6 1,7 1,8 1,9 1,10 1,12 1,13 1,15 1,16 1,17 1,18 1,19 1,20 1,33 1,52 5.569}
{0 CHEMBL6381,1 1,2 1,3 1,4 1,5 1,6 1,7 1,8 1,9 1,10 1,12 1,13 1,15 1,16 1,17 1,18 1,19 1,20 1,33 1,52 5.398}
{0 CHEMBL6417,1 1,2 1,3 1,4 1,5 1,6 1,7 1,8 1,9 1,10 1,11 1,12 1,13 1,14 1,15 1,16 1,17 1,18 1,19 1,20 1,31 1,33 1,52 4}
{0 CHEMBL6430,12 1,13 1,17 1,18 1,19 1,31 1,43 1,51 1,52 4.229}
{0 CHEMBL6442,4 1,5 1,6 1,7 1,11 1,12 1,13 1,14 1,15 1,16 1,17 1,18 1,19 1,20 1,31 1,33 1,52 5}
{0 CHEMBL6517,1 1,2 1,3 1,4 1,5 1,6 1,7 1,8 1,9 1,10 1,12 1,13 1,15 1,16 1,17 1,18 1,19 1,20 1,33 1,52 5.398}
{0 CHEMBL6523,12 1,13 1,15 1,16 1,17 1,18 1,19 1,20 1,33 1,51 1,52 4.699}
{0 CHEMBL6534,1 1,2 1,3 1,4 1,5 1,6 1,7 1,8 1,9 1,10 1,11 1,12 1,13 1,14 1,15 1,16 1,17 1,18 1,19 1,20 1,31 1,33 1,52 5.398}
{0 CHEMBL6542,1 1,2 1,3 1,4 1,5 1,6 1,7 1,8 1,9 1,10 1,11 1,12 1,13 1,14 1,15 1,16 1,17 1,18 1,19 1,20 1,31 1,33 1,52 7}
{0 CHEMBL6612,1 1,2 1,3 1,4 1,5 1,6 1,7 1,8 1,9 1,10 1,11 1,12 1,13 1,14 1,15 1,16 1,17 1,18 1,19 1,20 1,31 1,33 1,52 6}
{0 CHEMBL6762,1 1,2 1,3 1,4 1,5 1,6 1,7 1,8 1,9 1,10 1,11 1,12 1,13 1,14 1,15 1,16 1,17 1,18 1,19 1,20 1,31 1,33 1,46 1,49 1,52 5.398}
{0 CHEMBL6830,1 1,2 1,3 1,4 1,5 1,6 1,7 1,8 1,9 1,10 1,11 1,12 1,13 1,14 1,15 1,16 1,17 1,18 1,19 1,31 1,33 1,52 6.114}
{0 CHEMBL82014,27 1,29 1,30 1,33 1,35 1,36 1,37 1,38 1,39 1,40 1,41 1,43 1,44 1,45 1,47 1,52 4.301}
{0 CHEMBL83010,27 1,29 1,30 1,33 1,35 1,36 1,37 1,38 1,39 1,40 1,41 1,43 1,44 1,45 1,47 1,50 1,52 4.77}
{0 CHEMBL83395,25 1,26 1,27 1,29 1,30 1,31 1,33 1,35 1,36 1,37 1,38 1,39 1,40 1,41 1,43 1,44 1,45 1,47 1,52 4.398}
{0 CHEMBL83626,27 1,29 1,30 1,33 1,35 1,36 1,37 1,38 1,39 1,40 1,41 1,43 1,44 1,45 1,47 1,52 5.222}
{0 CHEMBL84054,27 1,29 1,30 1,31 1,32 1,33 1,35 1,36 1,37 1,38 1,39 1,40 1,41 1,43 1,44 1,45 1,47 1,49 1,52 4.699}
{0 CHEMBL85477,19 1,25 1,26 1,27 1,29 1,30 1,31 1,33 1,35 1,36 1,37 1,38 1,39 1,40 1,41 1,43 1,44 1,45 1,47 1,52 4.26}
{0 CHEMBL85719,27 1,29 1,30 1,31 1,33 1,35 1,36 1,37 1,38 1,39 1,40 1,41 1,43 1,44 1,45 1,47 1,52 4.602}
{0 CHEMBL86083,27 1,29 1,30 1,31 1,33 1,35 1,36 1,37 1,38 1,39 1,40 1,41 1,43 1,44 1,45 1,47 1,52 4.523}
{0 CHEMBL87881,19 1,27 1,29 1,30 1,33 1,35 1,36 1,37 1,38 1,39 1,40 1,41 1,43 1,44 1,45 1,47 1,52 4.347}
