{
  "data_set_description": {
    "collection_date": "November 2013",
    "creator": "Dr Jeremy Besnard, Dr Ivan Olier, Dr Noureddin Sadawi, Dr Larisa Soldatova, Dr Crina Grosan, Prof Ross King, Dr Richard Bickerton, Prof Andrew Hopkins and Dr Willem van Hoorn",
    "default_target_attribute": "pXC50",
    "description": "This dataset contains QSAR data (from ChEMBL version 17) showing activity values (unit is pseudo-pCI50) of several compounds on drug target ChEMBL_ID: CHEMBL2689 (TID: 11379), and it has 429 rows and 1368 features (not including molecule IDs and class feature: molecule_id and pXC50). The features represent Molecular Descriptors which were generated from SMILES strings. Missing value imputation was applied to this dataset (By choosing the Median).",
    "description_version": "1",
    "file_id": "3380384",
    "format": "ARFF",
    "id": "29004",
    "licence": "Public",
    "md5_checksum": "47f7f5531455ea91e7d73dff6bb997cd",
    "minio_url": "https://data.openml.org/datasets/0002/29004/dataset_29004.pq",
    "name": "QSAR-DATASET-FOR-DRUG-TARGET-CHEMBL2689",
    "original_data_url": "https://www.ebi.ac.uk/chembl/target/inspect/CHEMBL2689",
    "parquet_url": "https://data.openml.org/datasets/0002/29004/dataset_29004.pq",
    "processing_date": "2018-10-04 01:25:06",
    "row_id_attribute": "molecule_id",
    "status": "deactivated",
    "tag": [
      "MetaQSAR",
      "study_13"
    ],
    "upload_date": "2016-07-15T01:25:52",
    "url": "https://api.openml.org/data/v1/download/3380384/QSAR-DATASET-FOR-DRUG-TARGET-CHEMBL2689.arff",
    "version": "8",
    "visibility": "public"
  }
}