{
  "data_set_description": {
    "collection_date": "November 2013",
    "creator": "Dr Jeremy Besnard, Dr Ivan Olier, Dr Noureddin Sadawi, Dr Larisa Soldatova, Dr Crina Grosan, Prof Ross King, Dr Richard Bickerton, Prof Andrew Hopkins and Dr Willem van Hoorn",
    "default_target_attribute": "pXC50",
    "description": "This dataset contains QSAR data (from ChEMBL version 17) showing activity values (unit is pseudo-pCI50) of several compounds on drug target ChEMBL_ID: CHEMBL5865 (TID: 101588), and it has 36 rows and 43 features (not including molecule IDs and class feature: molecule_id and pXC50). The features represent Basic Molecular Descriptors which were generated from SMILES strings.  Missing value imputation was applied to this dataset (By choosing the Median).",
    "description_version": "1",
    "file_id": "3377994",
    "format": "ARFF",
    "id": "28930",
    "licence": "Public",
    "md5_checksum": "da347227805700cace44a9b3530e75a8",
    "minio_url": "https://data.openml.org/datasets/0002/28930/dataset_28930.pq",
    "name": "QSAR-DATASET-FOR-DRUG-TARGET-CHEMBL5865",
    "original_data_url": "https://www.ebi.ac.uk/chembl/target/inspect/CHEMBL5865",
    "parquet_url": "https://data.openml.org/datasets/0002/28930/dataset_28930.pq",
    "processing_date": "2018-10-04 01:07:35",
    "row_id_attribute": "molecule_id",
    "status": "deactivated",
    "tag": [
      "MetaQSAR",
      "study_13"
    ],
    "upload_date": "2016-07-15T01:14:46",
    "url": "https://api.openml.org/data/v1/download/3377994/QSAR-DATASET-FOR-DRUG-TARGET-CHEMBL5865.arff",
    "version": "8",
    "visibility": "public"
  }
}