"molecule_id","AMW","C.","H.","Me","Mi","Mp","Mv","MW","N.","nAB","nAT","nB","nBM","nBO","nBR","nBT","nC","nCL","nCsp","nCsp2","nCsp3","nDB","nF","nH","nHet","nHM","nI","nN","nO","nP","nS","nSK","nTB","nX","O.","RBF","RBN","SCBO","Se","Si","Sp","Sv","X.","pXC50"
{1 6.451,2 34.9,3 53.5,4 0.995,5 1.141,6 0.617,7 0.576,8 277.41,9 7,10 6,11 43,13 8,14 20,16 43,17 15,20 8,21 7,22 2,24 23,25 5,28 3,29 2,32 20,35 4.7,36 0.163,37 7,38 25,39 42.796,40 49.066,41 26.54,42 24.762,44 5.056}
{0 CHEMBL11,1 6.232,2 42.2,3 53.3,4 0.976,5 1.124,6 0.653,7 0.596,8 280.45,9 4.4,10 12,11 45,13 12,14 23,16 47,17 19,20 12,21 7,24 24,25 2,28 2,32 21,36 0.085,37 4,38 29,39 43.923,40 50.564,41 29.387,42 26.838,44 4.796}
{0 CHEMBL110739,1 6.3,2 38.2,3 54.5,4 0.992,5 1.128,6 0.623,7 0.577,8 346.51,11 55,13 3,14 28,16 58,17 21,20 4,21 17,22 3,24 30,25 4,29 4,32 25,35 7.3,36 0.034,37 2,38 31,39 54.563,40 62.066,41 34.239,42 31.761,44 4.143}
{0 CHEMBL114,1 6.777,2 38.4,3 50.5,4 0.997,5 1.133,6 0.637,7 0.599,8 670.94,9 6.1,10 17,11 99,13 21,14 53,16 103,17 38,20 19,21 19,22 4,24 50,25 11,28 6,29 5,32 49,35 5.1,36 0.126,37 13,38 65.5,39 98.687,40 112.171,41 63.057,42 59.292,44 5.083}
{0 CHEMBL115,1 6.673,2 39.1,3 51.1,4 0.993,5 1.131,6 0.64,7 0.598,8 613.88,9 5.4,10 18,11 92,13 20,14 49,16 96,17 36,20 19,21 17,22 2,24 47,25 9,28 5,29 4,32 45,35 4.3,36 0.125,37 12,38 60,39 91.374,40 104.048,41 58.836,42 55.029,44 4.21}
{0 CHEMBL1159655,1 6.681,2 37.6,3 52.9,4 0.991,5 1.129,6 0.641,7 0.59,8 567.87,9 3.5,10 12,11 85,13 14,14 43,16 88,17 32,20 14,21 18,22 2,24 45,25 8,26 1,28 3,29 4,31 1,32 40,35 4.7,36 0.114,37 10,38 51,39 84.247,40 95.972,41 54.472,42 50.173,44 4.662}
{0 CHEMBL1197556,1 6.822,2 47.9,3 47.9,4 0.979,5 1.112,6 0.688,7 0.637,8 327.48,9 4.2,10 17,11 48,13 19,14 28,16 51,17 23,20 19,21 4,22 2,24 23,25 2,28 2,32 25,36 0.059,37 3,38 38.5,39 46.981,40 53.356,41 33.006,42 30.574,44 6.373}
{0 CHEMBL11978,1 7.565,2 38.9,3 44.4,4 1.01,5 1.136,6 0.653,7 0.63,8 136.17,9 11.1,10 6,11 18,13 7,14 10,16 18,17 7,20 6,21 1,22 1,24 8,25 3,28 2,29 1,32 10,35 5.6,36 0.056,37 1,38 14,39 18.182,40 20.452,41 11.75,42 11.338,44 3.685}
{0 CHEMBL1236196,1 4.576,2 30.2,3 67.9,4 0.963,5 1.146,6 0.572,7 0.495,8 242.53,9 1.9,11 53,14 16,16 52,17 16,21 16,24 36,25 1,28 1,32 17,36 0.231,37 12,38 16,39 51.065,40 60.764,41 30.33,42 26.24,44 5.313}
{0 CHEMBL134,1 10.005,2 39.1,3 39.1,4 1.021,5 1.132,6 0.73,7 0.688,8 230.11,9 13,10 6,11 23,13 7,14 15,16 24,17 9,18 2,20 7,21 2,22 1,24 9,25 5,26 2,28 3,32 14,34 2,36 0.083,37 2,38 19,39 23.487,40 26.044,41 16.779,42 15.826,43 8.7,44 5.854}
{0 CHEMBL1431,1 6.46,2 20,3 55,4 1.008,5 1.187,6 0.566,7 0.534,8 129.2,9 25,11 20,13 2,14 8,16 19,17 4,20 2,21 2,22 2,24 11,25 5,28 5,32 9,36 0.105,37 2,38 10,39 20.16,40 23.737,41 11.313,42 10.687,44 3.424}
{0 CHEMBL1687,1 7.091,2 43,3 47.7,4 0.999,5 1.12,6 0.658,7 0.623,8 609.8,9 2.3,10 24,11 86,13 24,14 51,16 92,17 37,20 24,21 13,24 41,25 8,28 2,29 6,32 45,35 7,36 0.022,37 2,38 63,39 85.898,40 96.349,41 56.586,42 53.604,44 5.538}
{0 CHEMBL170988,1 6.843,2 33.3,3 50,4 0.998,5 1.152,6 0.628,7 0.591,8 205.3,9 16.7,10 6,11 30,13 8,14 15,16 30,17 10,20 8,21 2,22 2,24 15,25 5,28 5,32 15,36 0.167,37 5,38 20,39 29.927,40 34.568,41 18.836,42 17.741,44 4.807}
{0 CHEMBL2074595,1 7.822,2 34.4,3 43.8,4 1.025,5 1.147,6 0.631,7 0.621,8 250.29,9 12.5,10 10,11 32,13 10,14 20,16 34,17 11,20 6,21 5,24 14,25 7,28 4,29 3,32 18,35 9.4,36 0.059,37 2,38 25,39 32.807,40 36.697,41 20.193,42 19.864,44 4.68}
{0 CHEMBL2074647,1 6.438,2 34.3,3 54.3,4 1.001,5 1.139,6 0.606,7 0.569,8 225.32,9 2.9,10 6,11 35,13 6,14 16,16 35,17 12,20 6,21 6,24 19,25 4,28 1,29 3,32 16,35 8.6,36 0.143,37 5,38 19,39 35.036,40 39.863,41 21.222,42 19.907,44 4.432}
{0 CHEMBL2074659,1 5.482,2 35.8,3 60.4,4 0.974,5 1.135,6 0.609,7 0.545,8 290.52,9 1.9,10 6,11 53,13 6,14 22,16 54,17 19,20 6,21 13,24 32,25 2,28 1,29 1,32 21,35 1.9,36 0.111,37 6,38 25,39 51.625,40 60.143,41 32.262,42 28.902,44 5.217}
{0 CHEMBL2074704,1 4.595,2 30.8,3 67.7,4 0.963,5 1.145,6 0.575,7 0.498,8 298.65,9 1.5,11 65,14 20,16 64,17 20,21 20,24 44,25 1,28 1,32 21,36 0.25,37 16,38 20,39 62.599,40 74.425,41 37.376,42 32.348,44 6.556}
{0 CHEMBL2074726,1 4.555,2 29.5,3 68.2,4 0.964,5 1.148,6 0.569,7 0.492,8 200.44,9 2.3,11 44,14 13,16 43,17 13,21 13,24 30,25 1,28 1,32 14,36 0.209,37 9,38 13,39 42.414,40 50.519,41 25.046,42 21.66,44 4.469}
{0 CHEMBL2074727,1 6.581,2 33.3,3 52.4,4 0.996,5 1.148,6 0.618,7 0.579,8 276.41,9 11.9,10 6,11 42,13 9,14 20,16 42,17 14,20 7,21 7,22 3,24 22,25 6,28 5,29 1,32 20,35 2.4,36 0.167,37 7,38 26,39 41.847,40 48.23,41 25.955,42 24.3,44 4.268}
{0 CHEMBL2074760,1 6.529,2 40.4,3 51.9,4 0.989,5 1.127,6 0.643,7 0.597,8 339.5,9 3.8,10 11,11 52,13 12,14 28,16 55,17 21,20 11,21 10,22 1,24 27,25 4,28 2,29 2,32 25,35 3.8,36 0.073,37 4,38 34.5,39 51.403,40 58.605,41 33.438,42 31.057,44 5.131}
{0 CHEMBL2074851,1 6.727,2 45.3,3 49.1,4 0.981,5 1.118,6 0.675,7 0.625,8 356.53,9 5.7,10 17,11 53,13 19,14 30,16 56,17 24,20 18,21 6,22 2,24 26,25 3,28 3,32 27,36 0.071,37 4,38 40.5,39 51.967,40 59.27,41 35.773,42 33.122,44 6.347}
{0 CHEMBL2074857,1 4.547,2 29.3,3 68.3,4 0.964,5 1.149,6 0.568,7 0.491,8 186.41,9 2.4,11 41,14 12,16 40,17 12,21 12,24 28,25 1,28 1,32 13,36 0.2,37 8,38 12,39 39.53,40 47.104,41 23.285,42 20.133,44 4.678}
{0 CHEMBL21578,1 6.76,2 41.7,3 50,4 0.991,5 1.125,6 0.652,7 0.61,8 324.46,9 4.2,10 11,11 48,13 12,14 27,16 51,17 20,20 11,21 9,22 1,24 24,25 4,28 2,29 2,32 24,35 4.2,36 0.078,37 4,38 33.5,39 47.578,40 53.983,41 31.296,42 29.267,44 4.866}
{0 CHEMBL2364536,1 6.529,2 40.4,3 51.9,4 0.989,5 1.127,6 0.643,7 0.597,8 339.5,9 3.8,10 11,11 52,13 12,14 28,16 55,17 21,20 11,21 10,22 1,24 27,25 4,28 2,29 2,32 25,35 3.8,36 0.073,37 4,38 34.5,39 51.403,40 58.605,41 33.438,42 31.057,44 4.766}
{0 CHEMBL3,1 6.241,2 38.5,3 53.8,4 0.981,5 1.134,6 0.638,7 0.585,8 162.26,9 7.7,10 6,11 26,13 6,14 13,16 27,17 10,20 5,21 5,24 14,25 2,28 2,32 12,36 0.037,37 1,38 16,39 25.505,40 29.488,41 16.58,42 15.204,44 4.192}
{0 CHEMBL30,1 7.648,2 30.3,3 48.5,4 1.003,5 1.151,6 0.651,7 0.605,8 252.39,9 18.2,10 5,11 33,13 7,14 17,16 33,17 10,19 1,20 4,21 5,22 1,24 16,25 7,26 1,28 6,31 1,32 17,33 1,36 0.212,37 7,38 22.5,39 33.105,40 37.986,41 21.489,42 19.95,44 5.244}
{0 CHEMBL301265,1 6.818,2 32.3,3 54.8,4 0.986,5 1.139,6 0.645,7 0.579,8 211.37,9 9.7,10 5,11 31,13 5,14 15,16 32,17 10,20 3,21 7,24 17,25 4,26 1,28 3,31 1,32 14,36 0.094,37 3,38 17.5,39 30.567,40 35.321,41 19.995,42 17.939,44 4.301}
{0 CHEMBL311617,1 6.81,2 48,3 48,4 0.978,5 1.111,6 0.688,7 0.637,8 170.25,9 4,10 12,11 25,13 12,14 14,16 26,17 12,20 11,21 1,24 12,25 1,28 1,32 13,36 0.038,37 1,38 20,39 24.462,40 27.782,41 17.193,42 15.919,44 5.027}
{0 CHEMBL339858,1 6.584,2 46.3,3 50,4 0.977,5 1.115,6 0.676,7 0.623,8 355.54,9 3.7,10 17,11 54,13 19,14 30,16 57,17 25,20 19,21 6,22 2,24 27,25 2,28 2,32 27,36 0.053,37 3,38 40.5,39 52.749,40 60.187,41 36.529,42 33.628,44 6.959}
{0 CHEMBL387326,1 6.76,2 41.7,3 50,4 0.991,5 1.125,6 0.652,7 0.61,8 324.46,9 4.2,10 11,11 48,13 12,14 27,16 51,17 20,20 11,21 9,22 1,24 24,25 4,28 2,29 2,32 24,35 4.2,36 0.078,37 4,38 33.5,39 47.578,40 53.983,41 31.296,42 29.267,44 5.387}
{0 CHEMBL39,1 7.05,2 40,3 48,4 0.998,5 1.131,6 0.651,7 0.616,8 176.24,9 8,10 10,11 25,13 10,14 14,16 26,17 10,20 8,21 2,24 12,25 3,28 2,29 1,32 13,35 4,36 0.077,37 2,38 19,39 24.949,40 28.282,41 16.273,42 15.392,44 4.425}
{0 CHEMBL39736,1 6.048,2 23.1,3 57.7,4 0.997,5 1.176,6 0.571,7 0.529,8 157.26,9 19.2,11 26,13 2,14 10,16 25,17 6,20 2,21 4,22 2,24 15,25 5,28 5,32 11,36 0.16,37 4,38 12,39 25.927,40 30.568,41 14.835,42 13.741,44 4.312}
{0 CHEMBL505,1 7.232,2 42.1,3 50,4 0.986,5 1.123,6 0.677,7 0.621,8 274.82,9 5.3,10 12,11 38,13 12,14 20,16 39,17 16,18 1,20 11,21 5,24 19,25 3,26 1,28 2,32 19,34 1,36 0.128,37 5,38 26,39 37.48,40 42.677,41 25.722,42 23.612,43 2.6,44 4.854}
{0 CHEMBL517,1 6.288,2 38.9,3 53.7,4 0.984,5 1.132,6 0.636,7 0.586,8 339.53,9 5.6,10 12,11 54,13 13,14 26,16 55,17 21,20 12,21 9,22 1,24 29,25 4,28 3,29 1,32 25,35 1.9,36 0.145,37 8,38 33,39 53.12,40 61.102,41 34.37,42 31.627,44 4.208}
{0 CHEMBL59,1 6.964,2 36.4,3 50,4 1.008,5 1.136,6 0.624,7 0.595,8 153.2,9 4.5,10 6,11 22,13 6,14 11,16 22,17 8,20 6,21 2,24 11,25 3,28 1,29 2,32 11,35 9.1,36 0.091,37 2,38 14,39 22.174,40 24.993,41 13.722,42 13.085,44 4.502}
{0 CHEMBL640,1 6.194,2 34.2,3 55.3,4 0.989,5 1.143,6 0.614,7 0.566,8 235.37,9 7.9,10 6,11 38,13 7,14 17,16 38,17 13,20 7,21 6,22 1,24 21,25 4,28 3,29 1,32 17,35 2.6,36 0.158,37 6,38 21,39 37.585,40 43.441,41 23.324,42 21.52,44 4.886}
{0 CHEMBL657,1 6.385,2 42.5,3 52.5,4 0.982,5 1.121,6 0.652,7 0.6,8 255.39,9 2.5,10 12,11 40,13 12,14 20,16 41,17 17,20 12,21 5,24 21,25 2,28 1,29 1,32 19,35 2.5,36 0.146,37 6,38 26,39 39.265,40 44.86,41 26.074,42 24.004,44 4.62}
{0 CHEMBL660,1 5.403,2 35.7,3 60.7,4 0.97,5 1.136,6 0.611,7 0.544,8 151.28,9 3.6,11 28,14 13,16 30,17 10,21 10,24 17,25 1,28 1,32 11,38 13,39 27.171,40 31.82,41 17.097,42 15.236,44 4.117}
{0 CHEMBL667,1 5.625,2 26.9,3 61.5,4 0.996,5 1.155,6 0.563,7 0.515,8 146.24,9 3.8,11 26,13 1,14 9,16 25,17 7,20 1,21 6,22 1,24 16,25 3,28 1,29 2,32 10,35 7.7,36 0.16,37 4,38 10,39 25.883,40 30.031,41 14.625,42 13.402,44 4.33}
{0 CHEMBL72,1 6.343,2 42.9,3 52.4,4 0.977,5 1.123,6 0.658,7 0.603,8 266.42,9 4.8,10 12,11 42,13 12,14 22,16 44,17 18,20 12,21 6,24 22,25 2,28 2,32 20,36 0.091,37 4,38 28,39 41.04,40 47.149,41 27.625,42 25.311,44 4.757}
{0 CHEMBL772,1 7.247,2 39.3,3 47.6,4 1.011,5 1.128,6 0.638,7 0.613,8 608.75,9 2.4,10 16,11 84,13 18,14 49,16 89,17 33,20 16,21 17,22 2,24 40,25 11,28 2,29 9,32 44,35 10.7,36 0.112,37 10,38 59,39 84.938,40 94.77,41 53.568,42 51.485,44 4.699}
{0 CHEMBL821,1 6.566,2 11.1,3 55.6,4 1.021,5 1.212,6 0.531,7 0.51,8 59.09,9 33.3,11 9,13 1,14 3,16 8,17 1,20 1,22 1,24 5,25 3,28 3,32 4,38 4,39 9.189,40 10.91,41 4.779,42 4.591,44 2.78}
{0 CHEMBL90,1 6.539,2 29.4,3 52.9,4 0.997,5 1.161,6 0.606,7 0.567,8 111.17,9 17.6,10 5,11 17,13 5,14 8,16 17,17 5,20 3,21 2,24 9,25 3,28 3,32 8,36 0.118,37 2,38 10.5,39 16.956,40 19.741,41 10.301,42 9.645,44 3.523}
{0 CHEMBL920,1 4.962,2 23.8,3 66.7,4 0.984,5 1.162,6 0.543,7 0.484,8 104.2,9 4.8,11 21,14 6,16 20,17 5,21 5,24 14,25 2,28 1,29 1,32 7,35 4.8,36 0.1,37 2,38 6,39 20.673,40 24.407,41 11.409,42 10.16,44 3.461}
{0 CHEMBL9324,1 4.493,2 27.6,3 69,4 0.965,5 1.153,6 0.56,7 0.484,8 130.29,9 3.4,11 29,14 8,16 28,17 8,21 8,24 20,25 1,28 1,32 9,36 0.143,37 4,38 8,39 27.996,40 33.443,41 16.239,42 14.026,44 4.355}
{0 CHEMBL945,1 9.985,2 26.1,3 34.8,4 1.054,5 1.176,6 0.657,7 0.662,8 229.66,9 30.4,10 6,11 23,13 8,14 15,16 23,17 6,18 1,20 6,22 2,24 8,25 9,26 1,28 7,29 1,32 15,34 1,35 4.3,36 0.087,37 2,38 20,39 24.247,40 27.057,41 15.114,42 15.219,43 4.3,44 5.161}
