{
  "data_features": {
    "feature": [
      {
        "data_type": "nominal",
        "index": "0",
        "is_ignore": "false",
        "is_row_identifier": "true",
        "is_target": "false",
        "name": "molecule_id",
        "nominal_value": [
          "CHEMBL11553",
          "CHEMBL116913",
          "CHEMBL120216",
          "CHEMBL144113",
          "CHEMBL146012",
          "CHEMBL146068",
          "CHEMBL146368",
          "CHEMBL147549",
          "CHEMBL147725",
          "CHEMBL147827",
          "CHEMBL148072",
          "CHEMBL148080",
          "CHEMBL149558",
          "CHEMBL150155",
          "CHEMBL150214",
          "CHEMBL155631",
          "CHEMBL155682",
          "CHEMBL155917",
          "CHEMBL156088",
          "CHEMBL156348",
          "CHEMBL156349",
          "CHEMBL156499",
          "CHEMBL156554",
          "CHEMBL156579",
          "CHEMBL156965",
          "CHEMBL156970",
          "CHEMBL156977",
          "CHEMBL157233",
          "CHEMBL157631",
          "CHEMBL157880",
          "CHEMBL158147",
          "CHEMBL158238",
          "CHEMBL160237",
          "CHEMBL160705",
          "CHEMBL164169",
          "CHEMBL164425",
          "CHEMBL1729",
          "CHEMBL18041",
          "CHEMBL180632",
          "CHEMBL18274",
          "CHEMBL18473",
          "CHEMBL186909",
          "CHEMBL18769",
          "CHEMBL18772",
          "CHEMBL19006",
          "CHEMBL19022",
          "CHEMBL19039",
          "CHEMBL1926686",
          "CHEMBL1926729",
          "CHEMBL1926730",
          "CHEMBL1926731",
          "CHEMBL1926732",
          "CHEMBL1926733",
          "CHEMBL1926734",
          "CHEMBL1926735",
          "CHEMBL1926744",
          "CHEMBL1926745",
          "CHEMBL1926746",
          "CHEMBL1926747",
          "CHEMBL1926748",
          "CHEMBL1926749",
          "CHEMBL1926750",
          "CHEMBL1926751",
          "CHEMBL1926753",
          "CHEMBL1926756",
          "CHEMBL1926757",
          "CHEMBL1926758",
          "CHEMBL1926759",
          "CHEMBL1926760",
          "CHEMBL199866",
          "CHEMBL201019",
          "CHEMBL201414",
          "CHEMBL201621",
          "CHEMBL201878",
          "CHEMBL201946",
          "CHEMBL202122",
          "CHEMBL202149",
          "CHEMBL202434",
          "CHEMBL202481",
          "CHEMBL2115017",
          "CHEMBL2152922",
          "CHEMBL2179582",
          "CHEMBL2179583",
          "CHEMBL262950",
          "CHEMBL275035",
          "CHEMBL275356",
          "CHEMBL275507",
          "CHEMBL277543",
          "CHEMBL27846",
          "CHEMBL27966",
          "CHEMBL279823",
          "CHEMBL279850",
          "CHEMBL283483",
          "CHEMBL28499",
          "CHEMBL285066",
          "CHEMBL286136",
          "CHEMBL287045",
          "CHEMBL288199",
          "CHEMBL289469",
          "CHEMBL28992",
          "CHEMBL295155",
          "CHEMBL295727",
          "CHEMBL297784",
          "CHEMBL298920",
          "CHEMBL299408",
          "CHEMBL299957",
          "CHEMBL300476",
          "CHEMBL301039",
          "CHEMBL301510",
          "CHEMBL301967",
          "CHEMBL303182",
          "CHEMBL303877",
          "CHEMBL310667",
          "CHEMBL311325",
          "CHEMBL311585",
          "CHEMBL312786",
          "CHEMBL312898",
          "CHEMBL314198",
          "CHEMBL314299",
          "CHEMBL315071",
          "CHEMBL315345",
          "CHEMBL315443",
          "CHEMBL316856",
          "CHEMBL318154",
          "CHEMBL319663",
          "CHEMBL319673",
          "CHEMBL324057",
          "CHEMBL325109",
          "CHEMBL327192",
          "CHEMBL327197",
          "CHEMBL327798",
          "CHEMBL329487",
          "CHEMBL329545",
          "CHEMBL32986",
          "CHEMBL330605",
          "CHEMBL331304",
          "CHEMBL332242",
          "CHEMBL33676",
          "CHEMBL33732",
          "CHEMBL33884",
          "CHEMBL341474",
          "CHEMBL34224",
          "CHEMBL34291",
          "CHEMBL344345",
          "CHEMBL347235",
          "CHEMBL348311",
          "CHEMBL349809",
          "CHEMBL350221",
          "CHEMBL351557",
          "CHEMBL351570",
          "CHEMBL356521",
          "CHEMBL361907",
          "CHEMBL370758",
          "CHEMBL371883",
          "CHEMBL372776",
          "CHEMBL37333",
          "CHEMBL383554",
          "CHEMBL383577",
          "CHEMBL39",
          "CHEMBL407493",
          "CHEMBL416172",
          "CHEMBL41769",
          "CHEMBL419112",
          "CHEMBL419496",
          "CHEMBL420638",
          "CHEMBL420969",
          "CHEMBL423504",
          "CHEMBL424498",
          "CHEMBL425222",
          "CHEMBL42787",
          "CHEMBL439630",
          "CHEMBL439849",
          "CHEMBL440670",
          "CHEMBL46",
          "CHEMBL48351",
          "CHEMBL48379",
          "CHEMBL48548",
          "CHEMBL48684",
          "CHEMBL48698",
          "CHEMBL48836",
          "CHEMBL49072",
          "CHEMBL49155",
          "CHEMBL49266",
          "CHEMBL49907",
          "CHEMBL50304",
          "CHEMBL50660",
          "CHEMBL50852",
          "CHEMBL51218",
          "CHEMBL51251",
          "CHEMBL51647",
          "CHEMBL52167",
          "CHEMBL558226",
          "CHEMBL56564",
          "CHEMBL59834",
          "CHEMBL62023",
          "CHEMBL66114",
          "CHEMBL66559",
          "CHEMBL66768",
          "CHEMBL66886",
          "CHEMBL67554",
          "CHEMBL67555",
          "CHEMBL67999",
          "CHEMBL68131",
          "CHEMBL69049",
          "CHEMBL69733",
          "CHEMBL70205",
          "CHEMBL76737",
          "CHEMBL79913",
          "CHEMBL80026",
          "CHEMBL81030",
          "CHEMBL81352",
          "CHEMBL81457",
          "CHEMBL81482",
          "CHEMBL82164",
          "CHEMBL82976",
          "CHEMBL82999",
          "CHEMBL83684",
          "CHEMBL83755",
          "CHEMBL83841",
          "CHEMBL83954",
          "CHEMBL83974",
          "CHEMBL84294",
          "CHEMBL84321",
          "CHEMBL84322",
          "CHEMBL86",
          "CHEMBL88263",
          "CHEMBL88310",
          "CHEMBL88867",
          "CHEMBL88973",
          "CHEMBL89259",
          "CHEMBL91147",
          "CHEMBL91379",
          "CHEMBL91771",
          "CHEMBL91841",
          "CHEMBL91842",
          "CHEMBL92100",
          "CHEMBL94099",
          "CHEMBL94415",
          "CHEMBL94756",
          "CHEMBL94784",
          "CHEMBL94880",
          "CHEMBL95178",
          "CHEMBL96667",
          "CHEMBL97591",
          "CHEMBL97594",
          "CHEMBL97955",
          "CHEMBL98397",
          "CHEMBL98734"
        ],
        "number_of_missing_values": "0"
      },
      {
        "data_type": "numeric",
        "index": "1",
        "is_ignore": "false",
        "is_row_identifier": "false",
        "is_target": "false",
        "name": "nO",
        "number_of_missing_values": "0"
      },
      {
        "data_type": "numeric",
        "index": "2",
        "is_ignore": "false",
        "is_row_identifier": "false",
        "is_target": "false",
        "name": "N.",
        "number_of_missing_values": "0"
      },
      {
        "data_type": "numeric",
        "index": "3",
        "is_ignore": "false",
        "is_row_identifier": "false",
        "is_target": "false",
        "name": "C.",
        "number_of_missing_values": "0"
      },
      {
        "data_type": "numeric",
        "index": "4",
        "is_ignore": "false",
        "is_row_identifier": "false",
        "is_target": "false",
        "name": "RBF",
        "number_of_missing_values": "0"
      },
      {
        "data_type": "numeric",
        "index": "5",
        "is_ignore": "false",
        "is_row_identifier": "false",
        "is_target": "false",
        "name": "RBN",
        "number_of_missing_values": "0"
      },
      {
        "data_type": "numeric",
        "index": "6",
        "is_ignore": "false",
        "is_row_identifier": "false",
        "is_target": "false",
        "name": "nHM",
        "number_of_missing_values": "0"
      },
      {
        "data_type": "numeric",
        "index": "7",
        "is_ignore": "false",
        "is_row_identifier": "false",
        "is_target": "false",
        "name": "O.",
        "number_of_missing_values": "0"
      },
      {
        "data_type": "numeric",
        "index": "8",
        "is_ignore": "false",
        "is_row_identifier": "false",
        "is_target": "false",
        "name": "nX",
        "number_of_missing_values": "0"
      },
      {
        "data_type": "numeric",
        "index": "9",
        "is_ignore": "false",
        "is_row_identifier": "false",
        "is_target": "false",
        "name": "MW",
        "number_of_missing_values": "0"
      },
      {
        "data_type": "numeric",
        "index": "10",
        "is_ignore": "false",
        "is_row_identifier": "false",
        "is_target": "false",
        "name": "X.",
        "number_of_missing_values": "0"
      },
      {
        "data_type": "numeric",
        "index": "11",
        "is_ignore": "false",
        "is_row_identifier": "false",
        "is_target": "false",
        "name": "nCL",
        "number_of_missing_values": "0"
      },
      {
        "data_type": "numeric",
        "index": "12",
        "is_ignore": "false",
        "is_row_identifier": "false",
        "is_target": "false",
        "name": "nHet",
        "number_of_missing_values": "0"
      },
      {
        "data_type": "numeric",
        "index": "13",
        "is_ignore": "false",
        "is_row_identifier": "false",
        "is_target": "false",
        "name": "nAT",
        "number_of_missing_values": "0"
      },
      {
        "data_type": "numeric",
        "index": "14",
        "is_ignore": "false",
        "is_row_identifier": "false",
        "is_target": "false",
        "name": "nBT",
        "number_of_missing_values": "0"
      },
      {
        "data_type": "numeric",
        "index": "15",
        "is_ignore": "false",
        "is_row_identifier": "false",
        "is_target": "false",
        "name": "nH",
        "number_of_missing_values": "0"
      },
      {
        "data_type": "numeric",
        "index": "16",
        "is_ignore": "false",
        "is_row_identifier": "false",
        "is_target": "false",
        "name": "Se",
        "number_of_missing_values": "0"
      },
      {
        "data_type": "numeric",
        "index": "17",
        "is_ignore": "false",
        "is_row_identifier": "false",
        "is_target": "false",
        "name": "Si",
        "number_of_missing_values": "0"
      },
      {
        "data_type": "numeric",
        "index": "18",
        "is_ignore": "false",
        "is_row_identifier": "false",
        "is_target": "false",
        "name": "nN",
        "number_of_missing_values": "0"
      },
      {
        "data_type": "numeric",
        "index": "19",
        "is_ignore": "false",
        "is_row_identifier": "false",
        "is_target": "false",
        "name": "Sp",
        "number_of_missing_values": "0"
      },
      {
        "data_type": "numeric",
        "index": "20",
        "is_ignore": "false",
        "is_row_identifier": "false",
        "is_target": "false",
        "name": "Sv",
        "number_of_missing_values": "0"
      },
      {
        "data_type": "numeric",
        "index": "21",
        "is_ignore": "false",
        "is_row_identifier": "false",
        "is_target": "false",
        "name": "nCsp3",
        "number_of_missing_values": "0"
      },
      {
        "data_type": "numeric",
        "index": "22",
        "is_ignore": "false",
        "is_row_identifier": "false",
        "is_target": "false",
        "name": "nSK",
        "number_of_missing_values": "0"
      },
      {
        "data_type": "numeric",
        "index": "23",
        "is_ignore": "false",
        "is_row_identifier": "false",
        "is_target": "false",
        "name": "nC",
        "number_of_missing_values": "0"
      },
      {
        "data_type": "numeric",
        "index": "24",
        "is_ignore": "false",
        "is_row_identifier": "false",
        "is_target": "false",
        "name": "nBO",
        "number_of_missing_values": "0"
      },
      {
        "data_type": "numeric",
        "index": "25",
        "is_ignore": "false",
        "is_row_identifier": "false",
        "is_target": "false",
        "name": "AMW",
        "number_of_missing_values": "0"
      },
      {
        "data_type": "numeric",
        "index": "26",
        "is_ignore": "false",
        "is_row_identifier": "false",
        "is_target": "false",
        "name": "H.",
        "number_of_missing_values": "0"
      },
      {
        "data_type": "numeric",
        "index": "27",
        "is_ignore": "false",
        "is_row_identifier": "false",
        "is_target": "false",
        "name": "Me",
        "number_of_missing_values": "0"
      },
      {
        "data_type": "numeric",
        "index": "28",
        "is_ignore": "false",
        "is_row_identifier": "false",
        "is_target": "false",
        "name": "Mi",
        "number_of_missing_values": "0"
      },
      {
        "data_type": "numeric",
        "index": "29",
        "is_ignore": "false",
        "is_row_identifier": "false",
        "is_target": "false",
        "name": "Mp",
        "number_of_missing_values": "0"
      },
      {
        "data_type": "numeric",
        "index": "30",
        "is_ignore": "false",
        "is_row_identifier": "false",
        "is_target": "false",
        "name": "Mv",
        "number_of_missing_values": "0"
      },
      {
        "data_type": "numeric",
        "index": "31",
        "is_ignore": "false",
        "is_row_identifier": "false",
        "is_target": "true",
        "name": "pXC50",
        "number_of_missing_values": "0"
      }
    ]
  }
}