"molecule_id","AMW","C.","H.","Me","Mi","Mp","Mv","MW","N.","nAB","nAT","nB","nBM","nBO","nBR","nBT","nC","nCL","nCsp","nCsp2","nCsp3","nDB","nF","nH","nHet","nHM","nI","nN","nO","nP","nS","nSK","nTB","nX","O.","RBF","RBN","SCBO","Se","Si","Sp","Sv","X.","pXC50"
{1 9.535,2 42.5,3 35,4 1.044,5 1.144,6 0.693,7 0.688,8 381.41,9 7.5,10 17,11 40,13 19,14 28,16 42,17 17,20 15,21 2,22 2,23 3,24 14,25 9,26 1,28 3,29 2,31 1,32 26,34 3,35 5,36 0.071,37 3,38 38.5,39 41.76,40 45.759,41 27.716,42 27.518,43 7.5,44 5.254}
{0 CHEMBL173770,1 9.929,2 43.2,3 32.4,4 1.051,5 1.144,6 0.701,7 0.702,8 367.38,9 8.1,10 17,11 37,13 19,14 27,16 39,17 16,20 14,21 2,22 2,23 3,24 12,25 9,26 1,28 3,29 2,31 1,32 25,34 3,35 5.4,36 0.077,37 3,38 37.5,39 38.876,40 42.344,41 25.955,42 25.992,43 8.1,44 4.854}
{0 CHEMBL174219,1 9.443,2 43.2,3 35.1,4 1.037,5 1.135,6 0.703,7 0.692,8 349.39,9 8.1,10 17,11 37,13 19,14 26,16 39,17 16,20 14,21 2,22 2,23 2,24 13,25 8,26 1,28 3,29 2,31 1,32 24,34 2,35 5.4,36 0.077,37 3,38 36.5,39 38.363,40 42.004,41 26.017,42 25.608,43 5.4,44 4.319}
{0 CHEMBL174586,1 12.061,2 43.2,3 29.7,4 1.057,5 1.14,6 0.738,7 0.73,8 446.27,9 8.1,10 17,11 37,13 19,14 28,15 1,16 39,17 16,20 14,21 2,22 2,23 3,24 11,25 10,26 2,28 3,29 2,31 1,32 26,34 4,35 5.4,36 0.077,37 3,38 38.5,39 39.105,40 42.186,41 27.307,42 27.017,43 10.8,44 4.544}
{0 CHEMBL174724,1 9.693,2 41.5,3 34.1,4 1.051,5 1.146,6 0.687,7 0.689,8 397.41,9 7.3,10 17,11 41,13 19,14 29,16 43,17 17,20 14,21 3,22 2,23 3,24 14,25 10,26 1,28 3,29 3,31 1,32 27,34 3,35 7.3,36 0.093,37 4,38 39.5,39 43.087,40 46.969,41 28.171,42 28.233,43 7.3,44 5.004}
{0 CHEMBL174860,1 10.374,2 43.2,3 32.4,4 1.046,5 1.134,6 0.726,7 0.714,8 383.83,9 8.1,10 17,11 37,13 19,14 27,16 39,17 16,18 1,20 14,21 2,22 2,23 2,24 12,25 9,26 2,28 3,29 2,31 1,32 25,34 3,35 5.4,36 0.077,37 3,38 37.5,39 38.687,40 41.948,41 26.875,42 26.436,43 8.1,44 4.684}
{0 CHEMBL174982,1 11.575,2 43.2,3 32.4,4 1.043,5 1.131,6 0.74,7 0.72,8 428.28,9 8.1,10 17,11 37,13 19,14 27,15 1,16 39,17 16,20 14,21 2,22 2,23 2,24 12,25 9,26 2,28 3,29 2,31 1,32 25,34 3,35 5.4,36 0.077,37 3,38 37.5,39 38.593,40 41.846,41 27.37,42 26.634,43 8.1,44 5.699}
{0 CHEMBL175340,1 8.51,2 41.3,3 41.3,4 1.022,5 1.136,6 0.68,7 0.656,8 391.48,9 6.5,10 17,11 46,13 19,14 29,16 48,17 19,20 14,21 5,22 2,23 2,24 19,25 8,26 1,28 3,29 2,31 1,32 27,34 2,35 4.3,36 0.083,37 4,38 39.5,39 47.014,40 52.25,41 31.301,42 30.189,43 4.3,44 4.301}
{0 CHEMBL175485,1 10.374,2 43.2,3 32.4,4 1.046,5 1.134,6 0.726,7 0.714,8 383.83,9 8.1,10 17,11 37,13 19,14 27,16 39,17 16,18 1,20 14,21 2,22 2,23 2,24 12,25 9,26 2,28 3,29 2,31 1,32 25,34 3,35 5.4,36 0.077,37 3,38 37.5,39 38.687,40 41.948,41 26.875,42 26.436,43 8.1,44 6.481}
{0 CHEMBL175826,1 9.929,2 43.2,3 32.4,4 1.051,5 1.144,6 0.701,7 0.702,8 367.38,9 8.1,10 17,11 37,13 19,14 27,16 39,17 16,20 14,21 2,22 2,23 3,24 12,25 9,26 1,28 3,29 2,31 1,32 25,34 3,35 5.4,36 0.077,37 3,38 37.5,39 38.876,40 42.344,41 25.955,42 25.992,43 8.1,44 4.301}
{0 CHEMBL176265,1 9.351,2 40.9,3 36.4,4 1.045,5 1.145,6 0.68,7 0.676,8 411.44,9 6.8,10 17,11 44,13 19,14 30,16 46,17 18,20 14,21 4,22 2,23 3,24 16,25 10,26 1,28 3,29 3,31 1,32 28,34 3,35 6.8,36 0.109,37 5,38 40.5,39 45.971,40 50.384,41 29.932,42 29.76,43 6.8,44 7.301}
{0 CHEMBL176387,1 9.351,2 40.9,3 36.4,4 1.045,5 1.145,6 0.68,7 0.676,8 411.44,9 6.8,10 17,11 44,13 19,14 30,16 46,17 18,20 14,21 4,22 2,23 3,24 16,25 10,26 1,28 3,29 3,31 1,32 28,34 3,35 6.8,36 0.087,37 4,38 40.5,39 45.971,40 50.384,41 29.932,42 29.76,43 6.8,44 4.39}
{0 CHEMBL176642,1 10.86,2 43.2,3 29.7,4 1.059,5 1.143,6 0.725,7 0.725,8 401.82,9 8.1,10 17,11 37,13 19,14 28,16 39,17 16,18 1,20 14,21 2,22 2,23 3,24 11,25 10,26 2,28 3,29 2,31 1,32 26,34 4,35 5.4,36 0.077,37 3,38 38.5,39 39.2,40 42.288,41 26.813,42 26.819,43 10.8,44 4.712}
{0 CHEMBL176677,1 8.51,2 41.3,3 41.3,4 1.022,5 1.136,6 0.68,7 0.656,8 391.48,9 6.5,10 17,11 46,13 19,14 29,16 48,17 19,20 14,21 5,22 2,23 2,24 19,25 8,26 1,28 3,29 2,31 1,32 27,34 2,35 4.3,36 0.104,37 5,38 39.5,39 47.014,40 52.25,41 31.301,42 30.189,43 4.3,44 4.301}
{0 CHEMBL176934,1 9.121,2 40,3 37.8,4 1.039,5 1.148,6 0.677,7 0.668,8 410.46,9 8.9,10 17,11 45,13 19,14 30,16 47,17 18,20 14,21 4,22 2,23 3,24 17,25 10,26 1,28 4,29 2,31 1,32 28,34 3,35 4.4,36 0.085,37 4,38 40.5,39 46.745,40 51.673,41 30.483,42 30.067,43 6.7,44 4.616}
{0 CHEMBL176983,1 9.693,2 41.5,3 34.1,4 1.051,5 1.146,6 0.687,7 0.689,8 397.41,9 7.3,10 17,11 41,13 19,14 29,16 43,17 17,20 14,21 3,22 2,23 3,24 14,25 10,26 1,28 3,29 3,31 1,32 27,34 3,35 7.3,36 0.093,37 4,38 39.5,39 43.087,40 46.969,41 28.171,42 28.233,43 7.3,44 6.081}
{0 CHEMBL177244,1 9.254,2 41.5,3 36.6,4 1.038,5 1.137,6 0.689,7 0.679,8 379.42,9 7.3,10 17,11 41,13 19,14 28,16 43,17 17,20 14,21 3,22 2,23 2,24 15,25 9,26 1,28 3,29 3,31 1,32 26,34 2,35 7.3,36 0.093,37 4,38 38.5,39 42.574,40 46.629,41 28.233,42 27.85,43 4.9,44 6.699}
{0 CHEMBL177397,1 11.575,2 43.2,3 32.4,4 1.043,5 1.131,6 0.74,7 0.72,8 428.28,9 8.1,10 17,11 37,13 19,14 27,15 1,16 39,17 16,20 14,21 2,22 2,23 2,24 12,25 9,26 2,28 3,29 2,31 1,32 25,34 3,35 5.4,36 0.077,37 3,38 37.5,39 38.593,40 41.846,41 27.37,42 26.634,43 8.1,44 6}
{0 CHEMBL177649,1 11.617,2 41.5,3 31.7,4 1.056,5 1.142,6 0.72,7 0.714,8 476.3,9 7.3,10 17,11 41,13 19,14 30,15 1,16 43,17 17,20 14,21 3,22 2,23 3,24 13,25 11,26 2,28 3,29 3,31 1,32 28,34 4,35 7.3,36 0.093,37 4,38 40.5,39 43.316,40 46.81,41 29.523,42 29.258,43 9.8,44 4.301}
{0 CHEMBL197705,1 9.147,2 34.1,3 38.6,4 1.047,5 1.165,6 0.653,7 0.65,8 402.45,9 13.6,10 11,11 44,13 14,14 28,16 45,17 15,19 1,20 8,21 6,22 2,23 3,24 17,25 12,26 1,28 6,29 2,31 1,32 27,33 1,34 3,35 4.5,36 0.111,37 5,38 37.5,39 46.065,40 51.254,41 28.733,42 28.583,43 6.8,44 4.879}
{0 CHEMBL197869,1 8.738,2 34.1,3 40.9,4 1.035,5 1.157,6 0.654,7 0.641,8 384.46,9 13.6,10 11,11 44,13 14,14 27,16 45,17 15,19 1,20 8,21 6,22 2,23 2,24 18,25 11,26 1,28 6,29 2,31 1,32 26,33 1,34 2,35 4.5,36 0.133,37 6,38 36.5,39 45.552,40 50.914,41 28.796,42 28.199,43 4.5,44 5.398}
{0 CHEMBL198024,1 9.053,2 38.3,3 38.3,4 1.039,5 1.153,6 0.67,7 0.661,8 425.48,9 10.6,10 11,11 47,13 14,14 32,16 50,17 18,19 1,20 8,21 9,22 2,23 3,24 18,25 11,26 1,28 5,29 2,31 1,32 29,33 1,34 3,35 4.3,36 0.08,37 4,38 41.5,39 48.847,40 54.171,41 31.489,42 31.088,43 6.4,44 4.81}
{0 CHEMBL198189,1 9.289,2 37.2,3 37.2,4 1.046,5 1.157,6 0.668,7 0.664,8 399.44,9 11.6,10 11,11 43,13 14,14 29,16 45,17 16,19 1,20 8,21 7,22 2,23 3,24 16,25 11,26 1,28 5,29 2,31 1,32 27,33 1,34 3,35 4.7,36 0.067,37 3,38 38.5,39 44.963,40 49.756,41 28.728,42 28.561,43 7,44 4.301}
{0 CHEMBL199337,1 10.687,2 40,3 30,4 1.057,5 1.146,6 0.721,7 0.717,8 427.47,9 12.5,10 16,11 40,13 19,14 30,16 42,17 16,19 1,20 12,21 3,22 2,23 3,24 12,25 12,26 2,28 5,29 2,31 2,32 28,33 1,34 3,35 5,36 0.119,37 5,38 42,39 42.273,40 45.845,41 28.852,42 28.695,43 7.5,44 5.252}
{0 CHEMBL199344,1 8.724,2 36.7,3 40.8,4 1.035,5 1.155,6 0.658,7 0.645,8 427.5,9 10.2,10 11,11 49,13 14,14 31,16 51,17 18,19 1,20 8,21 9,22 2,23 3,24 20,25 11,26 1,28 5,29 2,31 1,32 29,33 1,34 3,35 4.1,36 0.059,37 3,38 40.5,39 50.731,40 56.586,41 32.25,42 31.615,43 6.1,44 4.301}
{0 CHEMBL199346,1 8.597,2 37,3 41.3,4 1.029,5 1.149,6 0.664,7 0.646,8 395.48,9 10.9,10 11,11 46,13 14,14 29,16 48,17 17,19 1,20 8,21 8,22 2,23 2,24 19,25 10,26 1,28 5,29 2,31 1,32 27,33 1,34 2,35 4.3,36 0.063,37 3,38 38.5,39 47.334,40 52.831,41 30.551,42 29.705,43 4.3,44 4.889}
{0 CHEMBL199431,1 8.921,2 35.6,3 40,4 1.041,5 1.159,6 0.655,7 0.646,8 401.46,9 11.1,10 11,11 45,13 14,14 28,16 46,17 16,19 1,20 8,21 7,22 2,23 3,24 18,25 11,26 1,28 5,29 2,31 1,32 27,33 1,34 3,35 4.4,36 0.109,37 5,38 37.5,39 46.847,40 52.171,41 29.489,42 29.088,43 6.7,44 5.469}
{0 CHEMBL199681,1 8.67,2 38.3,3 40.4,4 1.028,5 1.145,6 0.671,7 0.653,8 407.49,9 10.6,10 11,11 47,13 14,14 31,16 50,17 18,19 1,20 8,21 9,22 2,23 2,24 19,25 10,26 1,28 5,29 2,31 1,32 28,33 1,34 2,35 4.3,36 0.08,37 4,38 40.5,39 48.334,40 53.831,41 31.551,42 30.705,43 4.3,44 4.68}
{0 CHEMBL199682,1 8.552,2 35.4,3 41.7,4 1.03,5 1.153,6 0.657,7 0.64,8 410.5,9 12.5,10 11,11 48,13 14,14 30,16 50,17 17,19 1,20 8,21 8,22 2,23 2,24 20,25 11,26 1,28 6,29 2,31 1,32 28,33 1,34 2,35 4.2,36 0.06,37 3,38 39.5,39 49.436,40 55.33,41 31.557,42 30.726,43 4.2,44 5.155}
{0 CHEMBL199901,1 9.51,2 35.7,3 35.7,4 1.053,5 1.153,6 0.665,7 0.669,8 399.42,9 11.9,10 11,11 42,13 14,14 29,16 44,17 15,19 1,20 8,21 6,22 2,23 2,24 15,25 12,26 1,28 5,29 4,31 1,32 27,33 1,34 2,35 9.5,36 0.114,37 5,38 38.5,39 44.222,40 48.42,41 27.938,42 28.081,43 4.8,44 4.301}
{0 CHEMBL199991,1 9.938,2 35.7,3 33.3,4 1.065,5 1.161,6 0.664,7 0.678,8 417.41,9 11.9,10 11,11 42,13 14,14 30,16 44,17 15,19 1,20 8,21 6,22 2,23 3,24 14,25 13,26 1,28 5,29 4,31 1,32 28,33 1,34 3,35 9.5,36 0.114,37 5,38 39.5,39 44.734,40 48.759,41 27.875,42 28.464,43 7.1,44 4.301}
{0 CHEMBL199992,1 9.635,2 37.5,3 35,4 1.052,5 1.159,6 0.674,7 0.676,8 385.41,9 12.5,10 11,11 40,13 14,14 28,16 42,17 15,19 1,20 8,21 6,22 2,23 3,24 14,25 11,26 1,28 5,29 2,31 1,32 26,33 1,34 3,35 5,36 0.119,37 5,38 37.5,39 42.08,40 46.341,41 26.966,42 27.034,43 7.5,44 4.658}
{0 CHEMBL200152,1 8.522,2 35.6,3 42.2,4 1.03,5 1.152,6 0.657,7 0.638,8 383.47,9 11.1,10 11,11 45,13 14,14 27,16 46,17 16,19 1,20 8,21 7,22 2,23 2,24 19,25 10,26 1,28 5,29 2,31 1,32 26,33 1,34 2,35 4.4,36 0.109,37 5,38 36.5,39 46.334,40 51.831,41 29.551,42 28.705,43 4.4,44 4.44}
{0 CHEMBL200406,1 9.574,2 35.9,3 35.9,4 1.053,5 1.163,6 0.666,7 0.668,8 373.4,9 12.8,10 11,11 39,13 14,14 26,16 40,17 14,19 1,20 8,21 5,22 2,23 3,24 14,25 11,26 1,28 5,29 2,31 1,32 25,33 1,34 3,35 5.1,36 0.1,37 4,38 35.5,39 41.08,40 45.341,41 25.966,42 26.034,43 7.7,44 4.389}
{0 CHEMBL200518,1 9.271,2 37,3 37,4 1.045,5 1.158,6 0.668,7 0.665,8 426.47,9 13,10 11,11 46,13 14,14 32,16 49,17 17,19 1,20 8,21 8,22 2,23 3,24 17,25 12,26 1,28 6,29 2,31 1,32 29,33 1,34 3,35 4.3,36 0.082,37 4,38 41.5,39 48.065,40 53.254,41 30.733,42 30.583,43 6.5,44 4.81}
{0 CHEMBL200559,1 8.927,2 35.4,3 39.6,4 1.041,5 1.16,6 0.656,7 0.648,8 428.49,9 12.5,10 11,11 48,13 14,14 31,16 50,17 17,19 1,20 8,21 8,22 2,23 3,24 19,25 12,26 1,28 6,29 2,31 1,32 29,33 1,34 3,35 4.2,36 0.06,37 3,38 40.5,39 49.949,40 55.669,41 31.495,42 31.109,43 6.3,44 4.371}
{0 CHEMBL200812,1 8.755,2 36.2,3 40.4,4 1.035,5 1.15,6 0.66,7 0.647,8 411.48,9 10.6,10 11,11 47,13 14,14 30,16 49,17 17,19 1,20 8,21 8,22 2,23 2,24 19,25 11,26 1,28 5,29 3,31 1,32 28,33 1,34 2,35 6.4,36 0.061,37 3,38 39.5,39 48.662,40 54.041,41 31.006,42 30.42,43 4.3,44 4.33}
{0 CHEMBL200909,1 8.967,2 34.8,3 39.1,4 1.041,5 1.155,6 0.658,7 0.65,8 412.47,9 13,10 11,11 46,13 14,14 30,16 48,17 16,19 1,20 8,21 7,22 2,23 2,24 18,25 12,26 1,28 6,29 3,31 1,32 28,33 1,34 2,35 6.5,36 0.063,37 3,38 39.5,39 47.88,40 53.124,41 30.25,42 29.914,43 4.3,44 4.301}
{0 CHEMBL201179,1 9.138,2 36.2,3 38.3,4 1.046,5 1.157,6 0.658,7 0.655,8 429.47,9 10.6,10 11,11 47,13 14,14 31,16 49,17 17,19 1,20 8,21 8,22 2,23 3,24 18,25 12,26 1,28 5,29 3,31 1,32 29,33 1,34 3,35 6.4,36 0.061,37 3,38 40.5,39 49.174,40 54.38,41 30.943,42 30.803,43 6.4,44 4.301}
{0 CHEMBL201696,1 9.442,2 36.4,3 36.4,4 1.052,5 1.158,6 0.663,7 0.665,8 415.44,9 11.4,10 11,11 44,13 14,14 30,16 46,17 16,19 1,20 8,21 7,22 2,23 3,24 16,25 12,26 1,28 5,29 3,31 1,32 28,33 1,34 3,35 6.8,36 0.109,37 5,38 39.5,39 46.291,40 50.965,41 29.182,42 29.276,43 6.8,44 4.783}
{0 CHEMBL202856,1 9.699,2 42.2,3 33.3,4 1.049,5 1.144,6 0.693,7 0.695,8 436.45,9 8.9,10 17,11 45,13 20,14 32,16 47,17 19,19 1,20 14,21 4,22 2,23 3,24 15,25 11,26 1,28 4,29 3,31 1,32 30,33 1,34 3,35 6.7,36 0.085,37 4,38 44.5,39 47.189,40 51.467,41 31.176,42 31.255,43 6.7,44 7}
{0 CHEMBL203697,1 10.011,2 35.7,3 35.7,4 1.054,5 1.152,6 0.686,7 0.677,8 420.48,9 9.5,10 11,11 42,13 14,14 28,16 43,17 15,19 1,20 8,21 6,22 2,23 3,24 15,25 12,26 2,28 4,29 3,31 2,32 27,33 1,34 3,35 7.1,36 0.163,37 7,38 37.5,39 44.265,40 48.387,41 28.824,42 28.442,43 7.1,44 5.699}
{0 CHEMBL204029,1 8.861,2 36.2,3 40.4,4 1.042,5 1.155,6 0.653,7 0.645,8 416.47,9 8.5,10 11,11 47,13 14,14 29,16 48,17 17,19 1,20 8,21 8,22 2,23 3,24 19,25 11,26 1,28 4,29 3,31 1,32 28,33 1,34 3,35 6.4,36 0.125,37 6,38 38.5,39 48.956,40 54.297,41 30.699,42 30.308,43 6.4,44 4.301}
{0 CHEMBL204178,1 10.869,2 42.9,3 28.6,4 1.061,5 1.145,6 0.727,7 0.728,8 456.48,9 9.5,10 17,11 42,13 20,14 32,16 44,17 18,19 1,20 14,21 3,22 2,23 4,24 12,25 12,26 2,28 4,29 2,31 2,32 30,33 1,34 4,35 4.8,36 0.114,37 5,38 44.5,39 44.567,40 48.102,41 30.546,42 30.583,43 9.5,44 6.222}
{0 CHEMBL204506,1 10.44,2 42.9,3 31,4 1.049,5 1.137,6 0.729,7 0.719,8 438.49,9 9.5,10 17,11 42,13 20,14 31,16 44,17 18,19 1,20 14,21 3,22 2,23 3,24 13,25 11,26 2,28 4,29 2,31 2,32 29,33 1,34 3,35 4.8,36 0.114,37 5,38 43.5,39 44.054,40 47.762,41 30.608,42 30.2,43 7.1,44 6.046}
{0 CHEMBL204641,1 9.271,2 39.1,3 37,4 1.045,5 1.15,6 0.673,7 0.669,8 426.46,9 8.7,10 11,11 46,13 15,14 31,16 48,17 18,19 1,20 10,21 7,22 3,23 3,24 17,25 11,26 1,28 4,29 3,31 1,32 29,33 1,34 3,35 6.5,36 0.104,37 5,38 41.5,39 48.072,40 52.882,41 30.938,42 30.781,43 6.5,44 4.975}
{0 CHEMBL204703,1 9.907,2 38.5,3 33.3,4 1.059,5 1.155,6 0.677,7 0.685,8 386.39,9 10.3,10 11,11 39,13 14,14 28,16 41,17 15,19 1,20 8,21 6,22 2,23 3,24 13,25 11,26 1,28 4,29 3,31 1,32 26,33 1,34 3,35 7.7,36 0.098,37 4,38 37.5,39 41.305,40 45.052,41 26.415,42 26.728,43 7.7,44 4.597}
{0 CHEMBL204707,1 9.865,2 36.6,3 36.6,4 1.047,5 1.151,6 0.692,7 0.676,8 404.48,9 9.8,10 11,11 41,13 14,14 27,16 42,17 15,19 1,20 8,21 6,22 2,23 3,24 15,25 11,26 2,28 4,29 2,31 2,32 26,33 1,34 3,35 4.9,36 0.119,37 5,38 36.5,39 42.938,40 47.178,41 28.37,42 27.727,43 7.3,44 5.824}
{0 CHEMBL205163,1 8.927,2 37.5,3 39.6,4 1.041,5 1.152,6 0.66,7 0.652,8 428.48,9 8.3,10 11,11 48,13 14,14 31,16 50,17 18,19 1,20 8,21 9,22 2,23 3,24 19,25 11,26 1,28 4,29 3,31 1,32 29,33 1,34 3,35 6.3,36 0.08,37 4,38 40.5,39 49.956,40 55.297,41 31.699,42 31.308,43 6.3,44 5.149}
{0 CHEMBL205308,1 9.926,2 43.8,3 31.3,4 1.052,5 1.139,6 0.701,7 0.708,8 476.47,9 8.3,10 22,11 48,13 25,14 36,16 51,17 21,20 19,21 2,22 3,23 3,24 15,25 12,26 1,28 4,29 4,31 1,32 33,34 3,35 8.3,36 0.098,37 5,38 50,39 50.516,40 54.676,41 33.631,42 33.969,43 6.3,44 5.699}
{0 CHEMBL205331,1 9.749,2 43.5,3 32.6,4 1.048,5 1.141,6 0.699,7 0.701,8 448.46,9 8.7,10 22,11 46,13 24,14 34,16 49,17 20,20 17,21 3,22 2,23 3,24 15,25 11,26 1,28 4,29 3,31 1,32 31,34 3,35 6.5,36 0.082,37 4,38 47,39 48.189,40 52.467,41 32.176,42 32.255,43 6.5,44 4.955}
{0 CHEMBL205351,1 10.188,2 46.7,3 28.9,4 1.051,5 1.134,6 0.72,7 0.727,8 458.45,9 8.9,10 22,11 45,13 25,14 35,16 48,17 21,19 1,20 18,21 2,22 2,23 3,24 13,25 11,26 1,28 4,29 3,31 1,32 32,33 1,34 3,35 6.7,36 0.083,37 4,38 50,39 47.305,40 51.052,41 32.415,42 32.728,43 6.7,44 5.699}
{0 CHEMBL205938,1 10.477,2 44.2,3 30.2,4 1.048,5 1.134,6 0.735,7 0.726,8 450.5,9 9.3,10 22,11 43,13 24,14 33,16 46,17 19,20 17,21 2,22 2,23 3,24 13,25 11,26 2,28 4,29 2,31 2,32 30,34 3,35 4.7,36 0.087,37 4,38 46,39 45.054,40 48.762,41 31.608,42 31.2,43 7,44 5.569}
{0 CHEMBL206207,1 10.807,2 45.5,3 27.3,4 1.052,5 1.133,6 0.747,7 0.743,8 475.51,9 11.4,10 22,11 44,13 25,14 35,16 47,17 20,19 1,20 17,21 2,22 2,23 3,24 12,25 12,26 2,28 5,29 2,31 2,32 32,33 1,34 3,35 4.5,36 0.085,37 4,38 50,39 46.273,40 49.845,41 32.852,42 32.695,43 6.8,44 4.631}
{0 CHEMBL206359,1 9.851,2 45.5,3 31.8,4 1.047,5 1.136,6 0.708,7 0.71,8 433.44,9 6.8,10 22,11 44,13 24,14 33,16 47,17 20,20 18,21 2,22 2,23 3,24 14,25 10,26 1,28 3,29 3,31 1,32 30,34 3,35 6.8,36 0.085,37 4,38 46,39 46.087,40 49.969,41 31.171,42 31.233,43 6.8,44 4.74}
{0 CHEMBL207702,1 10.895,2 44.2,3 27.9,4 1.06,5 1.142,6 0.734,7 0.734,8 468.49,9 9.3,10 22,11 43,13 24,14 34,16 46,17 19,20 17,21 2,22 2,23 4,24 12,25 12,26 2,28 4,29 2,31 2,32 31,34 4,35 4.7,36 0.087,37 4,38 47,39 45.567,40 49.102,41 31.546,42 31.583,43 9.3,44 4.644}
{0 CHEMBL208450,1 9.442,2 45.5,3 34.1,4 1.036,5 1.128,6 0.71,7 0.701,8 415.45,9 6.8,10 22,11 44,13 24,14 32,16 47,17 20,20 18,21 2,22 2,23 2,24 15,25 9,26 1,28 3,29 3,31 1,32 29,34 2,35 6.8,36 0.085,37 4,38 45,39 45.574,40 49.629,41 31.233,42 30.85,43 4.5,44 4.921}
{0 CHEMBL264572,1 9.512,2 36.4,3 38.6,4 1.041,5 1.15,6 0.685,7 0.665,8 418.51,9 9.1,10 11,11 44,13 14,14 28,16 45,17 16,19 1,20 8,21 7,22 2,23 3,24 17,25 11,26 2,28 4,29 2,31 2,32 27,33 1,34 3,35 4.5,36 0.156,37 7,38 37.5,39 45.822,40 50.593,41 30.131,42 29.254,43 6.8,44 5.456}
{0 CHEMBL28636,1 9.693,2 41.5,3 34.1,4 1.051,5 1.146,6 0.687,7 0.689,8 397.41,9 7.3,10 17,11 41,13 19,14 29,16 43,17 17,20 15,21 2,22 2,23 3,24 14,25 10,26 1,28 3,29 3,31 1,32 27,34 3,35 7.3,36 0.093,37 4,38 39.5,39 43.087,40 46.969,41 28.171,42 28.233,43 7.3,44 4.638}
{0 CHEMBL355812,1 8.778,2 41.9,3 39.5,4 1.026,5 1.136,6 0.687,7 0.667,8 377.45,9 7,10 17,11 43,13 19,14 28,16 45,17 18,20 14,21 4,22 2,23 2,24 17,25 8,26 1,28 3,29 2,31 1,32 26,34 2,35 4.7,36 0.089,37 4,38 38.5,39 44.131,40 48.835,41 29.54,42 28.662,43 4.7,44 4.921}
{0 CHEMBL360705,1 10.132,2 41.5,3 31.7,4 1.063,5 1.154,6 0.686,7 0.698,8 415.4,9 7.3,10 17,11 41,13 19,14 30,16 43,17 17,20 14,21 3,22 2,23 4,24 13,25 11,26 1,28 3,29 3,31 1,32 28,34 4,35 7.3,36 0.093,37 4,38 40.5,39 43.6,40 47.308,41 28.108,42 28.617,43 9.8,44 5.553}
{0 CHEMBL366517,1 10.094,2 41.5,3 34.1,4 1.046,5 1.136,6 0.71,7 0.699,8 413.86,9 7.3,10 17,11 41,13 19,14 29,16 43,17 17,18 1,20 14,21 3,22 2,23 2,24 14,25 10,26 2,28 3,29 3,31 1,32 27,34 3,35 7.3,36 0.093,37 4,38 39.5,39 42.898,40 46.573,41 29.091,42 28.677,43 7.3,44 4.301}
{0 CHEMBL366677,1 9.535,2 42.5,3 35,4 1.044,5 1.144,6 0.693,7 0.688,8 381.41,9 7.5,10 17,11 40,13 19,14 28,16 42,17 17,20 14,21 3,22 2,23 3,24 14,25 9,26 1,28 3,29 2,31 1,32 26,34 3,35 5,36 0.071,37 3,38 38.5,39 41.76,40 45.759,41 27.716,42 27.518,43 7.5,44 4.301}
{0 CHEMBL366726,1 9.646,2 41.5,3 36.6,4 1.032,5 1.13,6 0.718,7 0.691,8 395.49,9 7.3,10 17,11 41,13 19,14 28,16 43,17 17,20 14,21 3,22 2,23 2,24 15,25 9,26 2,28 3,29 2,31 2,32 26,34 2,35 4.9,36 0.093,37 4,38 38.5,39 42.323,40 46.34,41 29.426,42 28.322,43 4.9,44 6.046}
{0 CHEMBL366992,1 10.415,2 43.2,3 29.7,4 1.065,5 1.154,6 0.7,7 0.713,8 385.37,9 8.1,10 17,11 37,13 19,14 28,16 39,17 16,20 14,21 2,22 2,23 4,24 11,25 10,26 1,28 3,29 2,31 1,32 26,34 4,35 5.4,36 0.077,37 3,38 38.5,39 39.389,40 42.684,41 25.892,42 26.375,43 10.8,44 4.554}
{0 CHEMBL367123,1 10.085,2 41.5,3 34.1,4 1.045,5 1.139,6 0.716,7 0.7,8 413.48,9 7.3,10 17,11 41,13 19,14 29,16 43,17 17,20 14,21 3,22 2,23 3,24 14,25 10,26 2,28 3,29 2,31 2,32 27,34 3,35 4.9,36 0.093,37 4,38 39.5,39 42.836,40 46.679,41 29.364,42 28.706,43 7.3,44 5.721}
{0 CHEMBL367179,1 8.942,2 40.9,3 38.6,4 1.033,5 1.137,6 0.682,7 0.668,8 393.45,9 6.8,10 17,11 44,13 19,14 29,16 46,17 18,20 14,21 4,22 2,23 2,24 17,25 9,26 1,28 3,29 3,31 1,32 27,34 2,35 6.8,36 0.087,37 4,38 39.5,39 45.458,40 50.044,41 29.995,42 29.377,43 4.5,44 4.301}
{0 CHEMBL367550,1 9.085,2 42.5,3 37.5,4 1.031,5 1.135,6 0.694,7 0.678,8 363.42,9 7.5,10 17,11 40,13 19,14 27,16 42,17 17,20 14,21 3,22 2,23 2,24 15,25 8,26 1,28 3,29 2,31 1,32 25,34 2,35 5,36 0.071,37 3,38 37.5,39 41.247,40 45.42,41 27.779,42 27.135,43 5,44 5.041}
{0 CHEMBL367617,1 9.693,2 41.5,3 34.1,4 1.051,5 1.146,6 0.687,7 0.689,8 397.41,9 7.3,10 17,11 41,13 19,14 29,16 43,17 17,20 14,21 3,22 2,23 3,24 14,25 10,26 1,28 3,29 3,31 1,32 27,34 3,35 7.3,36 0.093,37 4,38 39.5,39 43.087,40 46.969,41 28.171,42 28.233,43 7.3,44 4.439}
{0 CHEMBL367785,1 9.085,2 42.5,3 37.5,4 1.031,5 1.135,6 0.694,7 0.678,8 363.42,9 7.5,10 17,11 40,13 19,14 27,16 42,17 17,20 14,21 3,22 2,23 2,24 15,25 8,26 1,28 3,29 2,31 1,32 25,34 2,35 5,36 0.071,37 3,38 37.5,39 41.247,40 45.42,41 27.779,42 27.135,43 5,44 5}
{0 CHEMBL368173,1 10.132,2 41.5,3 31.7,4 1.063,5 1.154,6 0.686,7 0.698,8 415.4,9 7.3,10 17,11 41,13 19,14 30,16 43,17 17,20 14,21 3,22 2,23 4,24 13,25 11,26 1,28 3,29 3,31 1,32 28,34 4,35 7.3,36 0.093,37 4,38 40.5,39 43.6,40 47.308,41 28.108,42 28.617,43 9.8,44 4.321}
{0 CHEMBL368724,1 10.934,2 41.5,3 31.7,4 1.054,5 1.135,6 0.73,7 0.72,8 448.3,9 7.3,10 17,11 41,13 19,14 30,16 43,17 17,18 2,20 14,21 3,22 2,23 2,24 13,25 11,26 3,28 3,29 3,31 1,32 28,34 4,35 7.3,36 0.093,37 4,38 40.5,39 43.222,40 46.517,41 29.949,42 29.505,43 9.8,44 5.824}
{0 CHEMBL369315,1 10.86,2 43.2,3 29.7,4 1.059,5 1.143,6 0.725,7 0.725,8 401.82,9 8.1,10 17,11 37,13 19,14 28,16 39,17 16,18 1,20 14,21 2,22 2,23 3,24 11,25 10,26 2,28 3,29 2,31 1,32 26,34 4,35 5.4,36 0.077,37 3,38 38.5,39 39.2,40 42.288,41 26.813,42 26.819,43 10.8,44 5.102}
{0 CHEMBL370579,1 8.597,2 37,3 41.3,4 1.029,5 1.149,6 0.664,7 0.646,8 395.48,9 10.9,10 11,11 46,13 14,14 29,16 48,17 17,19 1,20 8,21 8,22 2,23 2,24 19,25 10,26 1,28 5,29 2,31 1,32 27,33 1,34 2,35 4.3,36 0.063,37 3,38 38.5,39 47.334,40 52.831,41 30.551,42 29.705,43 4.3,44 5.699}
{0 CHEMBL372393,1 8.738,2 34.1,3 40.9,4 1.035,5 1.157,6 0.654,7 0.641,8 384.46,9 13.6,10 11,11 44,13 14,14 27,16 45,17 15,19 1,20 8,21 6,22 2,23 2,24 18,25 11,26 1,28 6,29 2,31 1,32 26,33 1,34 2,35 4.5,36 0.111,37 5,38 36.5,39 45.552,40 50.914,41 28.796,42 28.199,43 4.5,44 4.745}
{0 CHEMBL377284,1 10.477,2 44.2,3 30.2,4 1.048,5 1.134,6 0.735,7 0.726,8 450.5,9 9.3,10 22,11 43,13 24,14 33,16 46,17 19,20 17,21 2,22 2,23 3,24 13,25 11,26 2,28 4,29 2,31 2,32 30,34 3,35 4.7,36 0.087,37 4,38 46,39 45.054,40 48.762,41 31.608,42 31.2,43 7,44 4.301}
{0 CHEMBL377499,1 8.99,2 38.8,3 38.8,4 1.04,5 1.149,6 0.667,7 0.659,8 440.49,9 8.2,10 11,11 49,13 15,14 32,16 51,17 19,19 1,20 10,21 8,22 3,23 3,24 19,25 11,26 1,28 4,29 3,31 1,32 30,33 1,34 3,35 6.1,36 0.098,37 5,38 42.5,39 50.956,40 56.297,41 32.699,42 32.308,43 6.1,44 4.527}
{0 CHEMBL377797,1 11.278,2 44.2,3 27.9,4 1.055,5 1.133,6 0.755,7 0.745,8 484.94,9 9.3,10 22,11 43,13 24,14 34,16 46,17 19,18 1,20 17,21 2,22 2,23 3,24 12,25 12,26 3,28 4,29 2,31 2,32 31,34 4,35 4.7,36 0.087,37 4,38 47,39 45.378,40 48.706,41 32.466,42 32.028,43 9.3,44 4.796}
{0 CHEMBL378649,1 9.521,2 44.7,3 34,4 1.042,5 1.136,6 0.701,7 0.697,8 447.47,9 6.4,10 22,11 47,13 24,14 34,16 50,17 21,20 18,21 3,22 2,23 3,24 16,25 10,26 1,28 3,29 3,31 1,32 31,34 3,35 6.4,36 0.08,37 4,38 47,39 48.971,40 53.384,41 32.932,42 32.76,43 6.4,44 5.469}
{0 CHEMBL378875,1 10.26,2 45.5,3 29.5,4 1.059,5 1.143,6 0.707,7 0.719,8 451.43,9 6.8,10 22,11 44,13 24,14 34,16 47,17 20,20 18,21 2,22 2,23 4,24 13,25 11,26 1,28 3,29 3,31 1,32 31,34 4,35 6.8,36 0.085,37 4,38 47,39 46.6,40 50.308,41 31.108,42 31.617,43 9.1,44 4.554}
{0 CHEMBL380148,1 10.225,2 45.5,3 31.8,4 1.043,5 1.127,6 0.729,7 0.72,8 449.89,9 6.8,10 22,11 44,13 24,14 33,16 47,17 20,18 1,20 18,21 2,22 2,23 2,24 14,25 10,26 2,28 3,29 3,31 1,32 30,34 3,35 6.8,36 0.085,37 4,38 46,39 45.898,40 49.573,41 32.091,42 31.677,43 6.8,44 5.26}
{0 CHEMBL380329,1 9.567,2 37.8,3 37.8,4 1.04,5 1.147,6 0.692,7 0.672,8 430.52,9 8.9,10 11,11 45,13 14,14 30,16 47,17 17,19 1,20 8,21 8,22 2,23 3,24 17,25 11,26 2,28 4,29 2,31 2,32 28,33 1,34 3,35 4.4,36 0.085,37 4,38 39.5,39 46.822,40 51.593,41 31.131,42 30.254,43 6.7,44 5.495}
{0 CHEMBL380457,1 9.707,2 43.5,3 34.8,4 1.031,5 1.127,6 0.727,7 0.703,8 446.54,9 8.7,10 22,11 46,13 24,14 33,16 49,17 20,20 17,21 3,22 2,23 2,24 16,25 10,26 2,28 4,29 2,31 2,32 30,34 2,35 4.3,36 0.082,37 4,38 46,39 47.425,40 51.838,41 33.432,42 32.344,43 4.3,44 5.42}
{0 CHEMBL380595,1 9.467,2 41.3,3 34.8,4 1.043,5 1.147,6 0.69,7 0.686,8 435.47,9 10.9,10 17,11 46,13 20,14 32,16 48,17 19,19 1,20 14,21 4,22 2,23 3,24 16,25 11,26 1,28 5,29 2,31 1,32 30,33 1,34 3,35 4.3,36 0.104,37 5,38 44.5,39 47.963,40 52.756,41 31.728,42 31.561,43 6.5,44 4.668}
{0 CHEMBL381158,1 10.884,2 43.6,3 28.2,4 1.056,5 1.137,6 0.74,7 0.735,8 424.46,9 10.3,10 17,11 39,13 20,14 30,16 41,17 17,19 1,20 14,21 2,22 2,23 3,24 11,25 11,26 2,28 4,29 2,31 2,32 28,33 1,34 3,35 5.1,36 0.098,37 4,38 42.5,39 41.171,40 44.347,41 28.847,42 28.673,43 7.7,44 6.699}
{0 CHEMBL381251,1 9.147,2 34.1,3 38.6,4 1.047,5 1.165,6 0.653,7 0.65,8 402.45,9 13.6,10 11,11 44,13 14,14 28,16 45,17 15,19 1,20 8,21 6,22 2,23 3,24 17,25 12,26 1,28 6,29 2,31 1,32 27,33 1,34 3,35 4.5,36 0.133,37 6,38 37.5,39 46.065,40 51.254,41 28.733,42 28.583,43 6.8,44 5.347}
{0 CHEMBL381304,1 8.927,2 37.5,3 39.6,4 1.041,5 1.152,6 0.66,7 0.652,8 428.48,9 8.3,10 11,11 48,13 14,14 31,16 50,17 18,19 1,20 8,21 9,22 2,23 3,24 19,25 11,26 1,28 4,29 3,31 1,32 29,33 1,34 3,35 6.3,36 0.08,37 4,38 40.5,39 49.956,40 55.297,41 31.699,42 31.308,43 6.3,44 5.097}
{0 CHEMBL381363,1 9.21,2 37.8,3 37.8,4 1.046,5 1.153,6 0.665,7 0.662,8 414.45,9 8.9,10 11,11 45,13 14,14 30,16 47,17 17,19 1,20 8,21 8,22 2,23 3,24 17,25 11,26 1,28 4,29 3,31 1,32 28,33 1,34 3,35 6.7,36 0.085,37 4,38 39.5,39 47.072,40 51.882,41 29.938,42 29.781,43 6.7,44 5.119}
{0 CHEMBL381716,1 9.21,2 37.8,3 37.8,4 1.046,5 1.153,6 0.665,7 0.662,8 414.45,9 8.9,10 11,11 45,13 14,14 30,16 47,17 17,19 1,20 8,21 8,22 2,23 3,24 17,25 11,26 1,28 4,29 3,31 1,32 28,33 1,34 3,35 6.7,36 0.106,37 5,38 39.5,39 47.072,40 51.882,41 29.938,42 29.781,43 6.7,44 6.398}
{0 CHEMBL381834,1 9.749,2 43.5,3 32.6,4 1.048,5 1.141,6 0.699,7 0.701,8 448.46,9 8.7,10 22,11 46,13 24,14 34,16 49,17 20,20 17,21 3,22 2,23 3,24 15,25 11,26 1,28 4,29 3,31 1,32 31,34 3,35 6.5,36 0.082,37 4,38 47,39 48.189,40 52.467,41 32.176,42 32.255,43 6.5,44 4.896}
{0 CHEMBL381879,1 8.921,2 35.6,3 40,4 1.041,5 1.159,6 0.655,7 0.646,8 401.46,9 11.1,10 11,11 45,13 14,14 28,16 46,17 16,19 1,20 8,21 7,22 2,23 3,24 18,25 11,26 1,28 5,29 2,31 1,32 27,33 1,34 3,35 4.4,36 0.109,37 5,38 37.5,39 46.847,40 52.171,41 29.489,42 29.088,43 6.7,44 4.301}
{0 CHEMBL381971,1 10.275,2 36.8,3 34.2,4 1.054,5 1.152,6 0.7,7 0.689,8 390.45,9 10.5,10 11,11 38,13 14,14 26,16 39,17 14,19 1,20 8,21 5,22 2,23 3,24 13,25 11,26 2,28 4,29 2,31 2,32 25,33 1,34 3,35 5.3,36 0.128,37 5,38 35.5,39 40.054,40 43.762,41 26.608,42 26.2,43 7.9,44 6.699}
{0 CHEMBL382095,1 8.921,2 35.6,3 40,4 1.041,5 1.159,6 0.655,7 0.646,8 401.46,9 11.1,10 11,11 45,13 14,14 28,16 46,17 16,19 1,20 8,21 7,22 2,23 3,24 18,25 11,26 1,28 5,29 2,31 1,32 27,33 1,34 3,35 4.4,36 0.13,37 6,38 37.5,39 46.847,40 52.171,41 29.489,42 29.088,43 6.7,44 5.174}
{0 CHEMBL382524,1 8.724,2 36.7,3 40.8,4 1.035,5 1.155,6 0.658,7 0.645,8 427.5,9 10.2,10 11,11 49,13 14,14 31,16 51,17 18,19 1,20 8,21 9,22 2,23 3,24 20,25 11,26 1,28 5,29 2,31 1,32 29,33 1,34 3,35 4.1,36 0.078,37 4,38 40.5,39 50.731,40 56.586,41 32.25,42 31.615,43 6.1,44 4.967}
{0 CHEMBL383064,1 10.634,2 45.5,3 29.5,4 1.055,5 1.134,6 0.728,7 0.729,8 467.88,9 6.8,10 22,11 44,13 24,14 34,16 47,17 20,18 1,20 18,21 2,22 2,23 3,24 13,25 11,26 2,28 3,29 3,31 1,32 31,34 4,35 6.8,36 0.085,37 4,38 47,39 46.411,40 49.913,41 32.029,42 32.061,43 9.1,44 4.301}
{0 CHEMBL383151,1 9.358,2 34.8,3 37,4 1.052,5 1.162,6 0.656,7 0.659,8 430.46,9 13,10 11,11 46,13 14,14 31,16 48,17 16,19 1,20 8,21 7,22 2,23 3,24 17,25 13,26 1,28 6,29 3,31 1,32 29,33 1,34 3,35 6.5,36 0.063,37 3,38 40.5,39 48.392,40 53.464,41 30.188,42 30.297,43 6.5,44 4.301}
{0 CHEMBL383207,1 9.473,2 36.6,3 36.6,4 1.053,5 1.158,6 0.663,7 0.665,8 388.41,9 9.8,10 11,11 41,13 14,14 27,16 42,17 15,19 1,20 8,21 6,22 2,23 3,24 15,25 11,26 1,28 4,29 3,31 1,32 26,33 1,34 3,35 7.3,36 0.119,37 5,38 36.5,39 43.189,40 47.467,41 27.176,42 27.255,43 7.3,44 5}
{0 CHEMBL383210,1 10.477,2 44.2,3 30.2,4 1.048,5 1.134,6 0.735,7 0.726,8 450.5,9 9.3,10 22,11 43,13 24,14 33,16 46,17 19,20 17,21 2,22 2,23 3,24 13,25 11,26 2,28 4,29 2,31 2,32 30,34 3,35 4.7,36 0.087,37 4,38 46,39 45.054,40 48.762,41 31.608,42 31.2,43 7,44 4.301}
{0 CHEMBL383272,1 10.098,2 43.5,3 32.6,4 1.042,5 1.134,6 0.725,7 0.711,8 464.53,9 8.7,10 22,11 46,13 24,14 34,16 49,17 20,20 17,21 3,22 2,23 3,24 15,25 11,26 2,28 4,29 2,31 2,32 31,34 3,35 4.3,36 0.082,37 4,38 47,39 47.938,40 52.178,41 33.37,42 32.727,43 6.5,44 4.81}
{0 CHEMBL383409,1 9.851,2 45.5,3 31.8,4 1.047,5 1.136,6 0.708,7 0.71,8 433.44,9 6.8,10 22,11 44,13 24,14 33,16 47,17 20,20 18,21 2,22 2,23 3,24 14,25 10,26 1,28 3,29 3,31 1,32 30,34 3,35 6.8,36 0.085,37 4,38 46,39 46.087,40 49.969,41 31.171,42 31.233,43 6.8,44 5.301}
{0 CHEMBL413045,1 9.146,2 36.4,3 38.6,4 1.047,5 1.156,6 0.658,7 0.654,8 402.44,9 9.1,10 11,11 44,13 14,14 28,16 45,17 16,19 1,20 8,21 7,22 2,23 3,24 17,25 11,26 1,28 4,29 3,31 1,32 27,33 1,34 3,35 6.8,36 0.111,37 5,38 37.5,39 46.072,40 50.882,41 28.938,42 28.781,43 6.8,44 4.928}
{0 CHEMBL426117,1 9.439,2 42.9,3 34.7,4 1.042,5 1.14,6 0.693,7 0.689,8 462.49,9 8.2,10 17,11 49,13 20,14 35,16 52,17 21,19 1,20 14,21 6,22 2,23 3,24 17,25 11,26 1,28 4,29 3,31 1,32 32,33 1,34 3,35 6.1,36 0.077,37 4,38 47.5,39 51.072,40 55.882,41 33.938,42 33.781,43 6.1,44 7}
{0 CHEMBL426475,1 9.684,2 34.9,3 34.9,4 1.058,5 1.164,6 0.661,7 0.669,8 416.43,9 14,10 11,11 43,13 14,14 30,16 45,17 15,19 1,20 8,21 6,22 2,23 3,24 15,25 13,26 1,28 6,29 3,31 1,32 28,33 1,34 3,35 7,36 0.111,37 5,38 39.5,39 45.509,40 50.048,41 28.426,42 28.771,43 7,44 4.836}
{0 CHEMBL427380,1 9.203,2 36.2,3 40.4,4 1.036,5 1.149,6 0.679,7 0.655,8 432.54,9 8.5,10 11,11 47,13 14,14 29,16 48,17 17,19 1,20 8,21 8,22 2,23 3,24 19,25 11,26 2,28 4,29 2,31 2,32 28,33 1,34 3,35 4.3,36 0.146,37 7,38 38.5,39 48.705,40 54.008,41 31.892,42 30.781,43 6.4,44 5.481}
{0 CHEMBL443302,1 10.533,2 41.5,3 31.7,4 1.059,5 1.144,6 0.708,7 0.709,8 431.85,9 7.3,10 17,11 41,13 19,14 30,16 43,17 17,18 1,20 14,21 3,22 2,23 3,24 13,25 11,26 2,28 3,29 3,31 1,32 28,34 4,35 7.3,36 0.093,37 4,38 40.5,39 43.411,40 46.913,41 29.029,42 29.061,43 9.8,44 4.301}
