{
  "data_qualities": {
    "quality": [
      {
        "name": "AutoCorrelation",
        "value": "0.04679056386651173"
      },
      {
        "name": "ClassEntropy",
        "value": []
      },
      {
        "name": "Dimensionality",
        "value": "0.05980448533640023"
      },
      {
        "name": "EquivalentNumberOfAtts",
        "value": []
      },
      {
        "name": "MajorityClassPercentage",
        "value": []
      },
      {
        "name": "MajorityClassSize",
        "value": []
      },
      {
        "name": "MaxAttributeEntropy",
        "value": []
      },
      {
        "name": "MaxKurtosisOfNumericAtts",
        "value": "103.99901336457488"
      },
      {
        "name": "MaxMeansOfNumericAtts",
        "value": "6.188455434157562"
      },
      {
        "name": "MaxMutualInformation",
        "value": []
      },
      {
        "name": "MaxNominalAttDistinctValues",
        "value": []
      },
      {
        "name": "MaxSkewnessOfNumericAtts",
        "value": "10.289771949510573"
      },
      {
        "name": "MaxStdDevOfNumericAtts",
        "value": "1.1360110508992978"
      },
      {
        "name": "MeanAttributeEntropy",
        "value": []
      },
      {
        "name": "MeanKurtosisOfNumericAtts",
        "value": "18.368681560495528"
      },
      {
        "name": "MeanMeansOfNumericAtts",
        "value": "0.18216988895526384"
      },
      {
        "name": "MeanMutualInformation",
        "value": []
      },
      {
        "name": "MeanNoiseToSignalRatio",
        "value": []
      },
      {
        "name": "MeanNominalAttDistinctValues",
        "value": []
      },
      {
        "name": "MeanSkewnessOfNumericAtts",
        "value": "3.7413460711771482"
      },
      {
        "name": "MeanStdDevOfNumericAtts",
        "value": "0.27476329466010097"
      },
      {
        "name": "MinAttributeEntropy",
        "value": []
      },
      {
        "name": "MinKurtosisOfNumericAtts",
        "value": "-2.0021436334142586"
      },
      {
        "name": "MinMeansOfNumericAtts",
        "value": "0.009200690051753687"
      },
      {
        "name": "MinMutualInformation",
        "value": []
      },
      {
        "name": "MinNominalAttDistinctValues",
        "value": []
      },
      {
        "name": "MinSkewnessOfNumericAtts",
        "value": "-3.0863267343032055"
      },
      {
        "name": "MinStdDevOfNumericAtts",
        "value": "0.09550540552837126"
      },
      {
        "name": "MinorityClassPercentage",
        "value": []
      },
      {
        "name": "MinorityClassSize",
        "value": []
      },
      {
        "name": "NumberOfBinaryFeatures",
        "value": "0.0"
      },
      {
        "name": "NumberOfClasses",
        "value": "0.0"
      },
      {
        "name": "NumberOfFeatures",
        "value": "104.0"
      },
      {
        "name": "NumberOfInstances",
        "value": "1739.0"
      },
      {
        "name": "NumberOfInstancesWithMissingValues",
        "value": "0.0"
      },
      {
        "name": "NumberOfMissingValues",
        "value": "0.0"
      },
      {
        "name": "NumberOfNumericFeatures",
        "value": "103.0"
      },
      {
        "name": "NumberOfSymbolicFeatures",
        "value": "1.0"
      },
      {
        "name": "PercentageOfBinaryFeatures",
        "value": "0.0"
      },
      {
        "name": "PercentageOfInstancesWithMissingValues",
        "value": "0.0"
      },
      {
        "name": "PercentageOfMissingValues",
        "value": "0.0"
      },
      {
        "name": "PercentageOfNumericFeatures",
        "value": "99.03846153846155"
      },
      {
        "name": "PercentageOfSymbolicFeatures",
        "value": "0.9615384615384616"
      },
      {
        "name": "Quartile1AttributeEntropy",
        "value": []
      },
      {
        "name": "Quartile1KurtosisOfNumericAtts",
        "value": "1.5416232533786176"
      },
      {
        "name": "Quartile1MeansOfNumericAtts",
        "value": "0.03220241518113827"
      },
      {
        "name": "Quartile1MutualInformation",
        "value": []
      },
      {
        "name": "Quartile1SkewnessOfNumericAtts",
        "value": "1.8462138391044842"
      },
      {
        "name": "Quartile1StdDevOfNumericAtts",
        "value": "0.17658808399658205"
      },
      {
        "name": "Quartile2AttributeEntropy",
        "value": []
      },
      {
        "name": "Quartile2KurtosisOfNumericAtts",
        "value": "9.130653481458962"
      },
      {
        "name": "Quartile2MeansOfNumericAtts",
        "value": "0.07130534790109247"
      },
      {
        "name": "Quartile2MutualInformation",
        "value": []
      },
      {
        "name": "Quartile2SkewnessOfNumericAtts",
        "value": "3.334689454640439"
      },
      {
        "name": "Quartile2StdDevOfNumericAtts",
        "value": "0.25740823033214977"
      },
      {
        "name": "Quartile3AttributeEntropy",
        "value": []
      },
      {
        "name": "Quartile3KurtosisOfNumericAtts",
        "value": "26.165464431728516"
      },
      {
        "name": "Quartile3MeansOfNumericAtts",
        "value": "0.1610120759056923"
      },
      {
        "name": "Quartile3MutualInformation",
        "value": []
      },
      {
        "name": "Quartile3SkewnessOfNumericAtts",
        "value": "5.30427876287049"
      },
      {
        "name": "Quartile3StdDevOfNumericAtts",
        "value": "0.36443444377783324"
      },
      {
        "name": "StdvNominalAttDistinctValues",
        "value": []
      }
    ]
  }
}