{
  "data_set_description": {
    "collection_date": "November 2013",
    "creator": "Dr Jeremy Besnard, Dr Ivan Olier, Dr Noureddin Sadawi, Dr Larisa Soldatova, Dr Crina Grosan, Prof Ross King, Dr Richard Bickerton, Prof Andrew Hopkins and Dr Willem van Hoorn",
    "default_target_attribute": "pXC50",
    "description": "This dataset contains QSAR data (from ChEMBL version 17) showing activity values (unit is pseudo-pCI50) of several compounds on drug target ChEMBL_ID: CHEMBL2378 (TID: 11922), and it has 92 rows and 1258 features (not including molecule IDs and class feature: molecule_id and pXC50). The features represent Molecular Descriptors which were generated from SMILES strings. Missing value imputation was applied to this dataset (By choosing the Median).",
    "description_version": "1",
    "file_id": "3374828",
    "format": "ARFF",
    "id": "28842",
    "licence": "Public",
    "md5_checksum": "408727489df048a3191b65b319f5baaf",
    "minio_url": "https://data.openml.org/datasets/0002/28842/dataset_28842.pq",
    "name": "QSAR-DATASET-FOR-DRUG-TARGET-CHEMBL2378",
    "original_data_url": "https://www.ebi.ac.uk/chembl/target/inspect/CHEMBL2378",
    "parquet_url": "https://data.openml.org/datasets/0002/28842/dataset_28842.pq",
    "processing_date": "2018-10-04 01:07:56",
    "row_id_attribute": "molecule_id",
    "status": "deactivated",
    "tag": [
      "MetaQSAR",
      "study_13"
    ],
    "upload_date": "2016-07-15T01:01:16",
    "url": "https://api.openml.org/data/v1/download/3374828/QSAR-DATASET-FOR-DRUG-TARGET-CHEMBL2378.arff",
    "version": "9",
    "visibility": "public"
  }
}