{
  "data_set_description": {
    "collection_date": "November 2013",
    "creator": "Dr Jeremy Besnard, Dr Ivan Olier, Dr Noureddin Sadawi, Dr Larisa Soldatova, Dr Crina Grosan, Prof Ross King, Dr Richard Bickerton, Prof Andrew Hopkins and Dr Willem van Hoorn",
    "default_target_attribute": "pXC50",
    "description": "This dataset contains QSAR data (from ChEMBL version 17) showing activity values (unit is pseudo-pCI50) of several compounds on drug target ChEMBL_ID: CHEMBL2723 (TID: 11045), and it has 25 rows and 43 features (not including molecule IDs and class feature: molecule_id and pXC50). The features represent Basic Molecular Descriptors which were generated from SMILES strings.  Missing value imputation was applied to this dataset (By choosing the Median).",
    "description_version": "1",
    "file_id": "3372923",
    "format": "ARFF",
    "id": "28783",
    "licence": "Public",
    "md5_checksum": "096784de65859b8aaf4f2d41de6f9589",
    "minio_url": "https://data.openml.org/datasets/0002/28783/dataset_28783.pq",
    "name": "QSAR-DATASET-FOR-DRUG-TARGET-CHEMBL2723",
    "original_data_url": "https://www.ebi.ac.uk/chembl/target/inspect/CHEMBL2723",
    "parquet_url": "https://data.openml.org/datasets/0002/28783/dataset_28783.pq",
    "processing_date": "2018-10-04 01:09:21",
    "row_id_attribute": "molecule_id",
    "status": "deactivated",
    "tag": [
      "MetaQSAR",
      "study_13"
    ],
    "upload_date": "2016-07-15T00:52:21",
    "url": "https://api.openml.org/data/v1/download/3372923/QSAR-DATASET-FOR-DRUG-TARGET-CHEMBL2723.arff",
    "version": "7",
    "visibility": "public"
  }
}