"molecule_id","AMW","C.","H.","Me","Mi","Mp","Mv","MW","N.","nAB","nAT","nB","nBM","nBO","nBR","nBT","nC","nCL","nCsp","nCsp2","nCsp3","nDB","nF","nH","nHet","nHM","nI","nN","nO","nP","nS","nSK","nTB","nX","O.","RBF","RBN","SCBO","Se","Si","Sp","Sv","X.","pXC50"
{1 7.512,2 40,3 50,4 0.99,5 1.115,6 0.687,7 0.623,8 375.6,9 2,10 10,11 50,13 12,14 27,16 52,17 20,20 11,21 9,22 2,24 25,25 5,26 2,28 1,29 2,31 2,32 25,35 4,36 0.115,37 6,38 34,39 49.512,40 55.74,41 34.347,42 31.147,44 5.636}
{0 CHEMBL1695,1 7.512,2 40,3 50,4 0.99,5 1.115,6 0.687,7 0.623,8 375.6,9 2,10 10,11 50,13 12,14 27,16 52,17 20,20 11,21 9,22 2,24 25,25 5,26 2,28 1,29 2,31 2,32 25,35 4,36 0.115,37 6,38 34,39 49.512,40 55.74,41 34.347,42 31.147,44 7.174}
{0 CHEMBL363892,1 6.655,2 37.5,3 52.1,4 1,5 1.132,6 0.624,7 0.588,8 319.44,9 2.1,10 6,11 48,13 9,14 23,16 48,17 18,20 10,21 8,22 3,24 25,25 5,28 1,29 4,32 23,35 8.3,36 0.208,37 10,38 29,39 48.014,40 54.318,41 29.961,42 28.202,44 5.484}
{0 CHEMBL366270,1 6.655,2 37.5,3 52.1,4 1,5 1.132,6 0.624,7 0.588,8 319.44,9 2.1,10 6,11 48,13 9,14 23,16 48,17 18,20 10,21 8,22 3,24 25,25 5,28 1,29 4,32 23,35 8.3,36 0.208,37 10,38 29,39 48.014,40 54.318,41 29.961,42 28.202,44 5.599}
{0 CHEMBL536101,1 7.852,2 38,3 48,4 1.001,5 1.121,6 0.681,7 0.627,8 392.59,9 4,10 10,11 50,13 12,14 28,16 52,17 19,20 10,21 9,22 2,24 24,25 7,26 2,28 2,29 3,31 2,32 26,35 6,36 0.135,37 7,38 35,39 50.058,40 56.032,41 34.046,42 31.356,44 7.387}
{0 CHEMBL538530,1 6.501,2 39.3,3 52.5,4 0.991,5 1.129,6 0.636,7 0.592,8 396.58,9 3.3,10 12,11 61,13 13,14 31,16 63,17 24,20 13,21 11,22 1,24 32,25 5,28 2,29 3,32 29,35 4.9,36 0.175,37 11,38 38,39 60.44,40 68.853,41 38.796,42 36.089,44 5.523}
{0 CHEMBL538770,1 8.242,2 43.1,3 45.1,4 1.007,5 1.118,6 0.691,7 0.65,8 420.36,9 2,10 12,11 51,13 14,14 30,16 53,17 22,18 2,20 15,21 7,22 2,24 23,25 6,26 2,28 1,29 3,32 28,34 2,35 5.9,36 0.132,37 7,38 38,39 51.334,40 56.997,41 35.222,42 33.142,43 3.9,44 6.697}
{0 CHEMBL538782,1 6.559,2 41.7,3 51.7,4 0.989,5 1.123,6 0.647,7 0.601,8 393.57,9 1.7,10 12,11 60,13 14,14 31,16 62,17 25,20 15,21 10,22 2,24 31,25 4,28 1,29 3,32 29,35 5,36 0.129,37 8,38 39,39 59.338,40 67.355,41 38.79,42 36.068,44 6.943}
{0 CHEMBL539028,1 8.303,2 43.1,3 41.2,4 1.034,5 1.146,6 0.652,7 0.647,8 423.44,9 2,10 12,11 51,13 14,14 32,16 53,17 22,20 15,21 7,22 2,23 4,24 21,25 8,28 1,29 3,32 30,34 4,35 5.9,36 0.132,37 7,38 40,39 52.738,40 58.468,41 33.256,42 33.021,43 7.8,44 7.292}
{0 CHEMBL539284,1 7.518,2 43.6,3 45.5,4 1.011,5 1.131,6 0.657,7 0.632,8 413.5,9 1.8,10 12,11 55,13 15,14 32,16 57,17 24,20 17,21 7,22 3,23 2,24 25,25 6,28 1,29 3,32 30,34 2,35 5.5,36 0.123,37 7,38 41,39 55.596,40 62.204,41 36.142,42 34.781,43 3.6,44 7.102}
{0 CHEMBL539539,1 6.595,2 43.4,3 50.9,4 0.986,5 1.119,6 0.657,7 0.609,8 349.51,9 1.9,10 12,11 53,13 14,14 28,16 55,17 23,20 15,21 8,22 2,24 27,25 3,28 1,29 2,32 26,35 3.8,36 0.127,37 7,38 36,39 52.243,40 59.315,41 34.813,42 32.299,44 7}
{0 CHEMBL539546,1 7.294,2 39.6,3 49.1,4 0.997,5 1.123,6 0.663,7 0.617,8 386.56,9 3.8,10 11,11 53,13 13,14 29,16 55,17 21,20 12,21 9,22 2,24 26,25 6,26 1,28 2,29 3,31 1,32 27,35 5.7,36 0.127,37 7,38 36.5,39 52.865,40 59.527,41 35.159,42 32.696,44 6.583}
{0 CHEMBL539775,1 6.892,2 43.1,3 49,4 0.994,5 1.12,6 0.657,7 0.617,8 351.48,9 2,10 12,11 51,13 14,14 28,16 53,17 22,20 15,21 7,22 2,24 25,25 4,28 1,29 3,32 26,35 5.9,36 0.132,37 7,38 36,39 50.687,40 57.109,41 33.506,42 31.487,44 6.983}
{0 CHEMBL540051,1 8.303,2 43.1,3 41.2,4 1.034,5 1.146,6 0.652,7 0.647,8 423.44,9 2,10 12,11 51,13 14,14 32,16 53,17 22,20 15,21 7,22 2,23 4,24 21,25 8,28 1,29 3,32 30,34 4,35 5.9,36 0.132,37 7,38 40,39 52.738,40 58.468,41 33.256,42 33.021,43 7.8,44 6.747}
{0 CHEMBL540052,1 8.489,2 42,3 40,4 1.039,5 1.151,6 0.65,7 0.65,8 424.43,9 4,10 12,11 50,13 14,14 32,16 52,17 21,20 14,21 7,22 2,23 4,24 20,25 9,28 2,29 3,32 30,34 4,35 6,36 0.135,37 7,38 40,39 51.956,40 57.551,41 32.5,42 32.515,43 8,44 6.987}
{0 CHEMBL540076,1 6.192,2 39.4,3 54.5,4 0.983,5 1.128,6 0.634,7 0.582,8 408.64,9 3,10 12,11 66,13 13,14 32,16 68,17 26,20 13,21 13,22 1,24 36,25 4,28 2,29 2,32 30,35 3,36 0.176,37 12,38 39,39 64.879,40 74.474,41 41.864,42 38.428,44 5.888}
{0 CHEMBL540308,1 7.294,2 39.6,3 49.1,4 0.997,5 1.123,6 0.663,7 0.617,8 386.56,9 3.8,10 11,11 53,13 13,14 29,16 55,17 21,20 12,21 9,22 2,24 26,25 6,26 1,28 2,29 3,31 1,32 27,35 5.7,36 0.127,37 7,38 36.5,39 52.865,40 59.527,41 35.159,42 32.696,44 7.081}
{0 CHEMBL540309,1 7.294,2 39.6,3 49.1,4 0.997,5 1.123,6 0.663,7 0.617,8 386.56,9 3.8,10 11,11 53,13 13,14 29,16 55,17 21,20 12,21 9,22 2,24 26,25 6,26 1,28 2,29 3,31 1,32 27,35 5.7,36 0.127,37 7,38 36.5,39 52.865,40 59.527,41 35.159,42 32.696,44 6.106}
{0 CHEMBL540825,1 6.915,2 41.5,3 49.1,4 0.996,5 1.125,6 0.651,7 0.613,8 366.5,9 3.8,10 12,11 53,13 14,14 29,16 55,17 22,20 14,21 8,22 2,24 26,25 5,28 2,29 3,32 27,35 5.7,36 0.145,37 8,38 37,39 52.789,40 59.607,41 34.512,42 32.509,44 5.125}
{0 CHEMBL540827,1 7.567,2 43.1,3 47.1,4 1,5 1.119,6 0.674,7 0.634,8 385.92,9 2,10 12,11 51,13 14,14 29,16 53,17 22,18 1,20 15,21 7,22 2,24 24,25 5,26 1,28 1,29 3,32 27,34 1,35 5.9,36 0.132,37 7,38 37,39 51.011,40 57.053,41 34.364,42 32.315,43 2,44 7.921}
{0 CHEMBL541053,1 6.563,2 41.1,3 51.8,4 0.99,5 1.124,6 0.643,7 0.599,8 367.53,9 1.8,10 12,11 56,13 13,14 29,16 58,17 23,20 13,21 10,22 1,24 29,25 4,28 1,29 3,32 27,35 5.4,36 0.155,37 9,38 36,39 55.454,40 62.939,41 36.029,42 33.541,44 7.26}
{0 CHEMBL541073,1 7.294,2 39.6,3 49.1,4 0.997,5 1.123,6 0.663,7 0.617,8 386.56,9 3.8,10 11,11 53,13 13,14 29,16 55,17 21,20 12,21 9,22 2,24 26,25 6,26 1,28 2,29 3,31 1,32 27,35 5.7,36 0.127,37 7,38 36.5,39 52.865,40 59.527,41 35.159,42 32.696,44 7.106}
{0 CHEMBL541093,1 6.769,2 42.6,3 50,4 0.992,5 1.121,6 0.653,7 0.611,8 365.51,9 1.9,10 12,11 54,13 14,14 29,16 56,17 23,20 15,21 8,22 2,24 27,25 4,28 1,29 3,32 27,35 5.6,36 0.161,37 9,38 37,39 53.571,40 60.524,41 35.267,42 33.014,44 7.319}
{0 CHEMBL541580,1 7.866,2 44.9,3 42.9,4 1.017,5 1.13,6 0.666,7 0.647,8 385.44,9 2,10 12,11 49,13 15,14 30,16 51,17 22,20 17,21 5,22 3,23 2,24 21,25 6,28 1,29 3,32 28,34 2,35 6.1,36 0.137,37 7,38 39,39 49.829,40 55.373,41 32.62,42 31.727,43 4.1,44 6.461}
{0 CHEMBL541861,1 6.528,2 40.7,3 51.9,4 0.988,5 1.126,6 0.645,7 0.599,8 352.52,9 3.7,10 12,11 54,13 13,14 28,16 56,17 22,20 13,21 9,22 1,24 28,25 4,28 2,29 2,32 26,35 3.7,36 0.143,37 8,38 35,39 53.345,40 60.813,41 34.819,42 32.321,44 5.584}
{0 CHEMBL541863,1 6.343,2 40,3 53.3,4 0.985,5 1.127,6 0.639,7 0.59,8 380.58,9 3.3,10 12,11 60,13 13,14 30,16 62,17 24,20 13,21 11,22 1,24 32,25 4,28 2,29 2,32 28,35 3.3,36 0.145,37 9,38 37,39 59.112,40 67.643,41 38.341,42 35.374,44 5.244}
{0 CHEMBL542205,1 9.147,2 42,3 40,4 1.032,5 1.135,6 0.687,7 0.668,8 457.33,9 4,10 12,11 50,13 14,14 32,16 52,17 21,18 2,20 14,21 7,22 2,23 2,24 20,25 9,26 2,28 2,29 3,32 30,34 4,35 6,36 0.135,37 7,38 40,39 51.578,40 56.759,41 34.341,42 33.404,43 8,44 7}
{0 CHEMBL542207,1 8.768,2 42.6,3 38.9,4 1.049,5 1.159,6 0.646,7 0.654,8 473.45,9 1.9,10 12,11 54,13 14,14 35,16 56,17 23,20 15,21 8,22 2,23 6,24 21,25 10,28 1,29 3,32 33,34 6,35 5.6,36 0.125,37 7,38 43,39 56.647,40 62.562,41 34.892,42 35.314,43 11.1,44 6.357}
{0 CHEMBL542209,1 7.565,2 41.5,3 47.2,4 1.002,5 1.124,6 0.667,7 0.629,8 400.94,9 3.8,10 12,11 53,13 14,14 30,16 55,17 22,18 1,20 14,21 8,22 2,24 25,25 6,26 1,28 2,29 3,32 28,34 1,35 5.7,36 0.127,37 7,38 38,39 53.112,40 59.551,41 35.37,42 33.336,43 1.9,44 6.695}
{0 CHEMBL542233,1 6.343,2 40,3 53.3,4 0.985,5 1.127,6 0.639,7 0.59,8 380.58,9 3.3,10 12,11 60,13 13,14 30,16 62,17 24,20 13,21 11,22 1,24 32,25 4,28 2,29 2,32 28,35 3.3,36 0.161,37 10,38 37,39 59.112,40 67.643,41 38.341,42 35.374,44 6.181}
{0 CHEMBL542241,1 6.316,2 41.9,3 53.2,4 0.982,5 1.122,6 0.647,7 0.595,8 391.6,9 1.6,10 12,11 62,13 14,14 31,16 64,17 26,20 15,21 11,22 2,24 33,25 3,28 1,29 2,32 29,35 3.2,36 0.156,37 10,38 39,39 60.894,40 69.56,41 40.097,42 36.88,44 5.867}
{0 CHEMBL542458,1 7.294,2 39.6,3 49.1,4 0.997,5 1.123,6 0.663,7 0.617,8 386.56,9 3.8,10 11,11 53,13 13,14 29,16 55,17 21,20 12,21 9,22 2,24 26,25 6,26 1,28 2,29 3,31 1,32 27,35 5.7,36 0.127,37 7,38 36.5,39 52.865,40 59.527,41 35.159,42 32.696,44 6.889}
{0 CHEMBL542485,1 6.431,2 40.4,3 52.6,4 0.986,5 1.127,6 0.642,7 0.594,8 366.55,9 3.5,10 12,11 57,13 13,14 29,16 59,17 23,20 13,21 10,22 1,24 30,25 4,28 2,29 2,32 27,35 3.5,36 0.153,37 9,38 36,39 56.229,40 64.228,41 36.58,42 33.848,44 5.86}
{0 CHEMBL542610,1 6.789,2 42,3 50,4 0.994,5 1.122,6 0.65,7 0.61,8 339.47,9 2,10 12,11 50,13 13,14 27,16 52,17 21,20 13,21 8,22 1,24 25,25 4,28 1,29 3,32 25,35 6,36 0.135,37 7,38 34,39 49.687,40 56.109,41 32.506,42 30.487,44 5.852}
{0 CHEMBL542642,1 7.049,2 42,3 48,4 0.998,5 1.124,6 0.655,7 0.62,8 352.47,9 4,10 12,11 50,13 14,14 28,16 52,17 21,20 14,21 7,22 2,24 24,25 5,28 2,29 3,32 26,35 6,36 0.135,37 7,38 36,39 49.905,40 56.192,41 32.75,42 30.982,44 6.863}
{0 CHEMBL542699,1 6.82,2 41.4,3 50,4 0.996,5 1.123,6 0.646,7 0.608,8 395.54,9 1.7,10 12,11 58,13 14,14 31,16 60,17 24,20 15,21 9,22 2,24 29,25 5,28 1,29 4,32 29,35 6.9,36 0.133,37 8,38 39,39 57.781,40 65.149,41 37.483,42 35.256,44 7.081}
{0 CHEMBL542703,1 7.438,2 41.1,3 46.4,4 1.012,5 1.138,6 0.646,7 0.621,8 416.51,9 3.6,10 12,11 56,13 14,14 32,16 58,17 23,20 14,21 9,22 2,23 2,24 26,25 7,28 2,29 3,32 30,34 2,35 5.4,36 0.121,37 7,38 40,39 56.698,40 63.702,41 36.148,42 34.802,43 3.6,44 6.389}
{0 CHEMBL542934,1 7.565,2 41.5,3 47.2,4 1.002,5 1.124,6 0.667,7 0.629,8 400.94,9 3.8,10 12,11 53,13 14,14 30,16 55,17 22,18 1,20 14,21 8,22 2,24 25,25 6,26 1,28 2,29 3,32 28,34 1,35 5.7,36 0.127,37 7,38 38,39 53.112,40 59.551,41 35.37,42 33.336,43 1.9,44 7.032}
{0 CHEMBL542960,1 6.659,2 42.1,3 50.9,4 0.99,5 1.122,6 0.65,7 0.606,8 379.54,9 1.8,10 12,11 57,13 14,14 30,16 59,17 24,20 15,21 9,22 2,24 29,25 4,28 1,29 3,32 28,35 5.3,36 0.136,37 8,38 38,39 56.454,40 63.939,41 37.029,42 34.541,44 6.627}
{0 CHEMBL542965,1 6.769,2 42.6,3 50,4 0.992,5 1.121,6 0.653,7 0.611,8 365.51,9 1.9,10 12,11 54,13 14,14 29,16 56,17 23,20 15,21 8,22 2,24 27,25 4,28 1,29 3,32 27,35 5.6,36 0.143,37 8,38 37,39 53.571,40 60.524,41 35.267,42 33.014,44 6.588}
{0 CHEMBL543107,1 6.7,2 40,3 50.9,4 0.994,5 1.128,6 0.641,7 0.601,8 368.52,9 3.6,10 12,11 55,13 13,14 29,16 57,17 22,20 13,21 9,22 1,24 28,25 5,28 2,29 3,32 27,35 5.5,36 0.158,37 9,38 36,39 54.672,40 62.022,41 35.273,42 33.036,44 7.046}
{0 CHEMBL543167,1 8.828,2 40,3 44,4 1.013,5 1.12,6 0.702,7 0.656,8 441.41,9 4,10 11,11 50,13 13,14 30,16 52,17 20,18 2,20 12,21 8,22 2,24 22,25 8,26 3,28 2,29 3,31 1,32 28,34 2,35 6,36 0.135,37 7,38 37.5,39 50.629,40 56,41 35.114,42 32.824,43 4,44 7.495}
{0 CHEMBL543168,1 7.255,2 41.5,3 47.2,4 1.006,5 1.131,6 0.65,7 0.621,8 384.49,9 3.8,10 12,11 53,13 14,14 30,16 55,17 22,20 14,21 8,22 2,23 1,24 25,25 6,28 2,29 3,32 28,34 1,35 5.7,36 0.127,37 7,38 38,39 53.301,40 59.947,41 34.449,42 32.892,43 1.9,44 7.387}
{0 CHEMBL543169,1 6.795,2 41.1,3 50,4 0.994,5 1.125,6 0.648,7 0.608,8 380.53,9 3.6,10 12,11 56,13 14,14 30,16 58,17 23,20 14,21 9,22 2,24 28,25 5,28 2,29 3,32 28,35 5.4,36 0.121,37 7,38 38,39 55.672,40 63.022,41 36.273,42 34.036,44 6.9}
{0 CHEMBL543204,1 6.467,2 40.7,3 52.5,4 0.989,5 1.125,6 0.641,7 0.594,8 381.56,9 1.7,10 12,11 59,13 13,14 30,16 61,17 24,20 13,21 11,22 1,24 31,25 4,28 1,29 3,32 28,35 5.1,36 0.148,37 9,38 37,39 58.338,40 66.355,41 37.79,42 35.068,44 7.066}
{0 CHEMBL543400,1 8.054,2 38.3,3 46.8,4 1.004,5 1.12,6 0.687,7 0.635,8 378.56,9 4.3,10 10,11 47,13 12,14 27,16 49,17 18,20 10,21 8,22 2,24 22,25 7,26 2,28 2,29 3,31 2,32 25,35 6.4,36 0.143,37 7,38 34,39 47.174,40 52.617,41 32.284,42 29.829,44 7.131}
{0 CHEMBL543403,1 7.213,2 40.8,3 46.9,4 1.003,5 1.128,6 0.653,7 0.622,8 353.46,9 6.1,10 12,11 49,13 14,14 28,16 51,17 20,20 13,21 7,22 2,24 23,25 6,28 3,29 3,32 26,35 6.1,36 0.137,37 7,38 36,39 49.123,40 55.275,41 31.995,42 30.477,44 5.684}
{0 CHEMBL543404,1 7.455,2 38.9,3 48.1,4 1.004,5 1.125,6 0.66,7 0.619,8 402.56,9 3.7,10 11,11 54,13 13,14 30,16 56,17 21,20 12,21 9,22 2,24 26,25 7,26 1,28 2,29 4,31 1,32 28,35 7.4,36 0.143,37 8,38 37.5,39 54.192,40 60.737,41 35.614,42 33.411,44 7.06}
{0 CHEMBL543557,1 6.71,2 44,3 50,4 0.987,5 1.118,6 0.661,7 0.615,8 335.48,9 2,10 12,11 50,13 14,14 27,16 52,17 22,20 15,21 7,22 2,24 25,25 3,28 1,29 2,32 25,35 4,36 0.115,37 6,38 35,39 49.36,40 55.9,41 33.052,42 30.773,44 6.483}
{0 CHEMBL543642,1 7.352,2 39.6,3 50.9,4 0.989,5 1.116,6 0.681,7 0.616,8 389.63,9 1.9,10 10,11 53,13 12,14 28,16 55,17 21,20 11,21 10,22 2,24 27,25 5,26 2,28 1,29 2,31 2,32 26,35 3.8,36 0.127,37 7,38 35,39 52.396,40 59.155,41 36.108,42 32.674,44 6.475}
{0 CHEMBL543676,1 6.502,2 40,3 52.3,4 0.99,5 1.127,6 0.639,7 0.594,8 422.62,9 3.1,10 12,11 65,13 14,14 33,16 67,17 26,20 14,21 12,22 2,24 34,25 5,28 2,29 3,32 31,35 4.6,36 0.164,37 11,38 41,39 64.323,40 73.268,41 41.557,42 38.616,44 5.046}
{0 CHEMBL543880,1 7.14,2 40.7,3 50,4 0.993,5 1.119,6 0.665,7 0.615,8 385.57,9 1.9,10 11,11 54,13 13,14 29,16 56,17 22,20 13,21 9,22 2,24 27,25 5,26 1,28 1,29 3,31 1,32 27,35 5.6,36 0.125,37 7,38 36.5,39 53.647,40 60.444,41 35.915,42 33.201,44 7.77}
{0 CHEMBL543881,1 8.948,2 43.1,3 41.2,4 1.027,5 1.131,6 0.688,7 0.665,8 456.34,9 2,10 12,11 51,13 14,14 32,16 53,17 22,18 2,20 15,21 7,22 2,23 2,24 21,25 8,26 2,28 1,29 3,32 30,34 4,35 5.9,36 0.132,37 7,38 40,39 52.36,40 57.676,41 35.097,42 33.909,43 7.8,44 7.18}
{0 CHEMBL543882,1 7.049,2 42,3 48,4 0.998,5 1.124,6 0.655,7 0.62,8 352.47,9 4,10 12,11 50,13 14,14 28,16 52,17 21,20 14,21 7,22 2,24 24,25 5,28 2,29 3,32 26,35 6,36 0.135,37 7,38 36,39 49.905,40 56.192,41 32.75,42 30.982,44 6.375}
{0 CHEMBL543883,1 7.567,2 43.1,3 47.1,4 1,5 1.119,6 0.674,7 0.634,8 385.92,9 2,10 12,11 51,13 14,14 29,16 53,17 22,18 1,20 15,21 7,22 2,24 24,25 5,26 1,28 1,29 3,32 27,34 1,35 5.9,36 0.132,37 7,38 37,39 51.011,40 57.053,41 34.364,42 32.315,43 2,44 7.284}
{0 CHEMBL543908,1 6.637,2 41.2,3 51,4 0.989,5 1.125,6 0.648,7 0.604,8 338.49,9 3.9,10 12,11 51,13 13,14 27,16 53,17 21,20 13,21 8,22 1,24 26,25 4,28 2,29 2,32 25,35 3.9,36 0.132,37 7,38 34,39 50.461,40 57.398,41 33.057,42 30.794,44 5.046}
{0 CHEMBL543913,1 6.264,2 39.7,3 54,4 0.984,5 1.128,6 0.637,7 0.586,8 394.61,9 3.2,10 12,11 63,13 13,14 31,16 65,17 25,20 13,21 12,22 1,24 34,25 4,28 2,29 2,32 29,35 3.2,36 0.169,37 11,38 38,39 61.996,40 71.059,41 40.103,42 36.901,44 6.635}
{0 CHEMBL544119,1 7.102,2 42.6,3 48.1,4 1.002,5 1.127,6 0.652,7 0.618,8 383.5,9 1.9,10 12,11 54,13 14,14 30,16 56,17 23,20 15,21 8,22 2,23 1,24 26,25 5,28 1,29 3,32 28,34 1,35 5.6,36 0.125,37 7,38 38,39 54.083,40 60.864,41 35.205,42 33.398,43 1.9,44 7.553}
{0 CHEMBL544120,1 7.294,2 39.6,3 49.1,4 0.997,5 1.123,6 0.663,7 0.617,8 386.56,9 3.8,10 11,11 53,13 13,14 29,16 55,17 21,20 12,21 9,22 2,24 26,25 6,26 1,28 2,29 3,31 1,32 27,35 5.7,36 0.127,37 7,38 36.5,39 52.865,40 59.527,41 35.159,42 32.696,44 5.918}
{0 CHEMBL544149,1 6.303,2 41.4,3 53.4,4 0.983,5 1.123,6 0.644,7 0.592,8 365.56,9 1.7,10 12,11 58,13 13,14 29,16 60,17 24,20 13,21 11,22 1,24 31,25 3,28 1,29 2,32 27,35 3.4,36 0.15,37 9,38 36,39 57.01,40 65.145,41 37.336,42 34.353,44 5.8}
{0 CHEMBL544578,1 8.427,2 42,3 44,4 1.011,5 1.122,6 0.689,7 0.653,8 421.35,9 4,10 12,11 50,13 14,14 30,16 52,17 21,18 2,20 14,21 7,22 2,24 22,25 7,26 2,28 2,29 3,32 28,34 2,35 6,36 0.135,37 7,38 38,39 50.553,40 56.08,41 34.466,42 32.637,43 4,44 6.516}
{0 CHEMBL544586,1 6.769,2 42.6,3 50,4 0.992,5 1.121,6 0.653,7 0.611,8 365.51,9 1.9,10 12,11 54,13 14,14 29,16 56,17 23,20 15,21 8,22 2,24 27,25 4,28 1,29 3,32 27,35 5.6,36 0.125,37 7,38 37,39 53.571,40 60.524,41 35.267,42 33.014,44 7.678}
{0 CHEMBL544610,1 7.206,2 41.1,3 48.2,4 1.009,5 1.136,6 0.641,7 0.613,8 403.51,9 1.8,10 12,11 56,13 13,14 31,16 58,17 23,20 13,21 10,22 1,23 2,24 27,25 6,28 1,29 3,32 29,34 2,35 5.4,36 0.155,37 9,38 38,39 56.48,40 63.619,41 35.904,42 34.308,43 3.6,44 6.171}
{0 CHEMBL544850,1 6.38,2 40.3,3 53.2,4 0.987,5 1.125,6 0.638,7 0.59,8 395.59,9 1.6,10 12,11 62,13 13,14 31,16 64,17 25,20 13,21 12,22 1,24 33,25 4,28 1,29 3,32 29,35 4.8,36 0.141,37 9,38 38,39 61.221,40 69.77,41 39.552,42 36.595,44 6.446}
{0 CHEMBL545049,1 7.943,2 39.6,3 47.2,4 1.004,5 1.122,6 0.68,7 0.633,8 421,9 3.8,10 11,11 53,13 13,14 30,16 55,17 21,18 1,20 12,21 9,22 2,24 25,25 7,26 2,28 2,29 3,31 1,32 28,34 1,35 5.7,36 0.127,37 7,38 37.5,39 53.189,40 59.471,41 36.017,42 33.523,43 1.9,44 7.046}
{0 CHEMBL545050,1 7.301,2 43.8,3 45.8,4 1,5 1.12,6 0.666,7 0.634,8 350.45,9 4.2,10 12,11 48,13 15,14 28,16 50,17 21,20 16,21 5,22 3,24 22,25 5,28 2,29 3,32 26,35 6.3,36 0.14,37 7,38 37,39 48.022,40 53.777,41 31.989,42 30.455,44 7.328}
{0 CHEMBL545279,1 6.769,2 42.6,3 50,4 0.992,5 1.121,6 0.653,7 0.611,8 365.51,9 1.9,10 12,11 54,13 14,14 29,16 56,17 23,20 15,21 8,22 2,24 27,25 4,28 1,29 3,32 27,35 5.6,36 0.125,37 7,38 37,39 53.571,40 60.524,41 35.267,42 33.014,44 7.31}
{0 CHEMBL545280,1 6.47,2 41.3,3 52.4,4 0.988,5 1.123,6 0.644,7 0.597,8 407.6,9 1.6,10 12,11 63,13 14,14 32,16 65,17 26,20 15,21 11,22 2,24 33,25 4,28 1,29 3,32 30,35 4.8,36 0.138,37 9,38 40,39 62.221,40 70.77,41 40.552,42 37.595,44 7.495}
{0 CHEMBL545309,1 6.501,2 39.3,3 52.5,4 0.991,5 1.129,6 0.636,7 0.592,8 396.58,9 3.3,10 12,11 61,13 13,14 31,16 63,17 24,20 13,21 11,22 1,24 32,25 5,28 2,29 3,32 29,35 4.9,36 0.175,37 11,38 38,39 60.44,40 68.853,41 38.796,42 36.089,44 6.523}
{0 CHEMBL545511,1 7.406,2 42.6,3 48.1,4 0.998,5 1.12,6 0.669,7 0.627,8 399.95,9 1.9,10 12,11 54,13 14,14 30,16 56,17 23,18 1,20 15,21 8,22 2,24 26,25 5,26 1,28 1,29 3,32 28,34 1,35 5.6,36 0.125,37 7,38 38,39 53.894,40 60.468,41 36.125,42 33.842,43 1.9,44 7.921}
{0 CHEMBL545514,1 8.303,2 43.1,3 41.2,4 1.034,5 1.146,6 0.652,7 0.647,8 423.44,9 2,10 12,11 51,13 14,14 32,16 53,17 22,20 15,21 7,22 2,23 4,24 21,25 8,28 1,29 3,32 30,34 4,35 5.9,36 0.132,37 7,38 40,39 52.738,40 58.468,41 33.256,42 33.021,43 7.8,44 6.879}
{0 CHEMBL545516,1 8.538,2 44.9,3 42.9,4 1.009,5 1.114,6 0.703,7 0.666,8 418.34,9 2,10 12,11 49,13 15,14 30,16 51,17 22,18 2,20 17,21 5,22 3,24 21,25 6,26 2,28 1,29 3,32 28,34 2,35 6.1,36 0.137,37 7,38 39,39 49.451,40 54.582,41 34.46,42 32.616,43 4.1,44 7.921}
{0 CHEMBL545517,1 8.242,2 43.1,3 45.1,4 1.007,5 1.118,6 0.691,7 0.65,8 420.36,9 2,10 12,11 51,13 14,14 30,16 53,17 22,18 2,20 15,21 7,22 2,24 23,25 6,26 2,28 1,29 3,32 28,34 2,35 5.9,36 0.132,37 7,38 38,39 51.334,40 56.997,41 35.222,42 33.142,43 3.9,44 7.284}
{0 CHEMBL545743,1 7.822,2 43.1,3 45.1,4 1.004,5 1.12,6 0.679,7 0.643,8 398.92,9 3.9,10 12,11 51,13 15,14 30,16 53,17 22,18 1,20 16,21 6,22 3,24 23,25 6,26 1,28 2,29 3,32 28,34 1,35 5.9,36 0.132,37 7,38 39,39 51.229,40 57.136,41 34.608,42 32.81,43 2,44 6.833}
{0 CHEMBL545747,1 8.427,2 42,3 44,4 1.011,5 1.122,6 0.689,7 0.653,8 421.35,9 4,10 12,11 50,13 14,14 30,16 52,17 21,18 2,20 14,21 7,22 2,24 22,25 7,26 2,28 2,29 3,32 28,34 2,35 6,36 0.135,37 7,38 38,39 50.553,40 56.08,41 34.466,42 32.637,43 4,44 7.409}
{0 CHEMBL545750,1 6.974,2 42.1,3 49.1,4 0.999,5 1.128,6 0.649,7 0.613,8 397.53,9 1.8,10 12,11 57,13 14,14 31,16 59,17 24,20 15,21 9,22 2,23 1,24 28,25 5,28 1,29 3,32 29,34 1,35 5.3,36 0.119,37 7,38 39,39 56.967,40 64.279,41 36.966,42 34.924,43 1.8,44 7.523}
{0 CHEMBL545775,1 6.47,2 41.3,3 52.4,4 0.988,5 1.123,6 0.644,7 0.597,8 407.6,9 1.6,10 12,11 63,13 14,14 32,16 65,17 26,20 15,21 11,22 2,24 33,25 4,28 1,29 3,32 30,35 4.8,36 0.138,37 9,38 40,39 62.221,40 70.77,41 40.552,42 37.595,44 7.125}
{0 CHEMBL552660,1 6.769,2 42.6,3 50,4 0.992,5 1.121,6 0.653,7 0.611,8 365.51,9 1.9,10 12,11 54,13 14,14 29,16 56,17 23,20 15,21 8,22 2,24 27,25 4,28 1,29 3,32 27,35 5.6,36 0.143,37 8,38 37,39 53.571,40 60.524,41 35.267,42 33.014,44 5.569}
{0 CHEMBL553280,1 8.489,2 42,3 40,4 1.039,5 1.151,6 0.65,7 0.65,8 424.43,9 4,10 12,11 50,13 14,14 32,16 52,17 21,20 14,21 7,22 2,23 4,24 20,25 9,28 2,29 3,32 30,34 4,35 6,36 0.135,37 7,38 40,39 51.956,40 57.551,41 32.5,42 32.515,43 8,44 7.284}
{0 CHEMBL553325,1 7.852,2 38,3 48,4 1.001,5 1.121,6 0.681,7 0.627,8 392.59,9 4,10 10,11 50,13 12,14 28,16 52,17 19,20 10,21 9,22 2,24 24,25 7,26 2,28 2,29 3,31 2,32 26,35 6,36 0.135,37 7,38 35,39 50.058,40 56.032,41 34.046,42 31.356,44 7.086}
{0 CHEMBL553524,1 8.044,2 42.6,3 46.3,4 1.004,5 1.119,6 0.685,7 0.642,8 434.39,9 1.9,10 12,11 54,13 14,14 31,16 56,17 23,18 2,20 15,21 8,22 2,24 25,25 6,26 2,28 1,29 3,32 29,34 2,35 5.6,36 0.143,37 8,38 39,39 54.218,40 60.412,41 36.983,42 34.669,43 3.7,44 6.02}
{0 CHEMBL553582,1 6.97,2 39.2,3 49,4 1,5 1.131,6 0.642,7 0.608,8 355.48,9 5.9,10 11,11 51,13 13,14 28,16 53,17 20,20 12,21 8,22 2,24 25,25 6,28 3,29 3,32 26,35 5.9,36 0.132,37 7,38 35.5,39 51.007,40 57.69,41 32.756,42 31.003,44 7.229}
{0 CHEMBL553610,1 7.652,2 44.2,3 46.2,4 1,5 1.116,6 0.68,7 0.641,8 397.93,9 1.9,10 12,11 52,13 15,14 30,16 54,17 23,18 1,20 17,21 6,22 3,24 24,25 5,26 1,28 1,29 3,32 28,34 1,35 5.8,36 0.13,37 7,38 39,39 52.011,40 58.053,41 35.364,42 33.315,43 1.9,44 7.194}
{0 CHEMBL554050,1 6.659,2 42.1,3 50.9,4 0.99,5 1.122,6 0.65,7 0.606,8 379.54,9 1.8,10 12,11 57,13 14,14 30,16 59,17 24,20 15,21 9,22 2,24 29,25 4,28 1,29 3,32 28,35 5.3,36 0.119,37 7,38 38,39 56.454,40 63.939,41 37.029,42 34.541,44 7.721}
{0 CHEMBL554167,1 7.009,2 42.6,3 48.1,4 0.996,5 1.122,6 0.658,7 0.621,8 378.51,9 3.7,10 12,11 54,13 15,14 30,16 56,17 23,20 16,21 7,22 3,24 26,25 5,28 2,29 3,32 28,35 5.6,36 0.125,37 7,38 39,39 53.789,40 60.607,41 35.512,42 33.509,44 7.26}
{0 CHEMBL554210,1 7.678,2 39.2,3 49,4 0.997,5 1.117,6 0.682,7 0.625,8 391.6,9 2,10 10,11 51,13 12,14 28,16 53,17 20,20 11,21 9,22 2,24 25,25 6,26 2,28 1,29 3,31 2,32 26,35 5.9,36 0.132,37 7,38 35,39 50.84,40 56.949,41 34.801,42 31.862,44 7.854}
{0 CHEMBL554396,1 6.776,2 41.7,3 50,4 0.993,5 1.124,6 0.651,7 0.609,8 406.57,9 3.3,10 12,11 60,13 15,14 32,16 62,17 25,20 16,21 9,22 3,24 30,25 5,28 2,29 3,32 30,35 5,36 0.145,37 9,38 41,39 59.556,40 67.438,41 39.034,42 36.562,44 6.738}
{0 CHEMBL554435,1 7.336,2 44.2,3 46.2,4 1.004,5 1.124,6 0.662,7 0.632,8 381.48,9 1.9,10 12,11 52,13 15,14 30,16 54,17 23,20 17,21 6,22 3,23 1,24 24,25 5,28 1,29 3,32 28,34 1,35 5.8,36 0.13,37 7,38 39,39 52.2,40 58.449,41 34.444,42 32.871,43 1.9,44 7.721}
{0 CHEMBL554661,1 7.512,2 37.5,3 50,4 0.997,5 1.123,6 0.671,7 0.614,8 420.65,9 3.6,10 10,11 56,13 12,14 30,16 58,17 21,20 10,21 11,22 2,24 28,25 7,26 2,28 2,29 3,31 2,32 28,35 5.4,36 0.155,37 9,38 37,39 55.825,40 62.862,41 37.568,42 34.41,44 7.06}
{0 CHEMBL555540,1 7.435,2 42.6,3 46.3,4 1.011,5 1.133,6 0.651,7 0.626,8 401.49,9 1.9,10 12,11 54,13 14,14 31,16 56,17 23,20 15,21 8,22 2,23 2,24 25,25 6,28 1,29 3,32 29,34 2,35 5.6,36 0.143,37 8,38 39,39 54.596,40 61.204,41 35.142,42 33.781,43 3.7,44 5.835}
{0 CHEMBL555656,1 7.102,2 42.6,3 48.1,4 1.002,5 1.127,6 0.652,7 0.618,8 383.5,9 1.9,10 12,11 54,13 14,14 30,16 56,17 23,20 15,21 8,22 2,23 1,24 26,25 5,28 1,29 3,32 28,34 1,35 5.6,36 0.125,37 7,38 38,39 54.083,40 60.864,41 35.205,42 33.398,43 1.9,44 7.319}
{0 CHEMBL555770,1 6.492,2 42.9,3 51.8,4 0.984,5 1.12,6 0.653,7 0.604,8 363.54,9 1.8,10 12,11 56,13 14,14 29,16 58,17 24,20 15,21 9,22 2,24 29,25 3,28 1,29 2,32 27,35 3.6,36 0.138,37 8,38 37,39 55.127,40 62.73,41 36.574,42 33.826,44 5.647}
{0 CHEMBL557028,1 6.795,2 41.1,3 50,4 0.994,5 1.125,6 0.648,7 0.608,8 380.53,9 3.6,10 12,11 56,13 14,14 30,16 58,17 23,20 14,21 9,22 2,24 28,25 5,28 2,29 3,32 28,35 5.4,36 0.121,37 7,38 38,39 55.672,40 63.022,41 36.273,42 34.036,44 7.149}
{0 CHEMBL557432,1 7.29,2 42.1,3 47.4,4 1.008,5 1.134,6 0.647,7 0.619,8 415.52,9 1.8,10 12,11 57,13 14,14 32,16 59,17 24,20 15,21 9,22 2,23 2,24 27,25 6,28 1,29 3,32 30,34 2,35 5.3,36 0.119,37 7,38 40,39 57.48,40 64.619,41 36.904,42 35.308,43 3.5,44 7.215}
{0 CHEMBL557612,1 6.655,2 38.7,3 51.6,4 0.996,5 1.13,6 0.633,7 0.594,8 412.58,9 3.2,10 12,11 62,13 13,14 32,16 64,17 24,20 13,21 11,22 1,24 32,25 6,28 2,29 4,32 30,35 6.5,36 0.188,37 12,38 39,39 61.767,40 70.062,41 39.25,42 36.804,44 5.046}
{0 CHEMBL557637,1 7.769,2 42,3 44,4 1.019,5 1.137,6 0.653,7 0.635,8 388.45,9 4,10 12,11 50,13 14,14 30,16 52,17 21,20 14,21 7,22 2,23 2,24 22,25 7,28 2,29 3,32 28,34 2,35 6,36 0.135,37 7,38 38,39 50.931,40 56.871,41 32.625,42 31.749,43 4,44 6.668}
{0 CHEMBL558220,1 6.864,2 43.6,3 49.1,4 0.992,5 1.119,6 0.659,7 0.618,8 377.52,9 1.8,10 12,11 55,13 15,14 30,16 57,17 24,20 17,21 7,22 3,24 27,25 4,28 1,29 3,32 28,35 5.5,36 0.123,37 7,38 39,39 54.571,40 61.524,41 36.267,42 34.014,44 7.585}
{0 CHEMBL558617,1 7.294,2 39.6,3 49.1,4 0.997,5 1.123,6 0.663,7 0.617,8 386.56,9 3.8,10 11,11 53,13 13,14 29,16 55,17 21,20 12,21 9,22 2,24 26,25 6,26 1,28 2,29 3,31 1,32 27,35 5.7,36 0.127,37 7,38 36.5,39 52.865,40 59.527,41 35.159,42 32.696,44 5.062}
{0 CHEMBL558816,1 6.649,2 42.6,3 50.8,4 0.989,5 1.121,6 0.652,7 0.608,8 405.58,9 1.6,10 12,11 61,13 15,14 32,16 63,17 26,20 17,21 9,22 3,24 31,25 4,28 1,29 3,32 30,35 4.9,36 0.143,37 9,38 41,39 60.338,40 68.355,41 39.79,42 37.068,44 7.328}
{0 CHEMBL76768,1 7.064,2 33.3,3 50,4 1.016,5 1.143,6 0.609,7 0.587,8 127.16,9 5.6,11 18,13 2,14 9,16 18,17 6,20 3,21 3,22 2,24 9,25 3,28 1,29 2,32 9,35 11.1,36 0.056,37 1,38 11,39 18.291,40 20.578,41 10.96,42 10.558,44 5.619}
{0 CHEMBL77484,1 6.459,2 30,3 55,4 1.009,5 1.15,6 0.586,7 0.554,8 129.18,9 5,11 20,13 1,14 9,16 20,17 6,20 1,21 5,22 1,24 11,25 3,28 1,29 2,32 9,35 10,36 0.05,37 1,38 10,39 20.174,40 22.993,41 11.722,42 11.085,44 5.575}
{0 CHEMBL77575,1 6.459,2 30,3 55,4 1.009,5 1.15,6 0.586,7 0.554,8 129.18,9 5,11 20,13 1,14 9,16 20,17 6,20 1,21 5,22 1,24 11,25 3,28 1,29 2,32 9,35 10,36 0.05,37 1,38 10,39 20.174,40 22.993,41 11.722,42 11.085,44 5.631}
{0 CHEMBL96,1 6.446,2 25,3 56.3,4 1.018,5 1.161,6 0.56,7 0.535,8 103.14,9 6.3,11 16,13 1,14 6,16 15,17 4,20 1,21 3,22 1,24 9,25 3,28 1,29 2,32 7,35 12.5,36 0.2,37 3,38 7,39 16.291,40 18.578,41 8.96,42 8.558,44 5.635}
