{
  "data_features": {
    "feature": [
      {
        "data_type": "nominal",
        "index": "0",
        "is_ignore": "false",
        "is_row_identifier": "true",
        "is_target": "false",
        "name": "molecule_id",
        "nominal_value": [
          "CHEMBL1077386",
          "CHEMBL1077387",
          "CHEMBL1077405",
          "CHEMBL1077446",
          "CHEMBL1078559",
          "CHEMBL1078560",
          "CHEMBL1078685",
          "CHEMBL1078761",
          "CHEMBL1078762",
          "CHEMBL1078763",
          "CHEMBL1078978",
          "CHEMBL1078980",
          "CHEMBL1079001",
          "CHEMBL1079084",
          "CHEMBL1079103",
          "CHEMBL1079104",
          "CHEMBL1079331",
          "CHEMBL1079332",
          "CHEMBL1079334",
          "CHEMBL1080056",
          "CHEMBL1080057",
          "CHEMBL1080058",
          "CHEMBL1080059",
          "CHEMBL1080767",
          "CHEMBL1081134",
          "CHEMBL1082212",
          "CHEMBL1163781",
          "CHEMBL1164192",
          "CHEMBL116438",
          "CHEMBL1164728",
          "CHEMBL1164729",
          "CHEMBL1164904",
          "CHEMBL1165002",
          "CHEMBL1165487",
          "CHEMBL1165707",
          "CHEMBL1165740",
          "CHEMBL1209130",
          "CHEMBL1209915",
          "CHEMBL1209917",
          "CHEMBL1224508",
          "CHEMBL122899",
          "CHEMBL1353302",
          "CHEMBL1401508",
          "CHEMBL1424",
          "CHEMBL1441502",
          "CHEMBL1449501",
          "CHEMBL1467",
          "CHEMBL151",
          "CHEMBL1542147",
          "CHEMBL1606931",
          "CHEMBL163316",
          "CHEMBL1641632",
          "CHEMBL1644702",
          "CHEMBL1644703",
          "CHEMBL1644704",
          "CHEMBL1644705",
          "CHEMBL1644706",
          "CHEMBL1644707",
          "CHEMBL1644711",
          "CHEMBL1644712",
          "CHEMBL1681820",
          "CHEMBL1684635",
          "CHEMBL1684636",
          "CHEMBL1684637",
          "CHEMBL1684638",
          "CHEMBL1684639",
          "CHEMBL1684640",
          "CHEMBL1684641",
          "CHEMBL1684642",
          "CHEMBL1684643",
          "CHEMBL1684644",
          "CHEMBL1684645",
          "CHEMBL1684646",
          "CHEMBL1684751",
          "CHEMBL1684752",
          "CHEMBL1684753",
          "CHEMBL1684754",
          "CHEMBL1684755",
          "CHEMBL1684756",
          "CHEMBL1684757",
          "CHEMBL1684758",
          "CHEMBL1684759",
          "CHEMBL1684760",
          "CHEMBL1684761",
          "CHEMBL1684762",
          "CHEMBL1684763",
          "CHEMBL1684764",
          "CHEMBL1684765",
          "CHEMBL1684766",
          "CHEMBL1684767",
          "CHEMBL1684768",
          "CHEMBL1684769",
          "CHEMBL1684770",
          "CHEMBL1684771",
          "CHEMBL1684772",
          "CHEMBL1684773",
          "CHEMBL1684774",
          "CHEMBL1684775",
          "CHEMBL1684776",
          "CHEMBL1684777",
          "CHEMBL1684778",
          "CHEMBL1684779",
          "CHEMBL1684780",
          "CHEMBL1684781",
          "CHEMBL169420",
          "CHEMBL169526",
          "CHEMBL169728",
          "CHEMBL170303",
          "CHEMBL170405",
          "CHEMBL171584",
          "CHEMBL171819",
          "CHEMBL1724082",
          "CHEMBL172682",
          "CHEMBL172687",
          "CHEMBL177312",
          "CHEMBL177888",
          "CHEMBL177894",
          "CHEMBL1795506",
          "CHEMBL1795507",
          "CHEMBL1795508",
          "CHEMBL1795512",
          "CHEMBL1795514",
          "CHEMBL1795517",
          "CHEMBL1795523",
          "CHEMBL1818902",
          "CHEMBL1818903",
          "CHEMBL1818904",
          "CHEMBL1818905",
          "CHEMBL1818906",
          "CHEMBL1818907",
          "CHEMBL1818908",
          "CHEMBL1818909",
          "CHEMBL1818910",
          "CHEMBL1818911",
          "CHEMBL1818912",
          "CHEMBL1818913",
          "CHEMBL1818914",
          "CHEMBL1818915",
          "CHEMBL1818916",
          "CHEMBL1818917",
          "CHEMBL1818918",
          "CHEMBL1818919",
          "CHEMBL1818920",
          "CHEMBL1818921",
          "CHEMBL1818922",
          "CHEMBL1818923",
          "CHEMBL1818924",
          "CHEMBL1818925",
          "CHEMBL1818926",
          "CHEMBL1818927",
          "CHEMBL1818928",
          "CHEMBL1818929",
          "CHEMBL1818930",
          "CHEMBL1818931",
          "CHEMBL1818932",
          "CHEMBL1818933",
          "CHEMBL1818934",
          "CHEMBL1818935",
          "CHEMBL1818936",
          "CHEMBL1818937",
          "CHEMBL1818938",
          "CHEMBL1818939",
          "CHEMBL1818940",
          "CHEMBL1818941",
          "CHEMBL1818942",
          "CHEMBL183973",
          "CHEMBL184869",
          "CHEMBL184965",
          "CHEMBL186582",
          "CHEMBL186748",
          "CHEMBL186749",
          "CHEMBL187265",
          "CHEMBL193585",
          "CHEMBL2022881",
          "CHEMBL2022882",
          "CHEMBL2022883",
          "CHEMBL2023700",
          "CHEMBL2023701",
          "CHEMBL2023702",
          "CHEMBL2023703",
          "CHEMBL2023704",
          "CHEMBL2088592",
          "CHEMBL2088593",
          "CHEMBL2088594",
          "CHEMBL2088595",
          "CHEMBL2088596",
          "CHEMBL2088597",
          "CHEMBL2088598",
          "CHEMBL2088599",
          "CHEMBL2088600",
          "CHEMBL2088601",
          "CHEMBL2088602",
          "CHEMBL2088603",
          "CHEMBL2088604",
          "CHEMBL2088605",
          "CHEMBL2088606",
          "CHEMBL2088607",
          "CHEMBL2088608",
          "CHEMBL2088609",
          "CHEMBL2088610",
          "CHEMBL214321",
          "CHEMBL219544",
          "CHEMBL2321880",
          "CHEMBL2322144",
          "CHEMBL2322145",
          "CHEMBL2322146",
          "CHEMBL2322147",
          "CHEMBL2322148",
          "CHEMBL2322149",
          "CHEMBL2322150",
          "CHEMBL2322151",
          "CHEMBL2322152",
          "CHEMBL2322153",
          "CHEMBL2322154",
          "CHEMBL2322155",
          "CHEMBL2322156",
          "CHEMBL2322157",
          "CHEMBL2322158",
          "CHEMBL2322159",
          "CHEMBL2322160",
          "CHEMBL2322161",
          "CHEMBL2322162",
          "CHEMBL2322163",
          "CHEMBL2322164",
          "CHEMBL2322165",
          "CHEMBL2322166",
          "CHEMBL2322167",
          "CHEMBL2322168",
          "CHEMBL2322169",
          "CHEMBL2322170",
          "CHEMBL2322171",
          "CHEMBL233929",
          "CHEMBL243664",
          "CHEMBL252642",
          "CHEMBL351607",
          "CHEMBL354749",
          "CHEMBL354997",
          "CHEMBL363031",
          "CHEMBL382408",
          "CHEMBL435703",
          "CHEMBL440197",
          "CHEMBL446790",
          "CHEMBL459319",
          "CHEMBL459952",
          "CHEMBL460158",
          "CHEMBL460160",
          "CHEMBL461228",
          "CHEMBL462283",
          "CHEMBL462284",
          "CHEMBL462497",
          "CHEMBL462498",
          "CHEMBL466202",
          "CHEMBL468494",
          "CHEMBL468704",
          "CHEMBL468706",
          "CHEMBL471479",
          "CHEMBL471482",
          "CHEMBL486253",
          "CHEMBL50",
          "CHEMBL508591",
          "CHEMBL516626",
          "CHEMBL518362",
          "CHEMBL55415",
          "CHEMBL562142",
          "CHEMBL63354",
          "CHEMBL8260",
          "CHEMBL9323"
        ],
        "number_of_missing_values": "0"
      },
      {
        "data_type": "numeric",
        "index": "1",
        "is_ignore": "false",
        "is_row_identifier": "false",
        "is_target": "false",
        "name": "nN",
        "number_of_missing_values": "0"
      },
      {
        "data_type": "numeric",
        "index": "2",
        "is_ignore": "false",
        "is_row_identifier": "false",
        "is_target": "false",
        "name": "N.",
        "number_of_missing_values": "0"
      },
      {
        "data_type": "numeric",
        "index": "3",
        "is_ignore": "false",
        "is_row_identifier": "false",
        "is_target": "false",
        "name": "nDB",
        "number_of_missing_values": "0"
      },
      {
        "data_type": "numeric",
        "index": "4",
        "is_ignore": "false",
        "is_row_identifier": "false",
        "is_target": "false",
        "name": "nCsp",
        "number_of_missing_values": "0"
      },
      {
        "data_type": "numeric",
        "index": "5",
        "is_ignore": "false",
        "is_row_identifier": "false",
        "is_target": "false",
        "name": "nTB",
        "number_of_missing_values": "0"
      },
      {
        "data_type": "numeric",
        "index": "6",
        "is_ignore": "false",
        "is_row_identifier": "false",
        "is_target": "false",
        "name": "nAB",
        "number_of_missing_values": "0"
      },
      {
        "data_type": "numeric",
        "index": "7",
        "is_ignore": "false",
        "is_row_identifier": "false",
        "is_target": "false",
        "name": "nCsp2",
        "number_of_missing_values": "0"
      },
      {
        "data_type": "numeric",
        "index": "8",
        "is_ignore": "false",
        "is_row_identifier": "false",
        "is_target": "false",
        "name": "O.",
        "number_of_missing_values": "0"
      },
      {
        "data_type": "numeric",
        "index": "9",
        "is_ignore": "false",
        "is_row_identifier": "false",
        "is_target": "false",
        "name": "nO",
        "number_of_missing_values": "0"
      },
      {
        "data_type": "numeric",
        "index": "10",
        "is_ignore": "false",
        "is_row_identifier": "false",
        "is_target": "false",
        "name": "Mi",
        "number_of_missing_values": "0"
      },
      {
        "data_type": "numeric",
        "index": "11",
        "is_ignore": "false",
        "is_row_identifier": "false",
        "is_target": "false",
        "name": "nHet",
        "number_of_missing_values": "0"
      },
      {
        "data_type": "numeric",
        "index": "12",
        "is_ignore": "false",
        "is_row_identifier": "false",
        "is_target": "false",
        "name": "AMW",
        "number_of_missing_values": "0"
      },
      {
        "data_type": "numeric",
        "index": "13",
        "is_ignore": "false",
        "is_row_identifier": "false",
        "is_target": "false",
        "name": "C.",
        "number_of_missing_values": "0"
      },
      {
        "data_type": "numeric",
        "index": "14",
        "is_ignore": "false",
        "is_row_identifier": "false",
        "is_target": "false",
        "name": "H.",
        "number_of_missing_values": "0"
      },
      {
        "data_type": "numeric",
        "index": "15",
        "is_ignore": "false",
        "is_row_identifier": "false",
        "is_target": "false",
        "name": "Me",
        "number_of_missing_values": "0"
      },
      {
        "data_type": "numeric",
        "index": "16",
        "is_ignore": "false",
        "is_row_identifier": "false",
        "is_target": "false",
        "name": "Mp",
        "number_of_missing_values": "0"
      },
      {
        "data_type": "numeric",
        "index": "17",
        "is_ignore": "false",
        "is_row_identifier": "false",
        "is_target": "false",
        "name": "Mv",
        "number_of_missing_values": "0"
      },
      {
        "data_type": "numeric",
        "index": "18",
        "is_ignore": "false",
        "is_row_identifier": "false",
        "is_target": "false",
        "name": "MW",
        "number_of_missing_values": "0"
      },
      {
        "data_type": "numeric",
        "index": "19",
        "is_ignore": "false",
        "is_row_identifier": "false",
        "is_target": "false",
        "name": "nAT",
        "number_of_missing_values": "0"
      },
      {
        "data_type": "numeric",
        "index": "20",
        "is_ignore": "false",
        "is_row_identifier": "false",
        "is_target": "false",
        "name": "nB",
        "number_of_missing_values": "0"
      },
      {
        "data_type": "numeric",
        "index": "21",
        "is_ignore": "false",
        "is_row_identifier": "false",
        "is_target": "false",
        "name": "nBM",
        "number_of_missing_values": "0"
      },
      {
        "data_type": "numeric",
        "index": "22",
        "is_ignore": "false",
        "is_row_identifier": "false",
        "is_target": "false",
        "name": "nBO",
        "number_of_missing_values": "0"
      },
      {
        "data_type": "numeric",
        "index": "23",
        "is_ignore": "false",
        "is_row_identifier": "false",
        "is_target": "false",
        "name": "nBR",
        "number_of_missing_values": "0"
      },
      {
        "data_type": "numeric",
        "index": "24",
        "is_ignore": "false",
        "is_row_identifier": "false",
        "is_target": "false",
        "name": "nBT",
        "number_of_missing_values": "0"
      },
      {
        "data_type": "numeric",
        "index": "25",
        "is_ignore": "false",
        "is_row_identifier": "false",
        "is_target": "true",
        "name": "pXC50",
        "number_of_missing_values": "0"
      }
    ]
  }
}