"molecule_id","FCFP4_1024b1","FCFP4_1024b10","FCFP4_1024b100","FCFP4_1024b1000","FCFP4_1024b1001","FCFP4_1024b1002","FCFP4_1024b1003","FCFP4_1024b1004","FCFP4_1024b1005","FCFP4_1024b1006","FCFP4_1024b1007","FCFP4_1024b1008","FCFP4_1024b1009","FCFP4_1024b101","FCFP4_1024b1010","FCFP4_1024b1011","FCFP4_1024b1012","FCFP4_1024b1013","FCFP4_1024b1014","FCFP4_1024b1015","FCFP4_1024b1016","FCFP4_1024b1017","FCFP4_1024b1018","FCFP4_1024b1019","FCFP4_1024b102","FCFP4_1024b1020","FCFP4_1024b1021","FCFP4_1024b1022","FCFP4_1024b1023","FCFP4_1024b1024","FCFP4_1024b103","FCFP4_1024b104","FCFP4_1024b105","FCFP4_1024b106","FCFP4_1024b107","FCFP4_1024b108","FCFP4_1024b109","FCFP4_1024b11","FCFP4_1024b110","FCFP4_1024b111","FCFP4_1024b112","FCFP4_1024b113","FCFP4_1024b114","FCFP4_1024b115","FCFP4_1024b116","FCFP4_1024b117","FCFP4_1024b118","FCFP4_1024b119","FCFP4_1024b12","FCFP4_1024b120","FCFP4_1024b121","pXC50"
{1 1,9 1,33 1,42 1,52 5.602}
{0 CHEMBL1784704,1 1,9 1,42 1,44 1,52 4.824}
{0 CHEMBL1784769,1 1,9 1,33 1,42 1,52 4.752}
{0 CHEMBL1784770,1 1,9 1,33 1,42 1,52 4.456}
{0 CHEMBL1784772,1 1,42 1,52 4.277}
{0 CHEMBL1784774,1 1,9 1,33 1,42 1,52 5.535}
{0 CHEMBL1784775,1 1,9 1,33 1,42 1,52 4.521}
{0 CHEMBL1784776,1 1,9 1,33 1,42 1,52 5.149}
{0 CHEMBL1784777,1 1,9 1,33 1,42 1,52 4.735}
{0 CHEMBL1784779,1 1,9 1,33 1,42 1,52 4.827}
{0 CHEMBL1784780,1 1,9 1,42 1,44 1,52 4.007}
{0 CHEMBL1784783,1 1,9 1,52 4.967}
{0 CHEMBL1784784,1 1,9 1,33 1,42 1,52 6.569}
{0 CHEMBL1784785,1 1,9 1,33 1,42 1,52 5.796}
{0 CHEMBL1784786,1 1,9 1,33 1,42 1,52 6.357}
{0 CHEMBL1784787,1 1,9 1,33 1,52 6.387}
{0 CHEMBL2017812,1 1,9 1,33 1,42 1,52 5.907}
{0 CHEMBL2017813,1 1,9 1,33 1,42 1,52 4.711}
{0 CHEMBL2017814,1 1,9 1,33 1,42 1,52 6.268}
{0 CHEMBL2017815,1 1,9 1,33 1,42 1,52 6.886}
{0 CHEMBL2017816,1 1,9 1,33 1,52 7}
{0 CHEMBL2017817,1 1,9 1,33 1,52 6.301}
{0 CHEMBL2017818,1 1,9 1,33 1,52 4.919}
{0 CHEMBL2017819,1 1,9 1,33 1,52 4.805}
{0 CHEMBL2017820,1 1,9 1,33 1,52 5.394}
{0 CHEMBL2017821,1 1,6 1,9 1,33 1,52 7.097}
{0 CHEMBL2017822,1 1,9 1,33 1,36 1,52 7.398}
{0 CHEMBL250901,1 1,10 1,52 4.523}
{0 CHEMBL400100,1 1,10 1,52 4.409}
{0 CHEMBL400710,1 1,10 1,52 4.42}
