{
  "data_features": {
    "feature": [
      {
        "data_type": "nominal",
        "index": "0",
        "is_ignore": "false",
        "is_row_identifier": "true",
        "is_target": "false",
        "name": "molecule_id",
        "nominal_value": [
          "CHEMBL1214759",
          "CHEMBL1214760",
          "CHEMBL1214761",
          "CHEMBL1214762",
          "CHEMBL1214763",
          "CHEMBL27759",
          "CHEMBL307765",
          "CHEMBL430060",
          "CHEMBL446605",
          "CHEMBL447806",
          "CHEMBL483254",
          "CHEMBL485506",
          "CHEMBL486686",
          "CHEMBL489010",
          "CHEMBL489011",
          "CHEMBL489218",
          "CHEMBL490032",
          "CHEMBL490228",
          "CHEMBL490229",
          "CHEMBL490230",
          "CHEMBL491253",
          "CHEMBL491254",
          "CHEMBL491452",
          "CHEMBL508866",
          "CHEMBL519035",
          "CHEMBL523640",
          "CHEMBL86537",
          "CHEMBL98",
          "CHEMBL99"
        ],
        "number_of_missing_values": "0"
      },
      {
        "data_type": "numeric",
        "index": "1",
        "is_ignore": "false",
        "is_row_identifier": "false",
        "is_target": "false",
        "name": "Me",
        "number_of_missing_values": "0"
      },
      {
        "data_type": "numeric",
        "index": "2",
        "is_ignore": "false",
        "is_row_identifier": "false",
        "is_target": "false",
        "name": "AMW",
        "number_of_missing_values": "0"
      },
      {
        "data_type": "numeric",
        "index": "3",
        "is_ignore": "false",
        "is_row_identifier": "false",
        "is_target": "false",
        "name": "C.",
        "number_of_missing_values": "0"
      },
      {
        "data_type": "numeric",
        "index": "4",
        "is_ignore": "false",
        "is_row_identifier": "false",
        "is_target": "false",
        "name": "H.",
        "number_of_missing_values": "0"
      },
      {
        "data_type": "numeric",
        "index": "5",
        "is_ignore": "false",
        "is_row_identifier": "false",
        "is_target": "true",
        "name": "pXC50",
        "number_of_missing_values": "0"
      }
    ]
  }
}