"molecule_id","C.","Mp","pXC50"
{1 35.8,2 0.616,3 6}
{0 CHEMBL24179,1 35.7,2 0.615,3 8.208}
{0 CHEMBL27669,1 34.1,2 0.612,3 8.959}
{0 CHEMBL27869,1 38.5,2 0.636,3 7.361}
{0 CHEMBL282089,1 35,2 0.613,3 8.585}
{0 CHEMBL28261,1 36.4,2 0.621,3 6.827}
{0 CHEMBL283783,1 36.8,2 0.622,3 5}
{0 CHEMBL28383,1 37.6,2 0.629,3 8.319}
{0 CHEMBL283836,1 35.1,2 0.614,3 8.745}
{0 CHEMBL416926,1 38.6,2 0.637,3 6.868}
{0 CHEMBL432278,1 35.3,2 0.615,3 7.306}
{0 CHEMBL435162,1 37.5,2 0.627,3 8.229}
{0 CHEMBL435362,1 34.1,2 0.613,3 8.745}
{0 CHEMBL439151,1 43.6,2 0.757,3 5.699}
{0 CHEMBL450681,1 40.5,2 0.732,3 4}
{0 CHEMBL498932,1 43.6,2 0.74,3 4.686}
{0 CHEMBL506286,1 43.6,2 0.757,3 4}
{0 CHEMBL509326,1 40.5,2 0.75,3 4.866}
