"molecule_id","SCBO","AMW","pXC50"
{1 26,2 8.419,3 4}
{0 CHEMBL1425,1 16,2 10.871,3 5.731}
{0 CHEMBL1427,1 16,2 9.724,3 5.489}
{0 CHEMBL1467,1 16,2 9.724,3 3.87}
{0 CHEMBL172844,1 29,2 7.841,3 5.301}
{0 CHEMBL177948,1 28,2 8.575,3 6.398}
{0 CHEMBL1928775,1 23.5,2 9.6,3 4}
{0 CHEMBL1928776,1 22.5,2 10.215,3 4}
{0 CHEMBL1928777,1 21.5,2 10.461,3 5.721}
{0 CHEMBL1928778,1 22.5,2 9.767,3 5.469}
{0 CHEMBL1928779,1 24.5,2 9.107,3 4}
{0 CHEMBL1928780,1 23.5,2 9.221,3 4}
{0 CHEMBL1928781,1 24.5,2 8.782,3 4}
{0 CHEMBL1928782,1 24.5,2 9.455,3 4.252}
{0 CHEMBL1928783,1 26.5,2 8.919,3 5.523}
{0 CHEMBL1928784,1 27.5,2 8.085,3 6.301}
{0 CHEMBL1928785,1 26.5,2 8.116,3 4.114}
{0 CHEMBL1928930,1 26.5,2 8.636,3 4.553}
{0 CHEMBL1928931,1 27.5,2 7.858,3 4}
{0 CHEMBL1934407,1 27.5,2 9.121,3 5.398}
{0 CHEMBL1934409,1 32.5,2 9.202,3 5.301}
{0 CHEMBL19784,1 26,2 8.705,3 4.678}
{0 CHEMBL20283,1 26,2 9.33,3 4.509}
{0 CHEMBL2153476,1 33.5,2 8.263,3 7}
{0 CHEMBL2153477,1 33.5,2 8.263,3 6.301}
{0 CHEMBL2153478,1 34.5,2 8.048,3 7}
{0 CHEMBL2153480,1 32.5,2 8.46,3 7.155}
{0 CHEMBL2153481,1 33.5,2 8.208,3 6.222}
{0 CHEMBL2153482,1 31.5,2 8.788,3 5.854}
{0 CHEMBL2153483,1 32.5,2 8.508,3 6.824}
{0 CHEMBL2153484,1 33.5,2 8.263,3 7}
{0 CHEMBL2153485,1 33.5,2 8.92,3 6.699}
{0 CHEMBL2153486,1 32.5,2 8.297,3 5.585}
{0 CHEMBL2153488,1 33.5,2 8.07,3 4.658}
{0 CHEMBL2153489,1 30.5,2 8.819,3 4.456}
{0 CHEMBL2153490,1 31.5,2 8.508,3 5.62}
{0 CHEMBL2153491,1 32.5,2 8.241,3 4.538}
{0 CHEMBL2153492,1 30.5,2 8.854,3 4.495}
{0 CHEMBL2153494,1 32.5,2 8.297,3 5.268}
{0 CHEMBL2153495,1 28.5,2 8.283,3 5.26}
{0 CHEMBL2153496,1 32.5,2 8.984,3 5.523}
{0 CHEMBL2153497,1 29.5,2 8.246,3 7.155}
{0 CHEMBL2153498,1 26.5,2 8.636,3 5.523}
{0 CHEMBL2153499,1 25.5,2 8.705,3 4.398}
{0 CHEMBL219568,1 17,2 9.447,3 5.721}
{0 CHEMBL2325752,1 34.5,2 9.289,3 7.523}
{0 CHEMBL2325753,1 33.5,2 9.37,3 6}
{0 CHEMBL2325754,1 35.5,2 9.007,3 6.222}
{0 CHEMBL2325755,1 33.5,2 9.611,3 4.432}
{0 CHEMBL267803,1 27,2 8.369,3 6.301}
{0 CHEMBL313154,1 32.5,2 7.604,3 6.222}
{0 CHEMBL374107,1 17,2 10.143,3 4.143}
{0 CHEMBL541006,1 26,2 8.979,3 4.644}
{0 CHEMBL541690,1 29,2 9.217,3 5.268}
{0 CHEMBL552299,1 25,2 8.48,3 6}
{0 CHEMBL557280,1 23,2 8.91,3 5.367}
{0 CHEMBL557887,1 26,2 8.919,3 4.046}
{0 CHEMBL559509,1 24,2 8.825,3 4.396}
{0 CHEMBL560829,1 26,2 8.919,3 4.816}
{0 CHEMBL561353,1 25,2 8.75,3 4.824}
{0 CHEMBL561493,1 26,2 8.683,3 5.229}
{0 CHEMBL561552,1 26,2 10.671,3 4.387}
{0 CHEMBL564410,1 30,2 9.132,3 5.237}
{0 CHEMBL565171,1 25,2 9.036,3 4.167}
{0 CHEMBL570784,1 24,2 8.537,3 5.444}
{0 CHEMBL594335,1 27.5,2 8.575,3 7}
{0 CHEMBL596018,1 26.5,2 8.636,3 5.699}
{0 CHEMBL596019,1 27.5,2 8.323,3 5}
{0 CHEMBL610201,1 28.5,2 8.283,3 6.523}
{0 CHEMBL727,1 17,2 10.451,3 5.5}
{0 CHEMBL82858,1 36.5,2 8.541,3 5.174}
{0 CHEMBL83185,1 46,2 11.352,3 5.463}
{0 CHEMBL83231,1 46.5,2 10.631,3 4.541}
{0 CHEMBL83242,1 32.5,2 8.21,3 5.553}
{0 CHEMBL85685,1 31.5,2 7.61,3 5.047}
{0 CHEMBL87526,1 45,2 7.776,3 4.91}
{0 CHEMBL88057,1 38.5,2 9.574,3 4.699}
