"molecule_id","AMW","C.","pXC50"
{1 8.778,2 48.8,3 5.509}
{0 CHEMBL101253,1 8.671,2 50,3 5}
{0 CHEMBL103667,1 6.944,2 40.8,3 5}
{0 CHEMBL105442,1 12.274,2 43.6,3 5}
{0 CHEMBL1173655,1 8.237,2 40.7,3 5}
{0 CHEMBL119385,1 11.791,2 51.4,3 5}
{0 CHEMBL1230020,1 10.094,2 41.5,3 5}
{0 CHEMBL1236107,1 9.217,2 46.2,3 5}
{0 CHEMBL1240703,1 7.928,2 47.3,3 5}
{0 CHEMBL1241674,1 7.907,2 41,3 5.456}
{0 CHEMBL124660,1 6.781,2 37.3,3 5}
{0 CHEMBL1287853,1 7.188,2 37,3 6.523}
{0 CHEMBL1289926,1 8.402,2 47.8,3 5}
{0 CHEMBL1336,1 9.685,2 43.8,3 5}
{0 CHEMBL1421,1 8.272,2 37.3,3 5}
{0 CHEMBL14762,1 6.817,2 36.5,3 5}
{0 CHEMBL1614701,1 10.898,2 40.5,3 5}
{0 CHEMBL162,1 7.649,2 45.9,3 5}
{0 CHEMBL1721885,1 7.501,2 39,3 5}
{0 CHEMBL1789941,1 7.473,2 41.5,3 5}
{0 CHEMBL180022,1 8.074,2 43.5,3 5}
{0 CHEMBL1908391,1 7.556,2 42.4,3 5}
{0 CHEMBL1908392,1 7.189,2 43.3,3 5}
{0 CHEMBL1908393,1 7.741,2 41.5,3 5}
{0 CHEMBL1908394,1 8.237,2 40.9,3 5}
{0 CHEMBL1908395,1 6.979,2 39.4,3 5}
{0 CHEMBL1908396,1 8.286,2 41.4,3 5}
{0 CHEMBL1908397,1 7.388,2 44.4,3 5}
{0 CHEMBL191003,1 10.113,2 38.5,3 5}
{0 CHEMBL215152,1 7.577,2 38.8,3 5}
{0 CHEMBL2205766,1 8.249,2 35.7,3 5}
{0 CHEMBL221959,1 7.266,2 37.2,3 5}
{0 CHEMBL223360,1 8.162,2 45.7,3 5}
{0 CHEMBL230011,1 8.659,2 45,3 5.854}
{0 CHEMBL2309006,1 8.139,2 48.1,3 5}
{0 CHEMBL2309609,1 7.818,2 47.9,3 5}
{0 CHEMBL24828,1 8.804,2 40.7,3 5.77}
{0 CHEMBL249097,1 7.986,2 42.9,3 6.889}
{0 CHEMBL249697,1 7.093,2 38.9,3 5}
{0 CHEMBL255863,1 8.681,2 45.9,3 5}
{0 CHEMBL259084,1 9.732,2 51,3 5}
{0 CHEMBL261849,1 7.479,2 40.8,3 5}
{0 CHEMBL278041,1 8.497,2 51.3,3 5.31}
{0 CHEMBL288441,1 8.162,2 40,3 5}
{0 CHEMBL296468,1 7.767,2 34.7,3 5.269}
{0 CHEMBL300138,1 7.583,2 47.1,3 5}
{0 CHEMBL31965,1 8.237,2 40.7,3 5.469}
{0 CHEMBL377300,1 8.053,2 41.3,3 5}
{0 CHEMBL379218,1 7.316,2 44.9,3 5}
{0 CHEMBL384304,1 8.657,2 35.3,3 5}
{0 CHEMBL386051,1 9.853,2 46.7,3 7.569}
{0 CHEMBL428690,1 8.372,2 43.8,3 5}
{0 CHEMBL440084,1 8.543,2 48.9,3 5}
{0 CHEMBL445813,1 9.102,2 38.1,3 5}
{0 CHEMBL450786,1 8.333,2 41.6,3 5}
{0 CHEMBL464552,1 7.833,2 39.7,3 5}
{0 CHEMBL475251,1 8.255,2 38.6,3 7.194}
{0 CHEMBL477772,1 8.103,2 38.9,3 5}
{0 CHEMBL483321,1 7.574,2 43.5,3 5}
{0 CHEMBL491473,1 7.509,2 41.7,3 5}
{0 CHEMBL494089,1 7.337,2 36.2,3 5}
{0 CHEMBL509032,1 7.491,2 36.6,3 7.036}
{0 CHEMBL513909,1 6.776,2 36.4,3 5}
{0 CHEMBL521851,1 8.286,2 37.1,3 5}
{0 CHEMBL522892,1 7.85,2 42,3 5}
{0 CHEMBL525191,1 7.777,2 44.2,3 5}
{0 CHEMBL535,1 7.117,2 39.3,3 5}
{0 CHEMBL553,1 7.567,2 42.3,3 5.602}
{0 CHEMBL554,1 8.805,2 43.9,3 5}
{0 CHEMBL558752,1 9.782,2 45.3,3 5}
{0 CHEMBL572878,1 7.617,2 37.7,3 5}
{0 CHEMBL572881,1 7.324,2 43.1,3 5}
{0 CHEMBL573339,1 8.295,2 45.2,3 5}
{0 CHEMBL574738,1 7.789,2 38.2,3 5}
{0 CHEMBL576982,1 7.788,2 40.3,3 5}
{0 CHEMBL601719,1 8.661,2 40.4,3 5.959}
{0 CHEMBL607707,1 8.357,2 42.9,3 5.215}
{0 CHEMBL608154,1 8.947,2 46.3,3 5}
{0 CHEMBL91829,1 7.438,2 44.4,3 5}
{0 CHEMBL939,1 8.126,2 40,3 5}
{0 CHEMBL941,1 7.26,2 42.6,3 5}
