{
  "data_set_description": {
    "collection_date": "November 2013",
    "creator": "Dr Jeremy Besnard, Dr Ivan Olier, Dr Noureddin Sadawi, Dr Larisa Soldatova, Dr Crina Grosan, Prof Ross King, Dr Richard Bickerton, Prof Andrew Hopkins and Dr Willem van Hoorn",
    "default_target_attribute": "pXC50",
    "description": "This dataset contains QSAR data (from ChEMBL version 17) showing activity values (unit is pseudo-pCI50) of several compounds on drug target ChEMBL_ID: CHEMBL5262 (TID: 101132), and it has 41 rows and 1130 features (not including molecule IDs and class feature: molecule_id and pXC50). The features represent Molecular Descriptors which were generated from SMILES strings. Missing value imputation was applied to this dataset (By choosing the Median).",
    "description_version": "1",
    "file_id": "3363385",
    "format": "ARFF",
    "id": "28503",
    "licence": "Public",
    "md5_checksum": "09d2ebf6c12b2a82f44e94682cd3f94b",
    "minio_url": "https://data.openml.org/datasets/0002/28503/dataset_28503.pq",
    "name": "QSAR-DATASET-FOR-DRUG-TARGET-CHEMBL5262",
    "original_data_url": "https://www.ebi.ac.uk/chembl/target/inspect/CHEMBL5262",
    "parquet_url": "https://data.openml.org/datasets/0002/28503/dataset_28503.pq",
    "processing_date": "2018-10-04 00:57:27",
    "row_id_attribute": "molecule_id",
    "status": "deactivated",
    "tag": [
      "MetaQSAR",
      "study_13"
    ],
    "upload_date": "2016-07-15T00:09:52",
    "url": "https://api.openml.org/data/v1/download/3363385/QSAR-DATASET-FOR-DRUG-TARGET-CHEMBL5262.arff",
    "version": "9",
    "visibility": "public"
  }
}