{
  "data_qualities": {
    "quality": [
      {
        "name": "AutoCorrelation",
        "value": "-0.05698861047836075"
      },
      {
        "name": "ClassEntropy",
        "value": []
      },
      {
        "name": "Dimensionality",
        "value": "2.331818181818182"
      },
      {
        "name": "EquivalentNumberOfAtts",
        "value": []
      },
      {
        "name": "MajorityClassPercentage",
        "value": []
      },
      {
        "name": "MajorityClassSize",
        "value": []
      },
      {
        "name": "MaxAttributeEntropy",
        "value": []
      },
      {
        "name": "MaxKurtosisOfNumericAtts",
        "value": "439.99999999999994"
      },
      {
        "name": "MaxMeansOfNumericAtts",
        "value": "5.886820454545455"
      },
      {
        "name": "MaxMutualInformation",
        "value": []
      },
      {
        "name": "MaxNominalAttDistinctValues",
        "value": []
      },
      {
        "name": "MaxSkewnessOfNumericAtts",
        "value": "20.976176963403034"
      },
      {
        "name": "MaxStdDevOfNumericAtts",
        "value": "1.4767258023250753"
      },
      {
        "name": "MeanAttributeEntropy",
        "value": []
      },
      {
        "name": "MeanKurtosisOfNumericAtts",
        "value": "149.13121928053323"
      },
      {
        "name": "MeanMeansOfNumericAtts",
        "value": "0.05107805099778273"
      },
      {
        "name": "MeanMutualInformation",
        "value": []
      },
      {
        "name": "MeanNoiseToSignalRatio",
        "value": []
      },
      {
        "name": "MeanNominalAttDistinctValues",
        "value": []
      },
      {
        "name": "MeanSkewnessOfNumericAtts",
        "value": "9.620333386377565"
      },
      {
        "name": "MeanStdDevOfNumericAtts",
        "value": "0.0887345597730182"
      },
      {
        "name": "MinAttributeEntropy",
        "value": []
      },
      {
        "name": "MinKurtosisOfNumericAtts",
        "value": "-2.0088189243854035"
      },
      {
        "name": "MinMeansOfNumericAtts",
        "value": "0.0"
      },
      {
        "name": "MinMutualInformation",
        "value": []
      },
      {
        "name": "MinNominalAttDistinctValues",
        "value": []
      },
      {
        "name": "MinSkewnessOfNumericAtts",
        "value": "-14.781514169991937"
      },
      {
        "name": "MinStdDevOfNumericAtts",
        "value": "0.0"
      },
      {
        "name": "MinorityClassPercentage",
        "value": []
      },
      {
        "name": "MinorityClassSize",
        "value": []
      },
      {
        "name": "NumberOfBinaryFeatures",
        "value": "0.0"
      },
      {
        "name": "NumberOfClasses",
        "value": "0.0"
      },
      {
        "name": "NumberOfFeatures",
        "value": "1026.0"
      },
      {
        "name": "NumberOfInstances",
        "value": "440.0"
      },
      {
        "name": "NumberOfInstancesWithMissingValues",
        "value": "0.0"
      },
      {
        "name": "NumberOfMissingValues",
        "value": "0.0"
      },
      {
        "name": "NumberOfNumericFeatures",
        "value": "1025.0"
      },
      {
        "name": "NumberOfSymbolicFeatures",
        "value": "1.0"
      },
      {
        "name": "PercentageOfBinaryFeatures",
        "value": "0.0"
      },
      {
        "name": "PercentageOfInstancesWithMissingValues",
        "value": "0.0"
      },
      {
        "name": "PercentageOfMissingValues",
        "value": "0.0"
      },
      {
        "name": "PercentageOfNumericFeatures",
        "value": "99.90253411306043"
      },
      {
        "name": "PercentageOfSymbolicFeatures",
        "value": "0.09746588693957114"
      },
      {
        "name": "Quartile1AttributeEntropy",
        "value": []
      },
      {
        "name": "Quartile1KurtosisOfNumericAtts",
        "value": "7.759348075701711"
      },
      {
        "name": "Quartile1MeansOfNumericAtts",
        "value": "0.0"
      },
      {
        "name": "Quartile1MutualInformation",
        "value": []
      },
      {
        "name": "Quartile1SkewnessOfNumericAtts",
        "value": "3.1183487064415645"
      },
      {
        "name": "Quartile1StdDevOfNumericAtts",
        "value": "0.0"
      },
      {
        "name": "Quartile2AttributeEntropy",
        "value": []
      },
      {
        "name": "Quartile2KurtosisOfNumericAtts",
        "value": "58.55014354817291"
      },
      {
        "name": "Quartile2MeansOfNumericAtts",
        "value": "0.0"
      },
      {
        "name": "Quartile2MutualInformation",
        "value": []
      },
      {
        "name": "Quartile2SkewnessOfNumericAtts",
        "value": "7.764278748527823"
      },
      {
        "name": "Quartile2StdDevOfNumericAtts",
        "value": "0.0"
      },
      {
        "name": "Quartile3AttributeEntropy",
        "value": []
      },
      {
        "name": "Quartile3KurtosisOfNumericAtts",
        "value": "217.48170388440676"
      },
      {
        "name": "Quartile3MeansOfNumericAtts",
        "value": "0.015909090909090866"
      },
      {
        "name": "Quartile3MutualInformation",
        "value": []
      },
      {
        "name": "Quartile3SkewnessOfNumericAtts",
        "value": "14.781514169991937"
      },
      {
        "name": "Quartile3StdDevOfNumericAtts",
        "value": "0.11610793244923054"
      },
      {
        "name": "StdvNominalAttDistinctValues",
        "value": []
      }
    ]
  }
}