"molecule_id","AMW","C.","H.","Me","Mi","Mp","Mv","MW","N.","nAB","nAT","nB","nBM","nBO","nBR","nBT","nC","nCL","nCsp","nCsp2","nCsp3","nDB","nF","nH","nHet","nHM","nI","nN","nO","nP","nS","nSK","nTB","nX","O.","RBF","RBN","SCBO","Se","Si","Sp","Sv","X.","pXC50"
{1 5.947,2 29.6,3 60.2,4 0.994,5 1.144,6 0.588,7 0.532,8 582.85,11 98,13 1,14 39,16 98,17 29,21 29,22 1,24 59,25 10,26 1,29 9,30 1,32 39,35 9.2,36 0.255,37 25,38 40,39 97.428,40 112.064,41 57.614,42 52.161,44 5}
{0 CHEMBL112884,1 6.114,2 30.8,3 58.6,4 0.998,5 1.144,6 0.59,7 0.541,8 813.16,11 133,13 3,14 55,16 133,17 41,20 2,21 39,22 3,23 1,24 78,25 14,26 1,29 12,30 1,32 55,34 1,35 9,36 0.286,37 38,38 58,39 132.759,40 152.184,41 78.529,42 71.957,43 0.8,44 5.097}
{0 CHEMBL300015,1 6.092,2 29.2,3 59.4,4 0.999,5 1.144,6 0.587,7 0.535,8 584.82,11 96,13 1,14 39,16 96,17 28,21 28,22 1,24 57,25 11,26 1,29 10,30 1,32 39,35 10.4,36 0.26,37 25,38 40,39 95.872,40 109.859,41 56.307,42 51.349,44 4.701}
{0 CHEMBL455766,1 8.848,2 54.8,3 32.3,4 1.013,5 1.099,6 0.741,7 0.728,8 274.29,9 6.5,10 12,11 31,13 16,14 23,16 33,17 17,19 1,20 16,22 3,24 10,25 4,28 2,29 2,32 21,33 1,35 6.5,36 0.061,37 2,38 34,39 31.393,40 34.076,41 22.966,42 22.58,44 5.699}
{0 CHEMBL473613,1 7.97,2 42,3 44,4 1.009,5 1.118,6 0.682,7 0.647,8 398.52,9 4,10 17,11 50,13 19,14 31,16 53,17 21,20 15,21 6,22 2,24 22,25 7,26 1,28 2,29 4,31 1,32 28,35 8,36 0.075,37 4,38 41.5,39 50.425,40 55.906,41 34.091,42 32.357,44 5.523}
{0 CHEMBL473614,1 10.366,2 45.7,3 31.4,4 1.038,5 1.108,6 0.747,7 0.73,8 362.81,9 5.7,10 12,11 35,13 17,14 26,16 37,17 16,18 1,20 16,22 5,24 11,25 8,26 2,28 2,29 4,31 1,32 24,34 1,35 11.4,36 0.054,37 2,38 37,39 36.331,40 38.774,41 26.142,42 25.551,43 2.9,44 5.022}
{0 CHEMBL475390,1 10.356,2 48.3,3 27.6,4 1.043,5 1.103,6 0.75,7 0.747,8 300.31,9 6.9,10 11,11 29,13 16,14 23,16 31,17 14,20 14,22 5,24 8,25 7,26 1,28 2,29 4,31 1,32 21,35 13.8,36 0.097,37 3,38 33.5,39 30.24,40 32,41 21.761,42 21.67,44 4.921}
{0 CHEMBL475466,1 8.983,2 47.2,3 36.1,4 1.013,5 1.109,6 0.733,7 0.703,8 323.4,9 8.3,10 20,11 36,13 21,14 26,16 39,17 17,20 16,21 1,22 1,24 13,25 6,26 1,28 3,29 2,31 1,32 23,35 5.6,36 0.077,37 3,38 37,39 36.454,40 39.91,41 26.381,42 25.315,44 5.301}
{0 CHEMBL475623,1 10.971,2 44,3 24,4 1.054,5 1.118,6 0.752,7 0.758,8 274.28,9 16,10 16,11 25,13 18,14 21,16 27,17 11,20 11,22 2,24 6,25 8,26 1,28 4,29 3,31 1,32 19,35 12,36 0.111,37 3,38 31,39 26.349,40 27.957,41 18.795,42 18.944,44 5.699}
{0 CHEMBL475627,1 8.873,2 50,3 36.1,4 1.004,5 1.103,6 0.748,7 0.711,8 319.41,9 8.3,10 22,11 36,13 22,14 26,16 39,17 18,20 17,21 1,24 13,25 5,26 1,28 3,29 1,31 1,32 23,35 2.8,36 0.077,37 3,38 37,39 36.127,40 39.7,41 26.926,42 25.6,44 5.398}
{0 CHEMBL475789,1 8.141,2 44.7,3 39.5,4 1.015,5 1.121,6 0.683,7 0.668,8 309.35,9 7.9,10 16,11 38,13 19,14 25,16 40,17 17,20 15,21 2,22 3,24 15,25 6,28 3,29 3,32 23,35 7.9,36 0.125,37 5,38 36,39 38.589,40 42.614,41 25.949,42 25.369,44 6}
{0 CHEMBL475790,1 9.867,2 46.9,3 31.3,4 1.036,5 1.116,6 0.728,7 0.723,8 315.73,9 9.4,10 16,11 32,13 19,14 24,16 34,17 15,18 1,20 15,22 3,24 10,25 7,26 1,28 3,29 3,32 22,34 1,35 9.4,36 0.088,37 3,38 35,39 33.145,40 35.728,41 23.284,42 23.143,43 3.1,44 6}
{0 CHEMBL509134,1 10.993,2 50,3 26.7,4 1.034,5 1.101,6 0.791,7 0.77,8 329.78,9 10,10 21,11 30,13 21,14 25,16 33,17 15,18 1,20 15,24 8,25 7,26 2,28 3,29 2,31 1,32 22,34 1,35 6.7,36 0.091,37 3,38 35.5,39 31.011,40 33.023,41 23.716,42 23.089,43 3.3,44 6}
{0 CHEMBL516039,1 10.559,2 50,3 30,4 1.026,5 1.098,6 0.782,7 0.753,8 316.78,9 6.7,10 12,11 30,13 15,14 23,16 32,17 15,18 1,20 15,22 3,24 9,25 6,26 2,28 2,29 2,31 1,32 21,34 1,35 6.7,36 0.063,37 2,38 32,39 30.793,40 32.94,41 23.472,42 22.594,43 3.3,44 5.699}
