{
  "data_set_description": {
    "collection_date": "November 2013",
    "creator": "Dr Jeremy Besnard, Dr Ivan Olier, Dr Noureddin Sadawi, Dr Larisa Soldatova, Dr Crina Grosan, Prof Ross King, Dr Richard Bickerton, Prof Andrew Hopkins and Dr Willem van Hoorn",
    "default_target_attribute": "pXC50",
    "description": "This dataset contains QSAR data (from ChEMBL version 17) showing activity values (unit is pseudo-pCI50) of several compounds on drug target ChEMBL_ID: CHEMBL4919 (TID: 100034), and it has 133 rows and 1237 features (not including molecule IDs and class feature: molecule_id and pXC50). The features represent Molecular Descriptors which were generated from SMILES strings. Missing value imputation was applied to this dataset (By choosing the Median).",
    "description_version": "1",
    "file_id": "3361844",
    "format": "ARFF",
    "id": "28472",
    "licence": "Public",
    "md5_checksum": "935acebdaf1b57b9b52518e575729b02",
    "minio_url": "https://data.openml.org/datasets/0002/28472/dataset_28472.pq",
    "name": "QSAR-DATASET-FOR-DRUG-TARGET-CHEMBL4919",
    "original_data_url": "https://www.ebi.ac.uk/chembl/target/inspect/CHEMBL4919",
    "parquet_url": "https://data.openml.org/datasets/0002/28472/dataset_28472.pq",
    "processing_date": "2018-10-04 00:50:59",
    "row_id_attribute": "molecule_id",
    "status": "deactivated",
    "tag": [
      "MetaQSAR",
      "study_13"
    ],
    "upload_date": "2016-07-15T00:04:51",
    "url": "https://api.openml.org/data/v1/download/3361844/QSAR-DATASET-FOR-DRUG-TARGET-CHEMBL4919.arff",
    "version": "8",
    "visibility": "public"
  }
}