"molecule_id","AMW","C.","H.","Me","Mi","Mp","Mv","MW","N.","nAB","nAT","nB","nBM","nBO","nBR","nBT","nC","nCL","nCsp","nCsp2","nCsp3","nDB","nF","nH","nHet","nHM","nI","nN","nO","nP","nS","nSK","nTB","nX","O.","RBF","RBN","SCBO","Se","Si","Sp","Sv","X.","pXC50"
{1 9.422,2 52.2,3 30.4,4 1.037,5 1.127,6 0.719,7 0.725,8 433.41,9 6.5,10 17,11 46,13 22,14 36,16 50,17 24,20 23,21 1,22 5,23 3,24 14,25 8,28 3,29 2,32 32,34 3,35 4.3,36 0.06,37 3,38 49.5,39 47.683,40 51.839,41 33.068,42 33.331,43 6.5,44 7.801}
{0 CHEMBL1098524,1 9.719,2 55.3,3 28.9,4 1.044,5 1.131,6 0.725,7 0.736,8 369.33,9 2.6,10 12,11 38,13 17,14 30,16 41,17 21,20 21,22 5,23 4,24 11,25 6,28 1,29 1,32 27,34 4,35 2.6,36 0.049,37 2,38 41,39 39.665,40 42.973,41 27.54,42 27.957,43 10.5,44 8.036}
{0 CHEMBL1098546,1 9.813,2 52.2,3 28.3,4 1.048,5 1.134,6 0.718,7 0.733,8 451.4,9 6.5,10 17,11 46,13 22,14 37,16 50,17 24,20 23,21 1,22 5,23 4,24 13,25 9,28 3,29 2,32 33,34 4,35 4.3,36 0.06,37 3,38 50.5,39 48.196,40 52.179,41 33.006,42 33.715,43 8.7,44 7.77}
{0 CHEMBL117109,1 10.257,2 52.3,3 29.5,4 1.027,5 1.112,6 0.766,7 0.75,8 451.3,9 9.1,10 22,11 44,13 25,14 35,16 48,17 23,18 2,20 23,22 3,23 1,24 13,25 8,26 2,28 4,29 1,32 31,34 3,35 2.3,36 0.063,37 3,38 49,39 45.196,40 48.922,41 33.699,42 33,43 6.8,44 6.815}
{0 CHEMBL118187,1 8.818,2 51.1,3 34,4 1.02,5 1.123,6 0.717,7 0.708,8 414.44,9 8.5,10 22,11 47,13 25,14 35,16 51,17 24,20 23,21 1,22 3,23 2,24 16,25 7,28 4,29 1,32 31,34 2,35 2.1,36 0.059,37 3,38 49,39 47.945,40 52.788,41 33.682,42 33.255,43 4.3,44 6.854}
{0 CHEMBL118466,1 8.835,2 49,3 36.7,4 1.013,5 1.119,6 0.722,7 0.698,8 432.91,9 8.2,10 22,11 49,13 24,14 35,16 53,17 24,18 1,20 21,21 3,22 2,23 1,24 18,25 7,26 1,28 4,29 1,32 31,34 2,35 2,36 0.057,37 3,38 48,39 49.64,40 54.808,41 35.364,42 34.226,43 4.1,44 7.027}
{0 CHEMBL118651,1 9.168,2 51.1,3 34,4 1.016,5 1.115,6 0.736,7 0.717,8 430.89,9 8.5,10 22,11 47,13 25,14 35,16 51,17 24,18 1,20 23,21 1,22 3,23 1,24 16,25 7,26 1,28 4,29 1,32 31,34 2,35 2.1,36 0.059,37 3,38 49,39 47.756,40 52.393,41 34.603,42 33.699,43 4.3,44 7.553}
{0 CHEMBL118768,1 11.04,2 52.3,3 27.3,4 1.035,5 1.111,6 0.785,7 0.769,8 485.74,9 9.1,10 22,11 44,13 25,14 36,16 48,17 23,18 3,20 23,22 3,23 1,24 12,25 9,26 3,28 4,29 1,32 32,34 4,35 2.3,36 0.063,37 3,38 50,39 45.52,40 48.866,41 34.557,42 33.827,43 9.1,44 7.194}
{0 CHEMBL118917,1 9.855,2 50,3 32.6,4 1.023,5 1.116,6 0.749,7 0.729,8 453.32,9 8.7,10 22,11 46,13 24,14 35,16 50,17 23,18 2,20 21,21 2,22 2,23 1,24 15,25 8,26 2,28 4,29 1,32 31,34 3,35 2.2,36 0.06,37 3,38 48,39 47.08,40 51.337,41 34.46,42 33.526,43 6.5,44 5.585}
{0 CHEMBL119675,1 9.569,2 49,3 32.7,4 1.034,5 1.132,6 0.719,7 0.714,8 468.89,9 8.2,10 22,11 49,13 24,14 37,16 53,17 24,18 1,20 21,21 3,22 2,23 3,24 16,25 9,26 1,28 4,29 1,32 33,34 4,35 2,36 0.057,37 3,38 50,39 50.665,40 55.487,41 35.239,42 34.992,43 8.2,44 6.45}
{0 CHEMBL2088575,1 8.669,2 49.1,3 35.8,4 1.024,5 1.123,6 0.7,7 0.693,8 459.48,9 5.7,10 12,11 53,13 19,14 38,16 57,17 26,20 23,21 3,22 7,23 2,24 19,25 8,28 3,29 3,32 34,34 2,35 5.7,36 0.105,37 6,38 51,39 54.265,40 59.539,41 37.108,42 36.716,43 3.8,44 7.444}
{0 CHEMBL2088576,1 8.132,2 45.6,3 40.4,4 1.018,5 1.129,6 0.678,7 0.663,8 463.52,9 5.3,10 12,11 57,13 18,14 37,16 60,17 26,20 21,21 5,22 6,23 2,24 23,25 8,28 3,29 3,32 34,34 2,35 5.3,36 0.117,37 7,38 49,39 58.032,40 64.37,41 38.631,42 37.77,43 3.5,44 6.745}
{0 CHEMBL2088577,1 8.391,2 47.3,3 38.2,4 1.021,5 1.126,6 0.689,7 0.677,8 461.5,9 5.5,10 12,11 55,13 18,14 38,16 59,17 26,20 21,21 5,22 6,23 2,24 21,25 8,28 3,29 3,32 34,34 2,35 5.5,36 0.102,37 6,38 50,39 56.149,40 61.955,41 37.87,42 37.243,43 3.6,44 6.638}
{0 CHEMBL2088578,1 9.05,2 50,3 33.3,4 1.033,5 1.122,6 0.704,7 0.706,8 434.42,9 4.2,10 12,11 48,13 19,14 35,16 51,17 24,20 23,21 1,22 7,23 2,24 16,25 8,28 2,29 4,32 32,34 2,35 8.3,36 0.118,37 6,38 48,39 49.607,40 53.835,41 33.796,42 33.883,43 4.2,44 8.114}
{0 CHEMBL2088579,1 8.391,2 47.3,3 38.2,4 1.021,5 1.126,6 0.689,7 0.677,8 461.5,9 5.5,10 12,11 55,13 19,14 37,16 58,17 26,20 23,21 3,22 7,23 2,24 21,25 8,28 3,29 3,32 34,34 2,35 5.5,36 0.121,37 7,38 50,39 56.149,40 61.955,41 37.87,42 37.243,43 3.6,44 7.272}
{0 CHEMBL2088580,1 9.213,2 49,3 32.7,4 1.039,5 1.132,6 0.7,7 0.706,8 451.43,9 6.1,10 12,11 49,13 18,14 37,16 53,17 24,20 21,21 3,22 6,23 3,24 16,25 9,28 3,29 3,32 33,34 3,35 6.1,36 0.094,37 5,38 49,39 50.894,40 55.464,41 34.284,42 34.573,43 6.1,44 6.699}
{0 CHEMBL2088581,1 8.951,2 48.1,3 34.6,4 1.034,5 1.132,6 0.693,7 0.694,8 465.46,9 5.8,10 12,11 52,13 18,14 38,16 56,17 25,20 21,21 4,22 6,23 3,24 18,25 9,28 3,29 3,32 34,34 3,35 5.8,36 0.071,37 4,38 50,39 53.778,40 58.879,41 36.046,42 36.1,43 5.8,44 5.523}
{0 CHEMBL2088582,1 9.69,2 50,3 29.5,4 1.051,5 1.131,6 0.704,7 0.721,8 426.37,9 4.5,10 12,11 44,13 18,14 34,16 47,17 22,20 21,21 1,22 6,23 3,24 13,25 9,28 2,29 4,32 31,34 3,35 9.1,36 0.106,37 5,38 46,39 46.236,40 49.76,41 30.972,42 31.74,43 6.8,44 7.569}
{0 CHEMBL2088583,1 9.791,2 50,3 28.3,4 1.048,5 1.133,6 0.712,7 0.729,8 450.4,9 8.7,10 17,11 46,13 22,14 37,16 50,17 23,20 22,21 1,22 5,23 3,24 13,25 10,28 4,29 3,32 33,34 3,35 6.5,36 0.08,37 4,38 50.5,39 48.229,40 52.132,41 32.767,42 33.541,43 6.5,44 7.18}
{0 CHEMBL2088584,1 8.891,2 47.1,3 35.3,4 1.035,5 1.135,6 0.687,7 0.688,8 453.45,9 5.9,10 12,11 51,13 18,14 36,16 54,17 24,20 21,21 3,22 6,23 3,24 18,25 9,28 3,29 3,32 33,34 3,35 5.9,36 0.111,37 6,38 48,39 52.778,40 57.879,41 35.046,42 35.1,43 5.9,44 6.398}
{0 CHEMBL2088585,1 9.693,2 52.6,3 28.9,4 1.045,5 1.13,6 0.718,7 0.731,8 368.33,9 5.3,10 12,11 38,13 17,14 30,16 41,17 20,20 20,22 5,23 3,24 11,25 7,28 2,29 2,32 27,34 3,35 5.3,36 0.073,37 3,38 41,39 39.698,40 42.926,41 27.301,42 27.783,43 7.9,44 6.523}
{0 CHEMBL2088586,1 10.166,2 52.6,3 26.3,4 1.058,5 1.139,6 0.717,7 0.741,8 386.32,9 5.3,10 12,11 38,13 17,14 31,16 41,17 20,20 20,22 5,23 4,24 10,25 8,28 2,29 2,32 28,34 4,35 5.3,36 0.073,37 3,38 42,39 40.211,40 43.265,41 27.239,42 28.166,43 10.5,44 7.066}
{0 CHEMBL2088587,1 9.056,2 50,3 33.3,4 1.033,5 1.124,6 0.704,7 0.706,8 380.37,9 4.8,10 12,11 42,13 17,14 31,16 45,17 21,20 20,21 1,22 5,23 2,24 14,25 7,28 2,29 3,32 28,34 2,35 7.1,36 0.089,37 4,38 42,39 43.396,40 47.211,41 29.58,42 29.641,43 4.8,44 6.854}
{0 CHEMBL2088588,1 9.134,2 47.9,3 33.3,4 1.04,5 1.126,6 0.693,7 0.7,8 438.41,9 4.2,10 12,11 48,13 18,14 35,16 51,17 23,20 21,21 2,22 6,23 2,24 16,25 9,28 2,29 5,32 32,34 2,35 10.4,36 0.118,37 6,38 47,39 49.934,40 54.045,41 33.25,42 33.598,43 4.2,44 8.032}
{0 CHEMBL2088589,1 8.463,2 45.5,3 38.2,4 1.027,5 1.13,6 0.679,7 0.672,8 465.49,9 5.5,10 12,11 55,13 18,14 37,16 58,17 25,20 21,21 4,22 6,23 2,24 21,25 9,28 3,29 4,32 34,34 2,35 7.3,36 0.121,37 7,38 49,39 56.476,40 62.164,41 37.324,42 36.958,43 3.6,44 6.959}
{0 CHEMBL2088590,1 8.745,2 47.2,3 35.8,4 1.03,5 1.127,6 0.69,7 0.687,8 463.47,9 5.7,10 12,11 53,13 18,14 38,16 57,17 25,20 21,21 4,22 6,23 2,24 19,25 9,28 3,29 4,32 34,34 2,35 7.5,36 0.105,37 6,38 50,39 54.592,40 59.749,41 36.563,42 36.431,43 3.8,44 7.194}
{0 CHEMBL2088591,1 9.249,2 48,3 32,4 1.039,5 1.128,6 0.701,7 0.708,8 462.44,9 8,10 17,11 50,13 22,14 38,16 54,17 24,20 22,21 2,22 5,23 2,24 16,25 10,28 4,29 4,32 34,34 2,35 8,36 0.093,37 5,38 51.5,39 51.927,40 56.417,41 35.046,42 35.399,43 4,44 8.071}
{0 CHEMBL325706,1 9.518,2 51.1,3 34,4 1.012,5 1.106,6 0.756,7 0.726,8 447.34,9 8.5,10 22,11 47,13 25,14 35,16 51,17 24,18 2,20 23,21 1,22 3,24 16,25 7,26 2,28 4,29 1,32 31,34 2,35 2.1,36 0.059,37 3,38 49,39 47.567,40 51.997,41 35.523,42 34.143,43 4.3,44 7.357}
{0 CHEMBL325854,1 8.499,2 49,3 36.7,4 1.017,5 1.127,6 0.703,7 0.689,8 416.46,9 8.2,10 22,11 49,13 24,14 35,16 53,17 24,20 21,21 3,22 2,23 2,24 18,25 7,28 4,29 1,32 31,34 2,35 2,36 0.057,37 3,38 48,39 49.829,40 55.204,41 34.444,42 33.781,43 4.1,44 7.108}
{0 CHEMBL331842,1 11.413,2 52.3,3 27.3,4 1.03,5 1.102,6 0.806,7 0.779,8 502.19,9 9.1,10 22,11 44,13 25,14 36,16 48,17 23,18 4,20 23,22 3,24 12,25 9,26 4,28 4,29 1,32 32,34 4,35 2.3,36 0.063,37 3,38 50,39 45.331,40 48.47,41 35.477,42 34.271,43 9.1,44 6.051}
{0 CHEMBL333243,1 10.666,2 52.3,3 27.3,4 1.039,5 1.12,6 0.764,7 0.759,8 469.29,9 9.1,10 22,11 44,13 25,14 36,16 48,17 23,18 2,20 23,22 3,23 2,24 12,25 9,26 2,28 4,29 1,32 32,34 4,35 2.3,36 0.063,37 3,38 50,39 45.709,40 49.261,41 33.637,42 33.383,43 9.1,44 6.951}
{0 CHEMBL334184,1 10.257,2 52.3,3 29.5,4 1.027,5 1.112,6 0.766,7 0.75,8 451.3,9 9.1,10 22,11 44,13 25,14 35,16 48,17 23,18 2,20 23,22 3,23 1,24 13,25 8,26 2,28 4,29 1,32 31,34 3,35 2.3,36 0.063,37 3,38 49,39 45.196,40 48.922,41 33.699,42 33,43 6.8,44 6.767}
{0 CHEMBL334215,1 10.246,2 50,3 30.4,4 1.035,5 1.123,6 0.748,7 0.737,8 471.31,9 8.7,10 22,11 46,13 24,14 36,16 50,17 23,18 2,20 21,21 2,22 2,23 2,24 14,25 9,26 2,28 4,29 1,32 32,34 4,35 2.2,36 0.06,37 3,38 49,39 47.593,40 51.676,41 34.398,42 33.91,43 8.7,44 7.201}
{0 CHEMBL434409,1 10.603,2 50,3 30.4,4 1.031,5 1.115,6 0.768,7 0.747,8 487.76,9 8.7,10 22,11 46,13 24,14 36,16 50,17 23,18 3,20 21,21 2,22 2,23 1,24 14,25 9,26 3,28 4,29 1,32 32,34 4,35 2.2,36 0.06,37 3,38 49,39 47.404,40 51.281,41 35.318,42 34.354,43 8.7,44 6.174}
