{
  "data_features": {
    "feature": [
      {
        "data_type": "nominal",
        "index": "0",
        "is_ignore": "false",
        "is_row_identifier": "true",
        "is_target": "false",
        "name": "molecule_id",
        "nominal_value": [
          "CHEMBL125634",
          "CHEMBL1299200",
          "CHEMBL1299757",
          "CHEMBL1303854",
          "CHEMBL1304402",
          "CHEMBL1312303",
          "CHEMBL1329288",
          "CHEMBL1330307",
          "CHEMBL1332050",
          "CHEMBL1334040",
          "CHEMBL1334407",
          "CHEMBL1344034",
          "CHEMBL1344739",
          "CHEMBL1346300",
          "CHEMBL1350237",
          "CHEMBL1353885",
          "CHEMBL1359321",
          "CHEMBL1361173",
          "CHEMBL1362561",
          "CHEMBL1363171",
          "CHEMBL1367250",
          "CHEMBL1376540",
          "CHEMBL1376711",
          "CHEMBL1378339",
          "CHEMBL1378634",
          "CHEMBL1379448",
          "CHEMBL1379933",
          "CHEMBL1381436",
          "CHEMBL1382628",
          "CHEMBL1385585",
          "CHEMBL1387843",
          "CHEMBL1391287",
          "CHEMBL1392911",
          "CHEMBL1397706",
          "CHEMBL1402456",
          "CHEMBL1405287",
          "CHEMBL1407037",
          "CHEMBL1407368",
          "CHEMBL1410383",
          "CHEMBL1412774",
          "CHEMBL1416880",
          "CHEMBL1419462",
          "CHEMBL1420242",
          "CHEMBL1421309",
          "CHEMBL1422086",
          "CHEMBL1422386",
          "CHEMBL1423935",
          "CHEMBL1426692",
          "CHEMBL1428486",
          "CHEMBL1429411",
          "CHEMBL1432243",
          "CHEMBL1432553",
          "CHEMBL1433546",
          "CHEMBL1439066",
          "CHEMBL1446100",
          "CHEMBL1450505",
          "CHEMBL1453503",
          "CHEMBL1455825",
          "CHEMBL1456440",
          "CHEMBL1458321",
          "CHEMBL1463829",
          "CHEMBL1464193",
          "CHEMBL1464805",
          "CHEMBL1466929",
          "CHEMBL1468091",
          "CHEMBL1470871",
          "CHEMBL1470891",
          "CHEMBL1471716",
          "CHEMBL1477061",
          "CHEMBL1494338",
          "CHEMBL1495013",
          "CHEMBL1495148",
          "CHEMBL1497894",
          "CHEMBL1501376",
          "CHEMBL1501990",
          "CHEMBL1502394",
          "CHEMBL1503729",
          "CHEMBL1505623",
          "CHEMBL1505788",
          "CHEMBL1507003",
          "CHEMBL1510003",
          "CHEMBL1516601",
          "CHEMBL1516738",
          "CHEMBL1517284",
          "CHEMBL1518085",
          "CHEMBL1519313",
          "CHEMBL1530097",
          "CHEMBL1530147",
          "CHEMBL1533230",
          "CHEMBL1536273",
          "CHEMBL1537522",
          "CHEMBL1541408",
          "CHEMBL1545435",
          "CHEMBL1545609",
          "CHEMBL1547860",
          "CHEMBL1556771",
          "CHEMBL1562161",
          "CHEMBL1562466",
          "CHEMBL1563939",
          "CHEMBL1575320",
          "CHEMBL1577193",
          "CHEMBL1582997",
          "CHEMBL1584229",
          "CHEMBL1585740",
          "CHEMBL1586135",
          "CHEMBL1594854",
          "CHEMBL1598442",
          "CHEMBL1598762",
          "CHEMBL1609678",
          "CHEMBL171632",
          "CHEMBL175434",
          "CHEMBL1864348",
          "CHEMBL1969046",
          "CHEMBL1980308",
          "CHEMBL1992835",
          "CHEMBL1996724",
          "CHEMBL1998502",
          "CHEMBL2003651",
          "CHEMBL2003806",
          "CHEMBL2006503",
          "CHEMBL205040",
          "CHEMBL299846",
          "CHEMBL490592",
          "CHEMBL49699",
          "CHEMBL567967",
          "CHEMBL578905",
          "CHEMBL8327"
        ],
        "number_of_missing_values": "0"
      },
      {
        "data_type": "numeric",
        "index": "1",
        "is_ignore": "false",
        "is_row_identifier": "false",
        "is_target": "false",
        "name": "AMW",
        "number_of_missing_values": "0"
      },
      {
        "data_type": "numeric",
        "index": "2",
        "is_ignore": "false",
        "is_row_identifier": "false",
        "is_target": "false",
        "name": "C.",
        "number_of_missing_values": "0"
      },
      {
        "data_type": "numeric",
        "index": "3",
        "is_ignore": "false",
        "is_row_identifier": "false",
        "is_target": "false",
        "name": "H.",
        "number_of_missing_values": "0"
      },
      {
        "data_type": "numeric",
        "index": "4",
        "is_ignore": "false",
        "is_row_identifier": "false",
        "is_target": "false",
        "name": "Me",
        "number_of_missing_values": "0"
      },
      {
        "data_type": "numeric",
        "index": "5",
        "is_ignore": "false",
        "is_row_identifier": "false",
        "is_target": "false",
        "name": "Mi",
        "number_of_missing_values": "0"
      },
      {
        "data_type": "numeric",
        "index": "6",
        "is_ignore": "false",
        "is_row_identifier": "false",
        "is_target": "false",
        "name": "Mp",
        "number_of_missing_values": "0"
      },
      {
        "data_type": "numeric",
        "index": "7",
        "is_ignore": "false",
        "is_row_identifier": "false",
        "is_target": "false",
        "name": "Mv",
        "number_of_missing_values": "0"
      },
      {
        "data_type": "numeric",
        "index": "8",
        "is_ignore": "false",
        "is_row_identifier": "false",
        "is_target": "false",
        "name": "MW",
        "number_of_missing_values": "0"
      },
      {
        "data_type": "numeric",
        "index": "9",
        "is_ignore": "false",
        "is_row_identifier": "false",
        "is_target": "false",
        "name": "N.",
        "number_of_missing_values": "0"
      },
      {
        "data_type": "numeric",
        "index": "10",
        "is_ignore": "false",
        "is_row_identifier": "false",
        "is_target": "false",
        "name": "nAB",
        "number_of_missing_values": "0"
      },
      {
        "data_type": "numeric",
        "index": "11",
        "is_ignore": "false",
        "is_row_identifier": "false",
        "is_target": "false",
        "name": "nAT",
        "number_of_missing_values": "0"
      },
      {
        "data_type": "numeric",
        "index": "12",
        "is_ignore": "false",
        "is_row_identifier": "false",
        "is_target": "false",
        "name": "nB",
        "number_of_missing_values": "0"
      },
      {
        "data_type": "numeric",
        "index": "13",
        "is_ignore": "false",
        "is_row_identifier": "false",
        "is_target": "false",
        "name": "nBM",
        "number_of_missing_values": "0"
      },
      {
        "data_type": "numeric",
        "index": "14",
        "is_ignore": "false",
        "is_row_identifier": "false",
        "is_target": "false",
        "name": "nBO",
        "number_of_missing_values": "0"
      },
      {
        "data_type": "numeric",
        "index": "15",
        "is_ignore": "false",
        "is_row_identifier": "false",
        "is_target": "false",
        "name": "nBR",
        "number_of_missing_values": "0"
      },
      {
        "data_type": "numeric",
        "index": "16",
        "is_ignore": "false",
        "is_row_identifier": "false",
        "is_target": "false",
        "name": "nBT",
        "number_of_missing_values": "0"
      },
      {
        "data_type": "numeric",
        "index": "17",
        "is_ignore": "false",
        "is_row_identifier": "false",
        "is_target": "false",
        "name": "nC",
        "number_of_missing_values": "0"
      },
      {
        "data_type": "numeric",
        "index": "18",
        "is_ignore": "false",
        "is_row_identifier": "false",
        "is_target": "false",
        "name": "nCL",
        "number_of_missing_values": "0"
      },
      {
        "data_type": "numeric",
        "index": "19",
        "is_ignore": "false",
        "is_row_identifier": "false",
        "is_target": "false",
        "name": "nCsp",
        "number_of_missing_values": "0"
      },
      {
        "data_type": "numeric",
        "index": "20",
        "is_ignore": "false",
        "is_row_identifier": "false",
        "is_target": "false",
        "name": "nCsp2",
        "number_of_missing_values": "0"
      },
      {
        "data_type": "numeric",
        "index": "21",
        "is_ignore": "false",
        "is_row_identifier": "false",
        "is_target": "false",
        "name": "nCsp3",
        "number_of_missing_values": "0"
      },
      {
        "data_type": "numeric",
        "index": "22",
        "is_ignore": "false",
        "is_row_identifier": "false",
        "is_target": "false",
        "name": "nDB",
        "number_of_missing_values": "0"
      },
      {
        "data_type": "numeric",
        "index": "23",
        "is_ignore": "false",
        "is_row_identifier": "false",
        "is_target": "false",
        "name": "nF",
        "number_of_missing_values": "0"
      },
      {
        "data_type": "numeric",
        "index": "24",
        "is_ignore": "false",
        "is_row_identifier": "false",
        "is_target": "false",
        "name": "nH",
        "number_of_missing_values": "0"
      },
      {
        "data_type": "numeric",
        "index": "25",
        "is_ignore": "false",
        "is_row_identifier": "false",
        "is_target": "false",
        "name": "nHet",
        "number_of_missing_values": "0"
      },
      {
        "data_type": "numeric",
        "index": "26",
        "is_ignore": "false",
        "is_row_identifier": "false",
        "is_target": "false",
        "name": "nHM",
        "number_of_missing_values": "0"
      },
      {
        "data_type": "numeric",
        "index": "27",
        "is_ignore": "false",
        "is_row_identifier": "false",
        "is_target": "false",
        "name": "nI",
        "number_of_missing_values": "0"
      },
      {
        "data_type": "numeric",
        "index": "28",
        "is_ignore": "false",
        "is_row_identifier": "false",
        "is_target": "false",
        "name": "nN",
        "number_of_missing_values": "0"
      },
      {
        "data_type": "numeric",
        "index": "29",
        "is_ignore": "false",
        "is_row_identifier": "false",
        "is_target": "false",
        "name": "nO",
        "number_of_missing_values": "0"
      },
      {
        "data_type": "numeric",
        "index": "30",
        "is_ignore": "false",
        "is_row_identifier": "false",
        "is_target": "false",
        "name": "nP",
        "number_of_missing_values": "0"
      },
      {
        "data_type": "numeric",
        "index": "31",
        "is_ignore": "false",
        "is_row_identifier": "false",
        "is_target": "false",
        "name": "nS",
        "number_of_missing_values": "0"
      },
      {
        "data_type": "numeric",
        "index": "32",
        "is_ignore": "false",
        "is_row_identifier": "false",
        "is_target": "false",
        "name": "nSK",
        "number_of_missing_values": "0"
      },
      {
        "data_type": "numeric",
        "index": "33",
        "is_ignore": "false",
        "is_row_identifier": "false",
        "is_target": "false",
        "name": "nTB",
        "number_of_missing_values": "0"
      },
      {
        "data_type": "numeric",
        "index": "34",
        "is_ignore": "false",
        "is_row_identifier": "false",
        "is_target": "false",
        "name": "nX",
        "number_of_missing_values": "0"
      },
      {
        "data_type": "numeric",
        "index": "35",
        "is_ignore": "false",
        "is_row_identifier": "false",
        "is_target": "false",
        "name": "O.",
        "number_of_missing_values": "0"
      },
      {
        "data_type": "numeric",
        "index": "36",
        "is_ignore": "false",
        "is_row_identifier": "false",
        "is_target": "false",
        "name": "RBF",
        "number_of_missing_values": "0"
      },
      {
        "data_type": "numeric",
        "index": "37",
        "is_ignore": "false",
        "is_row_identifier": "false",
        "is_target": "false",
        "name": "RBN",
        "number_of_missing_values": "0"
      },
      {
        "data_type": "numeric",
        "index": "38",
        "is_ignore": "false",
        "is_row_identifier": "false",
        "is_target": "false",
        "name": "SCBO",
        "number_of_missing_values": "0"
      },
      {
        "data_type": "numeric",
        "index": "39",
        "is_ignore": "false",
        "is_row_identifier": "false",
        "is_target": "false",
        "name": "Se",
        "number_of_missing_values": "0"
      },
      {
        "data_type": "numeric",
        "index": "40",
        "is_ignore": "false",
        "is_row_identifier": "false",
        "is_target": "false",
        "name": "Si",
        "number_of_missing_values": "0"
      },
      {
        "data_type": "numeric",
        "index": "41",
        "is_ignore": "false",
        "is_row_identifier": "false",
        "is_target": "false",
        "name": "Sp",
        "number_of_missing_values": "0"
      },
      {
        "data_type": "numeric",
        "index": "42",
        "is_ignore": "false",
        "is_row_identifier": "false",
        "is_target": "false",
        "name": "Sv",
        "number_of_missing_values": "0"
      },
      {
        "data_type": "numeric",
        "index": "43",
        "is_ignore": "false",
        "is_row_identifier": "false",
        "is_target": "false",
        "name": "X.",
        "number_of_missing_values": "0"
      },
      {
        "data_type": "numeric",
        "index": "44",
        "is_ignore": "false",
        "is_row_identifier": "false",
        "is_target": "true",
        "name": "pXC50",
        "number_of_missing_values": "0"
      }
    ]
  }
}