{
  "data_set_description": {
    "collection_date": "November 2013",
    "creator": "Dr Jeremy Besnard, Dr Ivan Olier, Dr Noureddin Sadawi, Dr Larisa Soldatova, Dr Crina Grosan, Prof Ross King, Dr Richard Bickerton, Prof Andrew Hopkins and Dr Willem van Hoorn",
    "default_target_attribute": "pXC50",
    "description": "This dataset contains QSAR data (from ChEMBL version 17) showing activity values (unit is pseudo-pCI50) of several compounds on drug target ChEMBL_ID: CHEMBL3687 (TID: 11134), and it has 173 rows and 43 features (not including molecule IDs and class feature: molecule_id and pXC50). The features represent Basic Molecular Descriptors which were generated from SMILES strings.  Missing value imputation was applied to this dataset (By choosing the Median).",
    "description_version": "1",
    "file_id": "3356647",
    "format": "ARFF",
    "id": "28327",
    "licence": "Public",
    "md5_checksum": "d15abbdc6af7d4d65db53ea6a1a9b78a",
    "minio_url": "https://data.openml.org/datasets/0002/28327/dataset_28327.pq",
    "name": "QSAR-DATASET-FOR-DRUG-TARGET-CHEMBL3687",
    "original_data_url": "https://www.ebi.ac.uk/chembl/target/inspect/CHEMBL3687",
    "parquet_url": "https://data.openml.org/datasets/0002/28327/dataset_28327.pq",
    "processing_date": "2018-10-04 00:55:08",
    "row_id_attribute": "molecule_id",
    "status": "deactivated",
    "tag": [
      "MetaQSAR",
      "study_13"
    ],
    "upload_date": "2016-07-14T23:42:29",
    "url": "https://api.openml.org/data/v1/download/3356647/QSAR-DATASET-FOR-DRUG-TARGET-CHEMBL3687.arff",
    "version": "9",
    "visibility": "public"
  }
}