"molecule_id","GATS2i","MATS4p","AAC","AECC","ALOGP","ALOGP2","AMR","AMW","ATS1e","ATS1i","ATS1m","ATS1p","ATS1s","ATS1v","ATS2e","ATS2i","ATS2m","ATS2p","ATS2s","ATS2v","ATS3e","ATS3i","ATS3m","ATS3p","ATS3s","ATS3v","ATS4e","ATS4i","ATS4m","ATS4p","ATS4s","ATS4v","ATS5e","ATS5i","ATS5m","ATS5p","ATS5s","ATS5v","ATS6e","ATS6i","ATS6m","ATS6p","ATS6s","ATS6v","ATS7e","ATS7i","ATS7m","ATS7p","ATS7s","ATS7v","ATS8e","ATS8i","ATS8m","pXC50"
{1 1.323,2 -0.056,3 1.058,4 16.964,5 6.15,6 37.827,7 124.34,8 4.862,9 4.395,10 4.565,11 3.569,12 3.867,13 5.027,14 3.748,15 5.073,16 5.328,17 3.824,18 4.32,19 5.591,20 4.139,21 5.458,22 5.771,23 3.851,24 4.541,25 5.899,26 4.296,27 5.543,28 5.878,29 3.743,30 4.546,31 5.945,32 4.263,33 5.497,34 5.846,35 3.664,36 4.449,37 5.882,38 4.162,39 5.378,40 5.725,41 3.587,42 4.332,43 5.781,44 4.058,45 5.274,46 5.616,47 3.503,48 4.257,49 5.691,50 3.985,51 5.219,52 5.56,53 3.423,54 4.833}
{0 CHEMBL197748,1 1.496,2 0.005,3 1.243,4 14.5,5 3.902,6 15.227,7 95.284,8 5.141,9 4.102,10 4.28,11 3.271,12 3.529,13 4.936,14 3.424,15 4.709,16 4.963,17 3.434,18 3.901,19 5.423,20 3.716,21 5.049,22 5.376,23 3.466,24 4.013,25 5.752,26 3.783,27 5.021,28 5.345,29 3.384,30 3.961,31 5.717,32 3.736,33 4.959,34 5.284,35 3.331,36 3.907,37 5.636,38 3.679,39 4.912,40 5.239,41 3.289,42 3.847,43 5.63,44 3.619,45 4.849,46 5.177,47 3.196,48 3.774,49 5.613,50 3.541,51 4.762,52 5.094,53 3.05,54 4.32}
{0 CHEMBL535154,1 1.49,2 0.001,3 1.251,4 14.783,5 5.052,6 25.523,7 98.552,8 5.252,9 4.135,10 4.306,11 3.362,12 3.57,13 4.9,14 3.473,15 4.77,16 5.024,17 3.549,18 3.949,19 5.448,20 3.782,21 5.098,22 5.422,23 3.511,24 4.067,25 5.702,26 3.843,27 5.041,28 5.37,29 3.417,30 4.006,31 5.63,32 3.772,33 4.959,34 5.277,35 3.364,36 3.926,37 5.627,38 3.705,39 4.89,40 5.203,41 3.282,42 3.871,43 5.564,44 3.642,45 4.85,46 5.179,47 3.162,48 3.819,49 5.402,50 3.572,51 4.787,52 5.12,53 3.098,54 4.415}
{0 CHEMBL535378,1 1.389,2 -0.054,3 1.153,4 18.5,5 7.472,6 55.825,7 130.369,8 5.132,9 4.41,10 4.573,11 3.626,12 3.897,13 5.109,14 3.787,15 5.075,16 5.32,17 3.864,18 4.327,19 5.68,20 4.151,21 5.445,22 5.757,23 3.895,24 4.501,25 5.975,26 4.273,27 5.46,28 5.774,29 3.821,30 4.483,31 6.026,32 4.239,33 5.437,34 5.765,35 3.733,36 4.412,37 5.976,38 4.157,39 5.352,40 5.69,41 3.629,42 4.299,43 5.863,44 4.044,45 5.212,46 5.544,47 3.567,48 4.182,49 5.772,50 3.943,51 5.102,52 5.412,53 3.523,54 4.595}
{0 CHEMBL535379,1 1.441,2 -0.027,3 1.079,4 14.682,5 5.81,6 33.757,7 99.854,8 4.854,9 4.151,10 4.325,11 3.304,12 3.616,13 4.832,14 3.496,15 4.802,16 5.06,17 3.491,18 4.021,19 5.359,20 3.827,21 5.152,22 5.481,23 3.459,24 4.165,25 5.63,26 3.909,27 5.15,28 5.495,29 3.306,30 4.109,31 5.595,32 3.822,33 5.048,34 5.401,35 3.206,36 3.997,37 5.442,38 3.71,39 4.919,40 5.258,41 3.152,42 3.914,43 5.355,44 3.64,45 4.883,46 5.227,47 3.094,48 3.862,49 5.315,50 3.584,51 4.818,52 5.162,53 3.03,54 4.656}
{0 CHEMBL535605,1 1.324,2 -0.061,3 1.146,4 19.129,5 8.007,6 64.12,7 135.664,8 5.116,9 4.444,10 4.607,11 3.66,12 3.927,13 5.144,14 3.817,15 5.112,16 5.361,17 3.909,18 4.358,19 5.708,20 4.186,21 5.47,22 5.776,23 3.948,24 4.55,25 6.008,26 4.325,27 5.528,28 5.845,29 3.86,30 4.544,31 6.085,32 4.294,33 5.495,34 5.828,35 3.764,36 4.456,37 6.017,38 4.196,39 5.378,40 5.714,41 3.685,42 4.34,43 5.884,44 4.089,45 5.258,46 5.583,47 3.639,48 4.254,49 5.821,50 4.018,51 5.198,52 5.512,53 3.58,54 4.638}
{0 CHEMBL535606,1 1.381,2 -0.055,3 1.068,4 17,5 7.505,6 56.328,7 121.541,8 4.919,9 4.344,10 4.513,11 3.528,12 3.829,13 4.982,14 3.711,15 5.015,16 5.268,17 3.749,18 4.263,19 5.548,20 4.077,21 5.383,22 5.703,23 3.756,24 4.444,25 5.813,26 4.196,27 5.409,28 5.739,29 3.659,30 4.43,31 5.816,32 4.156,33 5.382,34 5.726,35 3.587,36 4.35,37 5.782,38 4.07,39 5.283,40 5.632,41 3.475,42 4.225,43 5.693,44 3.948,45 5.137,46 5.483,47 3.364,48 4.103,49 5.551,50 3.833,51 5.028,52 5.362,53 3.299,54 4.719}
{0 CHEMBL535827,1 1.43,2 -0.021,3 1.074,4 15.522,5 6.284,6 39.49,7 104.151,8 4.846,9 4.195,10 4.369,11 3.346,12 3.663,13 4.853,14 3.541,15 4.847,16 5.105,17 3.502,18 4.065,19 5.393,20 3.865,21 5.195,22 5.529,23 3.463,24 4.195,25 5.63,26 3.929,27 5.166,28 5.513,29 3.344,30 4.118,31 5.588,32 3.836,33 5.066,34 5.416,35 3.268,36 4.021,37 5.494,38 3.744,39 4.971,40 5.311,41 3.206,42 3.967,43 5.389,44 3.693,45 4.938,46 5.28,47 3.153,48 3.922,49 5.353,50 3.645,51 4.883,52 5.227,53 3.094,54 4.975}
{0 CHEMBL536051,1 1.297,2 -0.068,3 1.073,4 16.077,5 7.129,6 50.818,7 117.634,8 4.929,9 4.306,10 4.474,11 3.498,12 3.785,13 4.95,14 3.668,15 4.98,16 5.237,17 3.736,18 4.22,19 5.509,20 4.043,21 5.332,22 5.643,23 3.754,24 4.423,25 5.779,26 4.184,27 5.409,28 5.74,29 3.635,30 4.422,31 5.818,32 4.145,33 5.368,34 5.718,35 3.548,36 4.318,37 5.756,38 4.033,39 5.226,40 5.573,41 3.458,42 4.178,43 5.634,44 3.909,45 5.089,46 5.426,47 3.361,48 4.082,49 5.518,50 3.819,51 5.027,52 5.362,53 3.271,54 4.728}
{0 CHEMBL536052,1 1.406,2 -0.052,3 1.251,4 14.696,5 4.981,6 24.805,7 99.736,8 5.252,9 4.135,10 4.306,11 3.362,12 3.57,13 4.927,14 3.473,15 4.77,16 5.025,17 3.569,18 3.961,19 5.434,20 3.798,21 5.098,22 5.413,23 3.57,24 4.108,25 5.73,26 3.894,27 5.094,28 5.412,29 3.446,30 4.062,31 5.762,32 3.825,33 5.016,34 5.347,35 3.329,36 3.955,37 5.637,38 3.71,39 4.885,40 5.211,41 3.266,42 3.872,43 5.517,44 3.631,45 4.846,46 5.171,47 3.166,48 3.817,49 5.44,50 3.574,51 4.787,52 5.12,53 3.098,54 4.544}
{0 CHEMBL536278,1 1.475,2 -0.01,3 1.079,4 14.773,5 5.706,6 32.558,7 99.334,8 4.854,9 4.151,10 4.325,11 3.304,12 3.616,13 4.809,14 3.496,15 4.802,16 5.06,17 3.465,18 4.014,19 5.354,20 3.816,21 5.15,22 5.487,23 3.418,24 4.137,25 5.594,26 3.874,27 5.101,28 5.445,29 3.289,30 4.067,31 5.527,32 3.787,33 5.014,34 5.36,35 3.208,36 3.986,37 5.42,38 3.705,39 4.938,40 5.28,41 3.153,42 3.922,43 5.353,44 3.645,45 4.883,46 5.227,47 3.094,48 3.862,49 5.298,50 3.584,51 4.818,52 5.162,53 3.03,54 4.928}
{0 CHEMBL536279,1 1.454,2 -0.006,3 1.112,4 17.714,5 5.817,6 33.835,7 124.785,8 4.985,9 4.375,10 4.547,11 3.569,12 3.84,13 5.031,14 3.728,15 5.04,16 5.295,17 3.792,18 4.262,19 5.601,20 4.084,21 5.404,22 5.729,23 3.778,24 4.423,25 5.868,26 4.183,27 5.403,28 5.74,29 3.664,30 4.393,31 5.837,32 4.127,33 5.34,34 5.678,35 3.627,36 4.345,37 5.747,38 4.08,39 5.303,40 5.636,41 3.587,42 4.302,43 5.731,44 4.037,45 5.272,46 5.621,47 3.478,48 4.206,49 5.693,50 3.933,51 5.123,52 5.469,53 3.367,54 4.489}
{0 CHEMBL536499,1 1.43,2 -0.02,3 1.185,4 15.583,5 5.811,6 33.771,7 104.278,8 5.131,9 4.187,10 4.354,11 3.386,12 3.655,13 4.923,14 3.546,15 4.83,16 5.079,17 3.575,18 4.054,19 5.477,20 3.87,21 5.18,22 5.503,23 3.572,24 4.178,25 5.746,26 3.942,27 5.138,28 5.462,29 3.479,30 4.091,31 5.773,32 3.855,33 5.039,34 5.363,35 3.38,36 3.999,37 5.683,38 3.759,39 4.956,40 5.283,41 3.263,42 3.954,43 5.489,44 3.701,45 4.927,46 5.259,47 3.21,48 3.912,49 5.435,50 3.653,51 4.871,52 5.204,53 3.153,54 5.194}
{0 CHEMBL536730,1 1.476,2 0.003,3 1.194,4 14.783,5 5.09,6 25.908,7 99.358,8 5.153,9 4.142,10 4.309,11 3.346,12 3.608,13 4.883,14 3.501,15 4.784,16 5.033,17 3.541,18 4.003,19 5.444,20 3.821,21 5.135,22 5.459,23 3.5,24 4.121,25 5.701,26 3.885,27 5.081,28 5.41,29 3.421,30 4.045,31 5.672,32 3.803,33 4.981,34 5.3,35 3.36,36 3.955,37 5.635,38 3.726,39 4.906,40 5.22,41 3.278,42 3.898,43 5.568,44 3.662,45 4.867,46 5.196,47 3.158,48 3.848,49 5.407,50 3.594,51 4.805,52 5.138,53 3.093,54 4.299}
{0 CHEMBL536731,1 1.406,2 -0.051,3 1.134,4 14.682,5 5.927,6 35.123,7 100.11,8 4.947,9 4.144,10 4.322,11 3.32,12 3.579,13 4.858,14 3.467,15 4.787,16 5.052,17 3.495,18 3.973,19 5.354,20 3.792,21 5.114,22 5.441,23 3.461,24 4.126,25 5.612,26 3.881,27 5.124,28 5.465,29 3.307,30 4.089,31 5.576,32 3.806,33 5.045,34 5.4,35 3.211,36 3.978,37 5.446,38 3.695,39 4.902,40 5.241,41 3.157,42 3.887,43 5.349,44 3.619,45 4.866,46 5.21,47 3.098,48 3.834,49 5.31,50 3.563,51 4.8,52 5.144,53 3.034,54 5.187}
{0 CHEMBL536732,1 1.324,2 -0.061,3 1.146,4 18.935,5 8.007,6 64.12,7 135.664,8 5.116,9 4.444,10 4.607,11 3.66,12 3.927,13 5.144,14 3.817,15 5.112,16 5.361,17 3.909,18 4.358,19 5.709,20 4.186,21 5.47,22 5.775,23 3.931,24 4.546,25 6.01,26 4.318,27 5.527,28 5.849,29 3.814,30 4.521,31 6.078,32 4.263,33 5.459,34 5.797,35 3.737,36 4.418,37 5.976,38 4.163,39 5.325,40 5.643,41 3.726,42 4.363,43 5.849,44 4.125,45 5.335,46 5.654,47 3.691,48 4.345,49 5.873,50 4.099,51 5.309,52 5.645,53 3.617,54 4.697}
{0 CHEMBL536962,1 1.474,2 -0.011,3 1.091,4 13.25,5 4.794,6 22.979,7 90.132,8 4.872,9 4.056,10 4.231,11 3.214,12 3.517,13 4.72,14 3.398,15 4.704,16 4.963,17 3.377,18 3.913,19 5.262,20 3.717,21 5.049,22 5.386,23 3.324,24 4.032,25 5.499,26 3.772,27 4.994,28 5.339,29 3.182,30 3.955,31 5.425,32 3.675,33 4.896,34 5.244,35 3.091,36 3.863,37 5.305,38 3.583,39 4.811,40 5.154,41 3.029,42 3.791,43 5.229,44 3.515,45 4.749,46 5.093,47 2.961,48 3.722,49 5.167,50 3.446,51 4.674,52 5.019,53 2.888,54 4.439}
{0 CHEMBL536963,1 1.381,2 -0.058,3 1.167,4 16.929,5 6.559,6 43.023,7 121.167,8 5.168,9 4.337,10 4.5,11 3.561,12 3.822,13 5.043,14 3.716,15 5.001,16 5.246,17 3.806,18 4.254,19 5.615,20 4.081,21 5.37,22 5.681,23 3.838,24 4.43,25 5.91,26 4.206,27 5.387,28 5.699,29 3.759,30 4.41,31 5.965,32 4.17,33 5.362,34 5.689,35 3.665,36 4.333,37 5.912,38 4.082,39 5.27,40 5.608,41 3.553,42 4.211,43 5.791,44 3.958,45 5.117,46 5.449,47 3.487,48 4.082,49 5.693,50 3.848,51 4.995,52 5.302,53 3.44,54 5.066}
{0 CHEMBL537413,1 1.389,2 -0.053,3 1.153,4 18.3,5 7.472,6 55.825,7 130.369,8 5.132,9 4.41,10 4.573,11 3.626,12 3.897,13 5.108,14 3.787,15 5.075,16 5.32,17 3.864,18 4.327,19 5.68,20 4.151,21 5.445,22 5.757,23 3.878,24 4.497,25 5.977,26 4.266,27 5.459,28 5.778,29 3.773,30 4.458,31 6.019,32 4.206,33 5.399,34 5.732,35 3.705,36 4.372,37 5.933,38 4.122,39 5.297,40 5.617,41 3.693,42 4.328,43 5.822,44 4.09,45 5.294,46 5.613,47 3.657,48 4.304,49 5.839,50 4.06,51 5.267,52 5.602,53 3.556,54 5.18}
{0 CHEMBL537414,1 1.311,2 -0.066,3 1.159,4 17.552,5 7.095,6 50.34,7 126.462,8 5.149,9 4.374,10 4.536,11 3.598,12 3.855,13 5.081,14 3.748,15 5.041,16 5.29,17 3.853,18 4.287,19 5.645,20 4.119,21 5.397,22 5.7,23 3.894,24 4.482,25 5.946,26 4.262,27 5.46,28 5.775,29 3.801,30 4.476,31 6.027,32 4.229,33 5.424,34 5.757,35 3.698,36 4.381,37 5.955,38 4.124,39 5.298,40 5.634,41 3.614,42 4.255,43 5.813,44 4.008,45 5.168,46 5.492,47 3.565,48 4.162,49 5.746,50 3.931,51 5.102,52 5.413,53 3.501,54 5.222}
{0 CHEMBL537416,1 1.371,2 -0.06,3 1.078,4 15.44,5 6.593,6 43.465,7 112.339,8 4.94,9 4.267,10 4.435,11 3.457,12 3.749,13 4.907,14 3.633,15 4.937,16 5.19,17 3.684,18 4.185,19 5.474,20 4.002,21 5.303,22 5.622,23 3.69,24 4.368,25 5.737,26 4.123,27 5.331,28 5.661,29 3.586,30 4.353,31 5.74,32 4.081,33 5.302,34 5.647,35 3.509,36 4.267,37 5.703,38 3.987,39 5.195,40 5.545,41 3.387,42 4.13,43 5.607,44 3.854,45 5.034,46 5.38,47 3.264,48 3.995,49 5.451,50 3.726,51 4.912,52 5.246,53 3.193,54 4.676}
{0 CHEMBL537639,1 1.371,2 -0.054,3 1.276,4 18.897,5 5.493,6 30.169,7 122.374,8 5.391,9 4.335,10 4.499,11 3.578,12 3.782,13 5.147,14 3.689,15 4.972,16 5.219,17 3.773,18 4.18,19 5.685,20 4.015,21 5.314,22 5.626,23 3.799,24 4.336,25 5.921,26 4.121,27 5.327,28 5.64,29 3.741,30 4.3,31 5.993,32 4.079,33 5.28,34 5.604,35 3.666,36 4.229,37 5.945,38 4.001,39 5.182,40 5.503,41 3.606,42 4.179,43 5.78,44 3.95,45 5.156,46 5.472,47 3.552,48 4.112,49 5.846,50 3.891,51 5.065,52 5.381,53 3.471,54 5.066}
{0 CHEMBL537856,1 1.404,2 -0.042,3 1.211,4 17.556,5 5.518,6 30.451,7 117.522,8 5.159,9 4.304,10 4.475,11 3.506,12 3.753,13 5.067,14 3.649,15 4.944,16 5.197,17 3.708,18 4.156,19 5.599,20 3.98,21 5.291,22 5.609,23 3.739,24 4.306,25 5.873,26 4.082,27 5.294,28 5.613,29 3.671,30 4.268,31 5.922,32 4.036,33 5.244,34 5.572,35 3.566,36 4.193,37 5.878,38 3.95,39 5.155,40 5.489,41 3.461,42 4.118,43 5.707,44 3.866,45 5.076,46 5.405,47 3.413,48 4.035,49 5.665,50 3.795,51 4.994,52 5.316,53 3.377,54 4.735}
{0 CHEMBL541384,1 1.441,2 -0.027,3 1.194,4 14.696,5 4.864,6 23.659,7 99.48,8 5.153,9 4.142,10 4.309,11 3.346,12 3.608,13 4.903,14 3.501,15 4.784,16 5.033,17 3.565,18 4.01,19 5.438,20 3.833,21 5.136,22 5.454,23 3.569,24 4.147,25 5.746,26 3.922,27 5.122,28 5.443,29 3.445,30 4.082,31 5.778,32 3.841,33 5.02,34 5.35,35 3.318,36 3.973,37 5.622,38 3.727,39 4.898,40 5.22,41 3.266,42 3.897,43 5.542,44 3.652,45 4.863,46 5.188,47 3.162,48 3.846,49 5.445,50 3.595,51 4.805,52 5.138,53 3.093,54 4.593}
{0 CHEMBL541892,1 1.405,2 -0.041,3 1.11,4 17.577,5 5.991,6 35.892,7 117.396,8 4.903,9 4.312,10 4.488,11 3.471,12 3.761,13 5.006,14 3.644,15 4.959,16 5.22,17 3.644,18 4.166,19 5.525,20 3.976,21 5.304,22 5.633,23 3.647,24 4.322,25 5.772,26 4.071,27 5.318,28 5.657,29 3.561,30 4.291,31 5.766,32 4.021,33 5.267,34 5.615,35 3.474,36 4.211,37 5.733,38 3.938,39 5.167,40 5.511,41 3.379,42 4.132,43 5.616,44 3.856,45 5.096,46 5.442,47 3.319,48 4.054,49 5.53,50 3.782,51 5.016,52 5.357,53 3.272,54 4.75}
{0 CHEMBL558775,1 1.371,2 -0.063,3 1.183,4 15.346,5 5.647,6 31.886,7 111.965,8 5.21,9 4.259,10 4.421,11 3.493,12 3.742,13 4.973,14 3.638,15 4.922,16 5.166,17 3.745,18 4.175,19 5.545,20 4.007,21 5.289,22 5.598,23 3.778,24 4.353,25 5.842,26 4.134,27 5.308,28 5.617,29 3.694,30 4.332,31 5.9,32 4.095,33 5.281,34 5.607,35 3.593,36 4.248,37 5.843,38 4,39 5.18,40 5.518,41 3.472,42 4.115,43 5.713,44 3.865,45 5.012,46 5.343,47 3.399,48 3.972,49 5.607,50 3.743,51 4.876,52 5.178,53 3.348,54 4.754}
{0 CHEMBL559365,1 1.389,2 -0.051,3 1.06,4 18.552,5 8.418,6 70.856,7 130.743,8 4.902,9 4.417,10 4.585,11 3.594,12 3.903,13 5.051,14 3.783,15 5.088,16 5.34,17 3.81,18 4.335,19 5.618,20 4.146,21 5.456,22 5.778,23 3.817,24 4.514,25 5.884,26 4.264,27 5.481,28 5.812,29 3.727,30 4.501,31 5.886,32 4.227,33 5.456,34 5.8,35 3.66,36 4.427,37 5.854,38 4.147,39 5.364,40 5.713,41 3.557,42 4.312,43 5.772,44 4.034,45 5.23,46 5.575,47 3.454,48 4.201,49 5.642,50 3.929,51 5.131,52 5.466,53 3.395,54 4.447}
{0 CHEMBL559378,1 1.49,2 -0.017,3 1.134,4 14.773,5 5.668,6 32.126,7 98.528,8 4.947,9 4.144,10 4.322,11 3.32,12 3.579,13 4.828,14 3.467,15 4.787,16 5.051,17 3.474,18 3.962,19 5.358,20 3.776,21 5.115,22 5.453,23 3.423,24 4.082,25 5.583,26 3.833,27 5.059,28 5.4,29 3.289,30 4.027,31 5.499,32 3.756,33 4.992,34 5.338,35 3.211,36 3.958,37 5.411,38 3.684,39 4.922,40 5.264,41 3.157,42 3.896,43 5.347,44 3.625,45 4.866,46 5.21,47 3.098,48 3.834,49 5.292,50 3.563,51 4.8,52 5.144,53 3.034,54 4.799}
